maven-notifications mailing list archives

Site index · List index
Message view « Date » · « Thread »
Top « Date » · « Thread »
From Apache Jenkins Server <jenk...@builds.apache.org>
Subject Build failed in Jenkins: maven-plugins-ITs-m2 #729
Date Wed, 05 Sep 2012 07:24:47 GMT
See <https://builds.apache.org/job/maven-plugins-ITs-m2/729/changes>

Changes:

[olamy] minor doc change

[hboutemy] try to fix ITs on ASF Jenkins instance: choose a m-resources-p version that is
available in repository (not trying to understand why this one is missing and if it should
be here)
see https://builds.apache.org/view/M-R/view/Maven/job/maven-plugins-ITs-m2/ws/.repository/org/apache/maven/plugins/maven-resources-plugin/

------------------------------------------
[...truncated 2850 lines...]
-------------------------------------------------------

Results :

Tests run: 0, Failures: 0, Errors: 0, Skipped: 0

[INFO] ------------------------------------------------------------------------
[INFO] Building Maven Plugins Aggregator
[INFO]    task-segment: [clean, install]
[INFO] ------------------------------------------------------------------------
[INFO] [clean:clean {execution: default-clean}]
[INFO] Deleting /x1/jenkins/jenkins-slave/workspace/maven-plugins-ITs-m2/target
[INFO] [remote-resources:process {execution: default}]
[INFO] [site:attach-descriptor {execution: default-attach-descriptor}]
[INFO] [install:install {execution: default-install}]
[INFO] Installing /x1/jenkins/jenkins-slave/workspace/maven-plugins-ITs-m2/pom.xml to <https://builds.apache.org/job/maven-plugins-ITs-m2/ws/.repository/org/apache/maven/plugins/maven-plugins-aggregator/1-SNAPSHOT/maven-plugins-aggregator-1-SNAPSHOT.pom>
[INFO] 
[INFO] 
[INFO] ------------------------------------------------------------------------
[INFO] Reactor Summary:
[INFO] ------------------------------------------------------------------------
[INFO] Maven Plugins ......................................... SUCCESS [11.451s]
[INFO] Maven ACR Plugin ...................................... FAILED [23.287s]
[INFO] Maven Ant Plugin ...................................... SUCCESS [59.603s]
[INFO] Maven AntRun Plugin ................................... SUCCESS [41.334s]
[INFO] Maven Eclipse Plugin .................................. FAILED [6:53.200s]
[INFO] Maven Assembly Plugin ................................. FAILED [24.183s]
[INFO] Maven Changelog Plugin ................................ FAILED [4.502s]
[INFO] Maven Compiler Plugin ................................. FAILED [5.501s]
[INFO] Maven Changes Report Plugin ........................... SKIPPED (dependency build failed
or was skipped)
[INFO] Maven Checkstyle Plugin ............................... FAILED [4.088s]
[INFO] Maven Clean Plugin .................................... FAILED [1.432s]
[INFO] Maven Dependency Plugin ............................... FAILED [6.087s]
[INFO] Maven Deploy Plugin ................................... FAILED [5.211s]
[INFO] Maven DOAP Plugin ..................................... FAILED [4.476s]
[INFO] Maven Documentation Checker Plugin .................... FAILED [2.015s]
[INFO] Maven EAR Plugin ...................................... FAILED [11.490s]
[INFO] Maven EJB Plugin ...................................... FAILED [2.522s]
[INFO] Maven GPG Plugin ...................................... FAILED [0.915s]
[INFO] Maven Help Plugin ..................................... FAILED [1.744s]
[INFO] Maven IDEA Plugin ..................................... FAILED [5.441s]
[INFO] Maven Install Plugin .................................. FAILED [2.634s]
[INFO] Maven JAR Plugin ...................................... FAILED [3.473s]
[INFO] Maven Jarsigner Plugin ................................ FAILED [1.766s]
[INFO] Maven Javadoc Plugin .................................. FAILED [17.941s]
[INFO] Maven Linkcheck Plugin ................................ FAILED [2.728s]
[INFO] Maven One Plugin ...................................... FAILED [3.607s]
[INFO] Maven Patch Plugin .................................... FAILED [0.715s]
[INFO] Maven PDF Plugin ...................................... FAILED [7.381s]
[INFO] Maven PMD Plugin ...................................... FAILED [8.917s]
[INFO] Maven RAR Plugin ...................................... FAILED [2.880s]
[INFO] Maven Reactor Plugin .................................. FAILED [2.431s]
[INFO] Maven Repository Plugin ............................... FAILED [3.167s]
[INFO] Maven Resources Plugin ................................ SKIPPED (dependency build failed
or was skipped)
[INFO] Maven Site Plugin 3 ................................... FAILED [12.199s]
[INFO] Maven Source Plugin ................................... FAILED [1.882s]
[INFO] Maven Stage Plugin .................................... FAILED [1.622s]
[INFO] Maven Toolchains Plugin ............................... FAILED [1.168s]
[INFO] Maven Verifier Plugin ................................. FAILED [1.080s]
[INFO] Maven WAR Plugin ...................................... FAILED [2.441s]
[INFO] SCM Publish Maven Plugin .............................. FAILED [16.502s]
[INFO] Maven Plugins Aggregator .............................. SUCCESS [1.490s]
[INFO] ------------------------------------------------------------------------
[INFO] Error for project: Maven ACR Plugin (during install)
[INFO] ------------------------------------------------------------------------
[INFO] 1 build failed. See console output above for details.
[INFO] ------------------------------------------------------------------------
[INFO] Error for project: Maven Eclipse Plugin (during install)
[INFO] ------------------------------------------------------------------------
[INFO] There are test failures.

Please refer to /x1/jenkins/jenkins-slave/workspace/maven-plugins-ITs-m2/maven-eclipse-plugin/target/failsafe-reports
for the individual test results.
[INFO] ------------------------------------------------------------------------
[INFO] Error for project: Maven Assembly Plugin (during install)
[INFO] ------------------------------------------------------------------------
[INFO] Error assembling JAR

Embedded error: Failed to read filesystem attributes for: /x1/jenkins/jenkins-slave/workspace/maven-plugins-ITs-m2/maven-assembly-plugin/pom.xml
java.io.IOException: Cannot allocate memory
[INFO] ------------------------------------------------------------------------
[INFO] Error for project: Maven Changelog Plugin (during install)
[INFO] ------------------------------------------------------------------------
[INFO] Error while executing forked tests.; nested exception is java.io.IOException: java.io.IOException:
Cannot allocate memory

[INFO] ------------------------------------------------------------------------
[INFO] Error for project: Maven Compiler Plugin (during install)
[INFO] ------------------------------------------------------------------------
[INFO] Error while executing forked tests.; nested exception is java.io.IOException: java.io.IOException:
Cannot allocate memory

[INFO] ------------------------------------------------------------------------
[INFO] Error for project: Maven Checkstyle Plugin (during install)
[INFO] ------------------------------------------------------------------------
[INFO] Error while executing forked tests.; nested exception is java.io.IOException: java.io.IOException:
Cannot allocate memory

[INFO] ------------------------------------------------------------------------
[INFO] Error for project: Maven Clean Plugin (during install)
[INFO] ------------------------------------------------------------------------
[INFO] Error while executing forked tests.; nested exception is java.io.IOException: java.io.IOException:
Cannot allocate memory

[INFO] ------------------------------------------------------------------------
[INFO] Error for project: Maven Dependency Plugin (during install)
[INFO] ------------------------------------------------------------------------
[INFO] Error while executing forked tests.; nested exception is java.io.IOException: java.io.IOException:
Cannot allocate memory

[INFO] ------------------------------------------------------------------------
[INFO] Error for project: Maven Deploy Plugin (during install)
[INFO] ------------------------------------------------------------------------
[INFO] Error while executing forked tests.; nested exception is java.io.IOException: java.io.IOException:
Cannot allocate memory

[INFO] ------------------------------------------------------------------------
[INFO] Error for project: Maven DOAP Plugin (during install)
[INFO] ------------------------------------------------------------------------
[INFO] Error while executing forked tests.; nested exception is java.io.IOException: java.io.IOException:
Cannot allocate memory

[INFO] ------------------------------------------------------------------------
[INFO] Error for project: Maven Documentation Checker Plugin (during install)
[INFO] ------------------------------------------------------------------------
[INFO] Error while executing forked tests.; nested exception is java.io.IOException: java.io.IOException:
Cannot allocate memory

[INFO] ------------------------------------------------------------------------
[INFO] Error for project: Maven EAR Plugin (during install)
[INFO] ------------------------------------------------------------------------
[INFO] Error while executing forked tests.; nested exception is java.io.IOException: java.io.IOException:
Cannot allocate memory

[INFO] ------------------------------------------------------------------------
[INFO] Error for project: Maven EJB Plugin (during install)
[INFO] ------------------------------------------------------------------------
[INFO] Error while executing forked tests.; nested exception is java.io.IOException: java.io.IOException:
Cannot allocate memory

[INFO] ------------------------------------------------------------------------
[INFO] Error for project: Maven GPG Plugin (during install)
[INFO] ------------------------------------------------------------------------
[INFO] Error while executing forked tests.; nested exception is java.io.IOException: java.io.IOException:
Cannot allocate memory

[INFO] ------------------------------------------------------------------------
[INFO] Error for project: Maven Help Plugin (during install)
[INFO] ------------------------------------------------------------------------
[INFO] Error while executing forked tests.; nested exception is java.io.IOException: java.io.IOException:
Cannot allocate memory

[INFO] ------------------------------------------------------------------------
[INFO] Error for project: Maven IDEA Plugin (during install)
[INFO] ------------------------------------------------------------------------
[INFO] Error while executing forked tests.; nested exception is java.io.IOException: java.io.IOException:
Cannot allocate memory

[INFO] ------------------------------------------------------------------------
[INFO] Error for project: Maven Install Plugin (during install)
[INFO] ------------------------------------------------------------------------
[INFO] Error while executing forked tests.; nested exception is java.io.IOException: java.io.IOException:
Cannot allocate memory

[INFO] ------------------------------------------------------------------------
[INFO] Error for project: Maven JAR Plugin (during install)
[INFO] ------------------------------------------------------------------------
[INFO] Error while executing forked tests.; nested exception is java.io.IOException: java.io.IOException:
Cannot allocate memory

[INFO] ------------------------------------------------------------------------
[INFO] Error for project: Maven Jarsigner Plugin (during install)
[INFO] ------------------------------------------------------------------------
[INFO] Error while executing forked tests.; nested exception is java.io.IOException: java.io.IOException:
Cannot allocate memory

[INFO] ------------------------------------------------------------------------
[INFO] Error for project: Maven Javadoc Plugin (during install)
[INFO] ------------------------------------------------------------------------
[INFO] Error while executing forked tests.; nested exception is java.io.IOException: java.io.IOException:
Cannot allocate memory

[INFO] ------------------------------------------------------------------------
[INFO] Error for project: Maven Linkcheck Plugin (during install)
[INFO] ------------------------------------------------------------------------
[INFO] Error while executing forked tests.; nested exception is java.io.IOException: java.io.IOException:
Cannot allocate memory

[INFO] ------------------------------------------------------------------------
[INFO] Error for project: Maven One Plugin (during install)
[INFO] ------------------------------------------------------------------------
[INFO] Error while executing forked tests.; nested exception is java.io.IOException: java.io.IOException:
Cannot allocate memory

[INFO] ------------------------------------------------------------------------
[INFO] Error for project: Maven Patch Plugin (during install)
[INFO] ------------------------------------------------------------------------
[INFO] Error while executing forked tests.; nested exception is java.io.IOException: java.io.IOException:
Cannot allocate memory

[INFO] ------------------------------------------------------------------------
[INFO] Error for project: Maven PDF Plugin (during install)
[INFO] ------------------------------------------------------------------------
[INFO] Error while executing forked tests.; nested exception is java.io.IOException: java.io.IOException:
Cannot allocate memory

[INFO] ------------------------------------------------------------------------
[INFO] Error for project: Maven PMD Plugin (during install)
[INFO] ------------------------------------------------------------------------
[INFO] Error while executing forked tests.; nested exception is java.io.IOException: java.io.IOException:
Cannot allocate memory

[INFO] ------------------------------------------------------------------------
[INFO] Error for project: Maven RAR Plugin (during install)
[INFO] ------------------------------------------------------------------------
[INFO] Error while executing forked tests.; nested exception is java.io.IOException: java.io.IOException:
Cannot allocate memory

[INFO] ------------------------------------------------------------------------
[INFO] Error for project: Maven Reactor Plugin (during install)
[INFO] ------------------------------------------------------------------------
[INFO] Error while executing forked tests.; nested exception is java.io.IOException: java.io.IOException:
Cannot allocate memory

[INFO] ------------------------------------------------------------------------
[INFO] Error for project: Maven Repository Plugin (during install)
[INFO] ------------------------------------------------------------------------
[INFO] Error while executing forked tests.; nested exception is java.io.IOException: java.io.IOException:
Cannot allocate memory

[INFO] ------------------------------------------------------------------------
[INFO] Error for project: Maven Site Plugin 3 (during install)
[INFO] ------------------------------------------------------------------------
[INFO] Error while executing forked tests.; nested exception is java.io.IOException: java.io.IOException:
Cannot allocate memory

[INFO] ------------------------------------------------------------------------
[INFO] Error for project: Maven Source Plugin (during install)
[INFO] ------------------------------------------------------------------------
[INFO] Error while executing forked tests.; nested exception is java.io.IOException: java.io.IOException:
Cannot allocate memory

[INFO] ------------------------------------------------------------------------
[INFO] Error for project: Maven Stage Plugin (during install)
[INFO] ------------------------------------------------------------------------
[INFO] Error while executing forked tests.; nested exception is java.io.IOException: java.io.IOException:
Cannot allocate memory

[INFO] ------------------------------------------------------------------------
[INFO] Error for project: Maven Toolchains Plugin (during install)
[INFO] ------------------------------------------------------------------------
[INFO] Error while executing forked tests.; nested exception is java.io.IOException: java.io.IOException:
Cannot allocate memory

[INFO] ------------------------------------------------------------------------
[INFO] Error for project: Maven Verifier Plugin (during install)
[INFO] ------------------------------------------------------------------------
[INFO] Error while executing forked tests.; nested exception is java.io.IOException: java.io.IOException:
Cannot allocate memory

[INFO] ------------------------------------------------------------------------
[INFO] Error for project: Maven WAR Plugin (during install)
[INFO] ------------------------------------------------------------------------
[INFO] Error while executing forked tests.; nested exception is java.io.IOException: java.io.IOException:
Cannot allocate memory

[INFO] ------------------------------------------------------------------------
[INFO] Error for project: SCM Publish Maven Plugin (during install)
[INFO] ------------------------------------------------------------------------
[INFO] Error while executing forked tests.; nested exception is java.io.IOException: java.io.IOException:
Cannot allocate memory

[INFO] ------------------------------------------------------------------------
[INFO] For more information, run Maven with the -e switch
[INFO] ------------------------------------------------------------------------
[INFO] BUILD ERRORS
[INFO] ------------------------------------------------------------------------
[INFO] Total time: 12 minutes 6 seconds
[INFO] Finished at: Wed Sep 05 07:24:45 GMT 2012
[INFO] Final Memory: 290M/1018M
[INFO] ------------------------------------------------------------------------
Build step 'Invoke top-level Maven targets' marked build as failure

Mime
View raw message