maven-notifications mailing list archives

Site index · List index
Message view « Date » · « Thread »
Top « Date » · « Thread »
From Apache Jenkins Server <jenk...@builds.apache.org>
Subject Build failed in Jenkins: maven-plugins-ITs-m2 #718
Date Mon, 03 Sep 2012 02:49:54 GMT
See <https://builds.apache.org/job/maven-plugins-ITs-m2/718/changes>

Changes:

[bimargulies] [maven-release-plugin] prepare for next development iteration

[bimargulies] [maven-release-plugin] prepare release maven-shade-plugin-2.0

[bimargulies] Put version back to 2.0, make it compile?

[hboutemy] added a note about MSITE-652, which will not require disabling skipDeploy for staging

------------------------------------------
[...truncated 10565 lines...]
[INFO] Building: MWAR-143/pom.xml
[INFO] ..FAILED (0.0 s)
[INFO]   The Maven invocation failed. Error while executing process.
[INFO] Building: MWAR-131/pom.xml
[INFO] ..FAILED (0.0 s)
[INFO]   The Maven invocation failed. Error while executing process.
[INFO] Building: overlay-excludes/pom.xml
[INFO] ..FAILED (0.0 s)
[INFO]   The Maven invocation failed. Error while executing process.
[INFO] Building: scoped-dependency-same-artifact/pom.xml
[INFO] ..FAILED (0.0 s)
[INFO]   The Maven invocation failed. Error while executing process.
[INFO] [invoker:verify {execution: integration-test}]
[INFO] -------------------------------------------------
[INFO] Build Summary:
[INFO]   Passed: 1, Failed: 1, Errors: 13, Skipped: 0
[INFO] -------------------------------------------------
[ERROR] The following builds failed:
[ERROR] *  web-resources-filtering/pom.xml
[INFO] -------------------------------------------------
[INFO] ------------------------------------------------------------------------
[INFO] Building SCM Publish Maven Plugin
[INFO]    task-segment: [clean, install]
[INFO] ------------------------------------------------------------------------
[INFO] [clean:clean {execution: default-clean}]
Downloading: http://repo1.maven.org/maven2/org/apache/maven/release/maven-release-manager/2.3.2/maven-release-manager-2.3.2.pom
9K downloaded  (maven-release-manager-2.3.2.pom)
Downloading: http://repo1.maven.org/maven2/org/apache/maven/release/maven-release/2.3.2/maven-release-2.3.2.pom
8K downloaded  (maven-release-2.3.2.pom)
Downloading: http://repo1.maven.org/maven2/org/apache/maven/scm/maven-scm-providers-standard/1.7/maven-scm-providers-standard-1.7.pom
3K downloaded  (maven-scm-providers-standard-1.7.pom)
Downloading: http://repo1.maven.org/maven2/org/apache/maven/scm/maven-scm-provider-accurev/1.7/maven-scm-provider-accurev-1.7.pom
3K downloaded  (maven-scm-provider-accurev-1.7.pom)
Downloading: http://repo1.maven.org/maven2/org/apache/maven/scm/maven-scm-provider-tfs/1.7/maven-scm-provider-tfs-1.7.pom
2K downloaded  (maven-scm-provider-tfs-1.7.pom)
Downloading: http://repo1.maven.org/maven2/org/apache/maven/scm/maven-scm-provider-integrity/1.7/maven-scm-provider-integrity-1.7.pom
4K downloaded  (maven-scm-provider-integrity-1.7.pom)
Downloading: http://repo1.maven.org/maven2/com/mks/api/mksapi-jar/4.10.9049/mksapi-jar-4.10.9049.pom
1K downloaded  (mksapi-jar-4.10.9049.pom)
Downloading: http://repo1.maven.org/maven2/org/codehaus/groovy/groovy-all/1.7.6/groovy-all-1.7.6.pom
26K downloaded  (groovy-all-1.7.6.pom)
Downloading: http://repo1.maven.org/maven2/jaxen/jaxen/1.1-beta-8/jaxen-1.1-beta-8.pom
6K downloaded  (jaxen-1.1-beta-8.pom)
Downloading: http://repo1.maven.org/maven2/org/apache/maven/scm/maven-scm-provider-svntest/1.7/maven-scm-provider-svntest-1.7.pom
1K downloaded  (maven-scm-provider-svntest-1.7.pom)
Downloading: http://repo1.maven.org/maven2/org/apache/maven/scm/maven-scm-test/1.7/maven-scm-test-1.7.pom
1K downloaded  (maven-scm-test-1.7.pom)
Downloading: http://repo1.maven.org/maven2/org/codehaus/jackson/jackson-core-asl/1.9.4/jackson-core-asl-1.9.4.pom
1016b downloaded  (jackson-core-asl-1.9.4.pom)
Downloading: http://repo1.maven.org/maven2/org/codehaus/jackson/jackson-mapper-asl/1.9.4/jackson-mapper-asl-1.9.4.pom
1K downloaded  (jackson-mapper-asl-1.9.4.pom)
Downloading: http://repo1.maven.org/maven2/junit/junit/4.8/junit-4.8.pom
1K downloaded  (junit-4.8.pom)
Downloading: http://repo1.maven.org/maven2/junit/junit/4.8/junit-4.8.jar
Downloading: http://repo1.maven.org/maven2/com/mks/api/mksapi-jar/4.10.9049/mksapi-jar-4.10.9049.jar
Downloading: http://repo1.maven.org/maven2/org/codehaus/groovy/groovy-all/1.7.6/groovy-all-1.7.6.jar
Downloading: http://repo1.maven.org/maven2/commons-io/commons-io/2.0.1/commons-io-2.0.1.jar
Downloading: http://repo1.maven.org/maven2/org/apache/maven/release/maven-release-manager/2.3.2/maven-release-manager-2.3.2.jar
231K downloaded  (junit-4.8.jar)
Downloading: http://repo1.maven.org/maven2/jaxen/jaxen/1.1-beta-8/jaxen-1.1-beta-8.jar
155K downloaded  (commons-io-2.0.1.jar)
Downloading: http://repo1.maven.org/maven2/org/codehaus/jackson/jackson-core-asl/1.9.4/jackson-core-asl-1.9.4.jar
180K downloaded  (maven-release-manager-2.3.2.jar)
222K downloaded  (jackson-core-asl-1.9.4.jar)
629K downloaded  (mksapi-jar-4.10.9049.jar)
Downloading: http://repo1.maven.org/maven2/org/apache/maven/scm/maven-scm-provider-accurev/1.7/maven-scm-provider-accurev-1.7.jar
Downloading: http://repo1.maven.org/maven2/org/codehaus/jackson/jackson-mapper-asl/1.9.4/jackson-mapper-asl-1.9.4.jar
759K downloaded  (jackson-mapper-asl-1.9.4.jar)
90K downloaded  (maven-scm-provider-accurev-1.7.jar)
226K downloaded  (jaxen-1.1-beta-8.jar)
5526K downloaded  (groovy-all-1.7.6.jar)
Downloading: http://repo1.maven.org/maven2/org/apache/maven/scm/maven-scm-provider-tfs/1.7/maven-scm-provider-tfs-1.7.jar
40K downloaded  (maven-scm-provider-tfs-1.7.jar)
Downloading: http://repo1.maven.org/maven2/org/apache/maven/scm/maven-scm-provider-integrity/1.7/maven-scm-provider-integrity-1.7.jar
75K downloaded  (maven-scm-provider-integrity-1.7.jar)
Downloading: http://repo1.maven.org/maven2/org/apache/maven/scm/maven-scm-provider-svntest/1.7/maven-scm-provider-svntest-1.7.jar
22K downloaded  (maven-scm-provider-svntest-1.7.jar)
Downloading: http://repo1.maven.org/maven2/org/apache/maven/scm/maven-scm-test/1.7/maven-scm-test-1.7.jar
46K downloaded  (maven-scm-test-1.7.jar)
[INFO] [enforcer:enforce {execution: ensure-no-container-api}]
[INFO] [plugin:helpmojo {execution: generated-helpmojo}]
[INFO] Using 'UTF-8' encoding to read mojo metadata.
[INFO] Applying mojo extractor for language: java
[INFO] Mojo extractor for language: java found 1 mojo descriptors.
[INFO] Applying mojo extractor for language: bsh
[INFO] Mojo extractor for language: bsh found 0 mojo descriptors.
[INFO] Applying mojo extractor for language: java-annotations
[INFO] Mojo extractor for language: java-annotations found 0 mojo descriptors.
[INFO] [plugin:descriptor {execution: default-descriptor}]
[INFO] Using 'UTF-8' encoding to read mojo metadata.
[INFO] Applying mojo extractor for language: java
[INFO] Mojo extractor for language: java found 2 mojo descriptors.
[INFO] Applying mojo extractor for language: bsh
[INFO] Mojo extractor for language: bsh found 0 mojo descriptors.
[INFO] Applying mojo extractor for language: java-annotations
[INFO] Mojo extractor for language: java-annotations found 0 mojo descriptors.
[INFO] [remote-resources:process {execution: default}]
[debug] execute contextualize
[INFO] [resources:resources {execution: default-resources}]
[INFO] Using 'UTF-8' encoding to copy filtered resources.
[INFO] Copying 2 resources
[INFO] Copying 3 resources
[INFO] [compiler:compile {execution: default-compile}]
[INFO] Compiling 7 source files to /x1/jenkins/jenkins-slave/workspace/maven-plugins-ITs-m2/maven-scm-publish-plugin/target/classes
[INFO] [plugin:descriptor {execution: mojo-descriptor}]
[INFO] Using 'UTF-8' encoding to read mojo metadata.
[INFO] Applying mojo extractor for language: java
[INFO] Mojo extractor for language: java found 2 mojo descriptors.
[INFO] Applying mojo extractor for language: bsh
[INFO] Mojo extractor for language: bsh found 0 mojo descriptors.
[INFO] Applying mojo extractor for language: java-annotations
[INFO] Mojo extractor for language: java-annotations found 3 mojo descriptors.
[debug] execute contextualize
[INFO] [resources:testResources {execution: default-testResources}]
[INFO] Using 'UTF-8' encoding to copy filtered resources.
[INFO] skip non existing resourceDirectory /x1/jenkins/jenkins-slave/workspace/maven-plugins-ITs-m2/maven-scm-publish-plugin/src/test/resources
[INFO] Copying 3 resources
[INFO] [compiler:testCompile {execution: default-testCompile}]
[INFO] No sources to compile
[INFO] [surefire:test {execution: default-test}]
[INFO] Surefire report directory: /x1/jenkins/jenkins-slave/workspace/maven-plugins-ITs-m2/maven-scm-publish-plugin/target/surefire-reports

-------------------------------------------------------
 T E S T S
-------------------------------------------------------

Results :

Tests run: 0, Failures: 0, Errors: 0, Skipped: 0

[INFO] [jar:jar {execution: default-jar}]
[INFO] Building jar: /x1/jenkins/jenkins-slave/workspace/maven-plugins-ITs-m2/maven-scm-publish-plugin/target/maven-scm-publish-plugin-1.0-SNAPSHOT.jar
[INFO] [plugin:addPluginArtifactMetadata {execution: default-addPluginArtifactMetadata}]
[INFO] [invoker:install {execution: integration-test}]
[INFO] Installing /x1/jenkins/jenkins-slave/workspace/maven-plugins-ITs-m2/maven-scm-publish-plugin/pom.xml
to /x1/jenkins/jenkins-slave/workspace/maven-plugins-ITs-m2/maven-scm-publish-plugin/target/local-repo/org/apache/maven/plugins/maven-scm-publish-plugin/1.0-SNAPSHOT/maven-scm-publish-plugin-1.0-SNAPSHOT.pom
[INFO] Installing /x1/jenkins/jenkins-slave/workspace/maven-plugins-ITs-m2/maven-scm-publish-plugin/target/maven-scm-publish-plugin-1.0-SNAPSHOT.jar
to /x1/jenkins/jenkins-slave/workspace/maven-plugins-ITs-m2/maven-scm-publish-plugin/target/local-repo/org/apache/maven/plugins/maven-scm-publish-plugin/1.0-SNAPSHOT/maven-scm-publish-plugin-1.0-SNAPSHOT.jar
[INFO] [invoker:integration-test {execution: integration-test}]
[INFO] Building: 006-site-multi-module/pom.xml
[INFO] ..ERROR (0.5 s)
[INFO]   The pre-build script did not succeed. Error while executing process.
[INFO] Building: 005-site-lifecycle/pom.xml
[INFO] ..ERROR (0.0 s)
[INFO]   The pre-build script did not succeed. Error while executing process.
[INFO] Building: 004-publish-scm/pom.xml
[INFO] ..ERROR (0.1 s)
[INFO]   The pre-build script did not succeed. Error while executing process.
[INFO] Building: 003-lifecycle/pom.xml
[INFO] ..ERROR (0.0 s)
[INFO]   The pre-build script did not succeed. Error while executing process.
[INFO] Building: 002-perform/pom.xml
[INFO] ..ERROR (0.0 s)
[INFO]   The pre-build script did not succeed. Error while executing process.
[INFO] Building: 001-prepare/pom.xml
[INFO] ..ERROR (0.0 s)
[INFO]   The pre-build script did not succeed. Error while executing process.
[INFO] [invoker:verify {execution: integration-test}]
[INFO] -------------------------------------------------
[INFO] Build Summary:
[INFO]   Passed: 0, Failed: 0, Errors: 6, Skipped: 0
[INFO] -------------------------------------------------
[INFO] ------------------------------------------------------------------------
[INFO] Building Maven Plugins Aggregator
[INFO]    task-segment: [clean, install]
[INFO] ------------------------------------------------------------------------
[INFO] [clean:clean {execution: default-clean}]
[INFO] Deleting /x1/jenkins/jenkins-slave/workspace/maven-plugins-ITs-m2/target
[INFO] [remote-resources:process {execution: default}]
[INFO] [site:attach-descriptor {execution: default-attach-descriptor}]
[INFO] [install:install {execution: default-install}]
[INFO] Installing /x1/jenkins/jenkins-slave/workspace/maven-plugins-ITs-m2/pom.xml to <https://builds.apache.org/job/maven-plugins-ITs-m2/ws/.repository/org/apache/maven/plugins/maven-plugins-aggregator/1-SNAPSHOT/maven-plugins-aggregator-1-SNAPSHOT.pom>
[INFO] 
[INFO] 
[INFO] ------------------------------------------------------------------------
[INFO] Reactor Summary:
[INFO] ------------------------------------------------------------------------
[INFO] Maven Plugins ......................................... SUCCESS [7.914s]
[INFO] Maven ACR Plugin ...................................... SUCCESS [23.448s]
[INFO] Maven Ant Plugin ...................................... SUCCESS [1:02.322s]
[INFO] Maven AntRun Plugin ................................... SUCCESS [39.793s]
[INFO] Maven Eclipse Plugin .................................. SUCCESS [5:39.808s]
[INFO] Maven Assembly Plugin ................................. SUCCESS [9:09.477s]
[INFO] Maven Changelog Plugin ................................ SUCCESS [38.161s]
[INFO] Maven Compiler Plugin ................................. SUCCESS [28.127s]
[INFO] Maven Changes Report Plugin ........................... SUCCESS [55.729s]
[INFO] Maven Checkstyle Plugin ............................... SUCCESS [1:18.015s]
[INFO] Maven Clean Plugin .................................... SUCCESS [12.226s]
[INFO] Maven Dependency Plugin ............................... SUCCESS [1:58.294s]
[INFO] Maven Deploy Plugin ................................... SUCCESS [57.593s]
[INFO] Maven DOAP Plugin ..................................... SUCCESS [16.949s]
[INFO] Maven Documentation Checker Plugin .................... SUCCESS [9.095s]
[INFO] Maven EAR Plugin ...................................... SUCCESS [3:07.559s]
[INFO] Maven EJB Plugin ...................................... SUCCESS [23.264s]
[INFO] Maven GPG Plugin ...................................... SUCCESS [8.670s]
[INFO] Maven Help Plugin ..................................... SUCCESS [26.465s]
[INFO] Maven IDEA Plugin ..................................... SUCCESS [10.429s]
[INFO] Maven Install Plugin .................................. SUCCESS [33.789s]
[INFO] Maven JAR Plugin ...................................... SUCCESS [53.714s]
[INFO] Maven Jarsigner Plugin ................................ SUCCESS [20.117s]
[INFO] Maven Javadoc Plugin .................................. SUCCESS [4:27.707s]
[INFO] Maven Linkcheck Plugin ................................ SUCCESS [3.055s]
[INFO] Maven One Plugin ...................................... SUCCESS [2.212s]
[INFO] Maven Patch Plugin .................................... SUCCESS [9.216s]
[INFO] Maven PDF Plugin ...................................... SUCCESS [2:37.522s]
[INFO] Maven PMD Plugin ...................................... SUCCESS [35.804s]
[INFO] Maven RAR Plugin ...................................... SUCCESS [7.165s]
[INFO] Maven Reactor Plugin .................................. SUCCESS [2.270s]
[INFO] Maven Repository Plugin ............................... FAILED [24.273s]
[INFO] Maven Resources Plugin ................................ FAILED [21.928s]
[INFO] Maven Site Plugin 3 ................................... FAILED [25.667s]
[INFO] Maven Source Plugin ................................... SUCCESS [42.141s]
[INFO] Maven Stage Plugin .................................... SUCCESS [2.467s]
[INFO] Maven Toolchains Plugin ............................... SUCCESS [1.891s]
[INFO] Maven Verifier Plugin ................................. SUCCESS [11.798s]
[INFO] Maven WAR Plugin ...................................... FAILED [34.146s]
[INFO] SCM Publish Maven Plugin .............................. FAILED [18.589s]
[INFO] Maven Plugins Aggregator .............................. SUCCESS [1.734s]
[INFO] ------------------------------------------------------------------------
[INFO] Error for project: Maven Repository Plugin (during install)
[INFO] ------------------------------------------------------------------------
[INFO] There are test failures.

Please refer to /x1/jenkins/jenkins-slave/workspace/maven-plugins-ITs-m2/maven-repository-plugin/target/surefire-reports
for the individual test results.
[INFO] ------------------------------------------------------------------------
[INFO] Error for project: Maven Resources Plugin (during install)
[INFO] ------------------------------------------------------------------------
[INFO] 17 builds in error. See console output above for details.
[INFO] ------------------------------------------------------------------------
[INFO] Error for project: Maven Site Plugin 3 (during install)
[INFO] ------------------------------------------------------------------------
[INFO] 40 builds in error. See console output above for details.
[INFO] ------------------------------------------------------------------------
[INFO] Error for project: Maven WAR Plugin (during install)
[INFO] ------------------------------------------------------------------------
[INFO] 1 build failed. See console output above for details.
[INFO] ------------------------------------------------------------------------
[INFO] Error for project: SCM Publish Maven Plugin (during install)
[INFO] ------------------------------------------------------------------------
[INFO] : org.apache.maven.plugin.invoker.InvokerSession@42672c
6 builds in error.
[INFO] ------------------------------------------------------------------------
[INFO] For more information, run Maven with the -e switch
[INFO] ------------------------------------------------------------------------
[INFO] BUILD ERRORS
[INFO] ------------------------------------------------------------------------
[INFO] Total time: 41 minutes 12 seconds
[INFO] Finished at: Mon Sep 03 02:49:49 GMT 2012
[INFO] Final Memory: 284M/1012M
[INFO] ------------------------------------------------------------------------
Build step 'Invoke top-level Maven targets' marked build as failure

Mime
View raw message