maven-notifications mailing list archives

Site index · List index
Message view « Date » · « Thread »
Top « Date » · « Thread »
From Apache Jenkins Server <jenk...@builds.apache.org>
Subject Build failed in Jenkins: maven-plugins #994
Date Thu, 13 Sep 2012 13:59:49 GMT
See <https://builds.apache.org/job/maven-plugins/994/changes>

Changes:

[olamy] use Exception rather than e.printStackTrace();

[olamy] use Integer.valueOf rather than new Integer

[olamy] use entrySet() to iterate on Map content

[olamy] mockito must be test scope

[olamy] correctly close stream/reader

[olamy] use last p-u version

[olamy] correctly close stream

[olamy] use last p-u version

[olamy] upgrade dependencies version

[olamy] correctly close stream

------------------------------------------
[...truncated 7956 lines...]
[INFO] Maven Assembly Plugin ............................. SUCCESS [25.182s]
[INFO] Maven Changelog Plugin ............................ SUCCESS [12.441s]
[INFO] Maven Changes Report Plugin ....................... SUCCESS [21.297s]
[INFO] Maven Checkstyle Plugin ........................... SUCCESS [21.995s]
[INFO] Maven Clean Plugin ................................ SUCCESS [5.632s]
[INFO] Maven Compiler Plugin ............................. SUCCESS [11.879s]
[INFO] Maven Dependency Plugin ........................... SUCCESS [1:08.539s]
[INFO] Maven Deploy Plugin ............................... SUCCESS [5.479s]
[INFO] Maven DOAP Plugin ................................. SUCCESS [11.432s]
[INFO] Maven Documentation Checker Plugin ................ SUCCESS [4.209s]
[INFO] Maven EAR Plugin .................................. SUCCESS [10.290s]
[INFO] Maven EJB Plugin .................................. FAILURE [3.362s]
[INFO] Maven GPG Plugin .................................. SUCCESS [4.720s]
[INFO] Maven Help Plugin ................................. SUCCESS [6.266s]
[INFO] Maven IDEA Plugin ................................. SUCCESS [13.003s]
[INFO] Maven Install Plugin .............................. SUCCESS [9.183s]
[INFO] Maven JAR Plugin .................................. SUCCESS [7.262s]
[INFO] Maven Jarsigner Plugin ............................ SUCCESS [3.908s]
[INFO] Maven Javadoc Plugin .............................. FAILURE [9.651s]
[INFO] Maven Linkcheck Plugin ............................ SUCCESS [4.306s]
[INFO] Maven One Plugin .................................. SUCCESS [4.689s]
[INFO] Maven Patch Plugin ................................ SUCCESS [3.466s]
[INFO] Maven PDF Plugin .................................. SUCCESS [20.414s]
[INFO] Maven PMD Plugin .................................. SUCCESS [19.016s]
[INFO] Maven RAR Plugin .................................. SUCCESS [8.450s]
[INFO] Maven Reactor Plugin .............................. SUCCESS [5.548s]
[INFO] Maven Repository Plugin ........................... SUCCESS [7.753s]
[INFO] Maven Resources Plugin ............................ SUCCESS [7.184s]
[INFO] Maven Site Plugin 3 ............................... SUCCESS [15.313s]
[INFO] Maven Source Plugin ............................... SUCCESS [7.288s]
[INFO] Maven Stage Plugin ................................ SUCCESS [4.412s]
[INFO] Maven Toolchains Plugin ........................... SUCCESS [3.956s]
[INFO] Maven Verifier Plugin ............................. SUCCESS [4.870s]
[INFO] Maven WAR Plugin .................................. SUCCESS [22.970s]
[INFO] SCM Publish Maven Plugin .......................... SUCCESS [11.355s]
[INFO] Maven Invoker Plugin .............................. SUCCESS [19.411s]
[INFO] Maven Project Info Reports Plugin ................. SUCCESS [26.485s]
[INFO] Maven Remote Resources Plugin ..................... SUCCESS [8.680s]
[INFO] Maven Shade Plugin ................................ SUCCESS [11.929s]
[INFO] Maven Plugins Aggregator .......................... SUCCESS [0.482s]
[INFO] ------------------------------------------------------------------------
[INFO] BUILD FAILURE
[INFO] ------------------------------------------------------------------------
[INFO] Total time: 3:36.396s (Wall Clock)
[INFO] Finished at: Thu Sep 13 13:58:51 UTC 2012
[INFO] Final Memory: 56M/321M
[INFO] ------------------------------------------------------------------------
Projects to build: [MavenProject: org.apache.maven.plugins:maven-plugins:24-SNAPSHOT @ <https://builds.apache.org/job/maven-plugins/ws/maven-plugins/pom.xml,> MavenProject: org.apache.maven.plugins:maven-acr-plugin:1.0.1-SNAPSHOT @ <https://builds.apache.org/job/maven-plugins/ws/maven-acr-plugin/pom.xml,> MavenProject: org.apache.maven.plugins:maven-ant-plugin:2.4-SNAPSHOT @ <https://builds.apache.org/job/maven-plugins/ws/maven-ant-plugin/pom.xml,> MavenProject: org.apache.maven.plugins:maven-antrun-plugin:1.8-SNAPSHOT @ <https://builds.apache.org/job/maven-plugins/ws/maven-antrun-plugin/pom.xml,> MavenProject: org.apache.maven.plugins:maven-eclipse-plugin:2.10-SNAPSHOT @ <https://builds.apache.org/job/maven-plugins/ws/maven-eclipse-plugin/pom.xml,> MavenProject: org.apache.maven.plugins:maven-assembly-plugin:2.4-SNAPSHOT @ <https://builds.apache.org/job/maven-plugins/ws/maven-assembly-plugin/pom.xml,> MavenProject: org.apache.maven.plugins:maven-changelog-plugin:2.3-SNAPSHOT @ <https://builds.apache.org/job/maven-plugins/ws/maven-changelog-plugin/pom.xml,> MavenProject: org.apache.maven.plugins:maven-changes-plugin:2.9-SNAPSHOT @ <https://builds.apache.org/job/maven-plugins/ws/maven-changes-plugin/pom.xml,> MavenProject: org.apache.maven.plugins:maven-checkstyle-plugin:2.10-SNAPSHOT @ <https://builds.apache.org/job/maven-plugins/ws/maven-checkstyle-plugin/pom.xml,> MavenProject: org.apache.maven.plugins:maven-clean-plugin:2.6-SNAPSHOT @ <https://builds.apache.org/job/maven-plugins/ws/maven-clean-plugin/pom.xml,> MavenProject: org.apache.maven.plugins:maven-compiler-plugin:2.6-SNAPSHOT @ <https://builds.apache.org/job/maven-plugins/ws/maven-compiler-plugin/pom.xml,> MavenProject: org.apache.maven.plugins:maven-dependency-plugin:2.6-SNAPSHOT @ <https://builds.apache.org/job/maven-plugins/ws/maven-dependency-plugin/pom.xml,> MavenProject: org.apache.maven.plugins:maven-deploy-plugin:2.8-SNAPSHOT @ <https://builds.apache.org/job/maven-plugins/ws/maven-deploy-plugin/pom.xml,> MavenProject: org.apache.maven.plugins:maven-doap-plugin:1.2-SNAPSHOT @ <https://builds.apache.org/job/maven-plugins/ws/maven-doap-plugin/pom.xml,> MavenProject: org.apache.maven.plugins:maven-docck-plugin:1.1-SNAPSHOT @ <https://builds.apache.org/job/maven-plugins/ws/maven-docck-plugin/pom.xml,> MavenProject: org.apache.maven.plugins:maven-ear-plugin:2.9-SNAPSHOT @ <https://builds.apache.org/job/maven-plugins/ws/maven-ear-plugin/pom.xml,> MavenProject: org.apache.maven.plugins:maven-ejb-plugin:2.4-SNAPSHOT @ <https://builds.apache.org/job/maven-plugins/ws/maven-ejb-plugin/pom.xml,> MavenProject: org.apache.maven.plugins:maven-gpg-plugin:1.5-SNAPSHOT @ <https://builds.apache.org/job/maven-plugins/ws/maven-gpg-plugin/pom.xml,> MavenProject: org.apache.maven.plugins:maven-help-plugin:2.2-SNAPSHOT @ <https://builds.apache.org/job/maven-plugins/ws/maven-help-plugin/pom.xml,> MavenProject: org.apache.maven.plugins:maven-idea-plugin:2.3-SNAPSHOT @ <https://builds.apache.org/job/maven-plugins/ws/maven-idea-plugin/pom.xml,> MavenProject: org.apache.maven.plugins:maven-install-plugin:2.5-SNAPSHOT @ <https://builds.apache.org/job/maven-plugins/ws/maven-install-plugin/pom.xml,> MavenProject: org.apache.maven.plugins:maven-jar-plugin:2.5-SNAPSHOT @ <https://builds.apache.org/job/maven-plugins/ws/maven-jar-plugin/pom.xml,> MavenProject: org.apache.maven.plugins:maven-jarsigner-plugin:1.3-SNAPSHOT @ <https://builds.apache.org/job/maven-plugins/ws/maven-jarsigner-plugin/pom.xml,> MavenProject: org.apache.maven.plugins:maven-javadoc-plugin:2.8.2-SNAPSHOT @ <https://builds.apache.org/job/maven-plugins/ws/maven-javadoc-plugin/pom.xml,> MavenProject: org.apache.maven.plugins:maven-linkcheck-plugin:1.2-SNAPSHOT @ <https://builds.apache.org/job/maven-plugins/ws/maven-linkcheck-plugin/pom.xml,> MavenProject: org.apache.maven.plugins:maven-one-plugin:1.3-SNAPSHOT @ <https://builds.apache.org/job/maven-plugins/ws/maven-one-plugin/pom.xml,> MavenProject: org.apache.maven.plugins:maven-patch-plugin:1.1.2-SNAPSHOT @ <https://builds.apache.org/job/maven-plugins/ws/maven-patch-plugin/pom.xml,> MavenProject: org.apache.maven.plugins:maven-pdf-plugin:1.2-SNAPSHOT @ <https://builds.apache.org/job/maven-plugins/ws/maven-pdf-plugin/pom.xml,> MavenProject: org.apache.maven.plugins:maven-pmd-plugin:2.8-SNAPSHOT @ <https://builds.apache.org/job/maven-plugins/ws/maven-pmd-plugin/pom.xml,> MavenProject: org.apache.maven.plugins:maven-rar-plugin:2.3-SNAPSHOT @ <https://builds.apache.org/job/maven-plugins/ws/maven-rar-plugin/pom.xml,> MavenProject: org.apache.maven.plugins:maven-reactor-plugin:1.1-SNAPSHOT @ <https://builds.apache.org/job/maven-plugins/ws/maven-reactor-plugin/pom.xml,> MavenProject: org.apache.maven.plugins:maven-repository-plugin:2.3.2-SNAPSHOT @ <https://builds.apache.org/job/maven-plugins/ws/maven-repository-plugin/pom.xml,> MavenProject: org.apache.maven.plugins:maven-resources-plugin:2.7-SNAPSHOT @ <https://builds.apache.org/job/maven-plugins/ws/maven-resources-plugin/pom.xml,> MavenProject: org.apache.maven.plugins:maven-site-plugin:3.2-SNAPSHOT @ <https://builds.apache.org/job/maven-plugins/ws/maven-site-plugin/dependency-reduced-pom.xml,> MavenProject: org.apache.maven.plugins:maven-source-plugin:2.3-SNAPSHOT @ <https://builds.apache.org/job/maven-plugins/ws/maven-source-plugin/pom.xml,> MavenProject: org.apache.maven.plugins:maven-stage-plugin:1.0-alpha-3-SNAPSHOT @ <https://builds.apache.org/job/maven-plugins/ws/maven-stage-plugin/pom.xml,> MavenProject: org.apache.maven.plugins:maven-toolchains-plugin:1.1-SNAPSHOT @ <https://builds.apache.org/job/maven-plugins/ws/maven-toolchains-plugin/pom.xml,> MavenProject: org.apache.maven.plugins:maven-verifier-plugin:1.1-SNAPSHOT @ <https://builds.apache.org/job/maven-plugins/ws/maven-verifier-plugin/pom.xml,> MavenProject: org.apache.maven.plugins:maven-war-plugin:2.3-SNAPSHOT @ <https://builds.apache.org/job/maven-plugins/ws/maven-war-plugin/pom.xml,> MavenProject: org.apache.maven.plugins:maven-scm-publish-plugin:1.0-SNAPSHOT @ <https://builds.apache.org/job/maven-plugins/ws/maven-scm-publish-plugin/pom.xml,> MavenProject: org.apache.maven.plugins:maven-invoker-plugin:1.8-SNAPSHOT @ <https://builds.apache.org/job/maven-plugins/ws/maven-invoker-plugin/pom.xml,> MavenProject: org.apache.maven.plugins:maven-project-info-reports-plugin:2.6-SNAPSHOT @ <https://builds.apache.org/job/maven-plugins/ws/maven-project-info-reports-plugin/pom.xml,> MavenProject: org.apache.maven.plugins:maven-remote-resources-plugin:1.4-SNAPSHOT @ <https://builds.apache.org/job/maven-plugins/ws/maven-remote-resources-plugin/pom.xml,> MavenProject: org.apache.maven.plugins:maven-shade-plugin:2.0.1-SNAPSHOT @ <https://builds.apache.org/job/maven-plugins/ws/maven-shade-plugin/pom.xml,> MavenProject: org.apache.maven.plugins:maven-plugins-aggregator:1-SNAPSHOT @ <https://builds.apache.org/job/maven-plugins/ws/pom.xml]>
[JENKINS] Archiving <https://builds.apache.org/job/maven-plugins/ws/maven-war-plugin/pom.xml> to /home/hudson/hudson/jobs/maven-plugins/modules/org.apache.maven.plugins$maven-war-plugin/builds/2012-09-13_13-54-59/archive/org.apache.maven.plugins/maven-war-plugin/2.3-SNAPSHOT/maven-war-plugin-2.3-SNAPSHOT.pom
[JENKINS] Archiving <https://builds.apache.org/job/maven-plugins/ws/maven-war-plugin/target/maven-war-plugin-2.3-SNAPSHOT.jar> to /home/hudson/hudson/jobs/maven-plugins/modules/org.apache.maven.plugins$maven-war-plugin/builds/2012-09-13_13-54-59/archive/org.apache.maven.plugins/maven-war-plugin/2.3-SNAPSHOT/maven-war-plugin-2.3-SNAPSHOT.jar
[JENKINS] Archiving <https://builds.apache.org/job/maven-plugins/ws/maven-docck-plugin/pom.xml> to /home/hudson/hudson/jobs/maven-plugins/modules/org.apache.maven.plugins$maven-docck-plugin/builds/2012-09-13_13-54-57/archive/org.apache.maven.plugins/maven-docck-plugin/1.1-SNAPSHOT/maven-docck-plugin-1.1-SNAPSHOT.pom
[JENKINS] Archiving <https://builds.apache.org/job/maven-plugins/ws/maven-docck-plugin/target/maven-docck-plugin-1.1-SNAPSHOT.jar> to /home/hudson/hudson/jobs/maven-plugins/modules/org.apache.maven.plugins$maven-docck-plugin/builds/2012-09-13_13-54-57/archive/org.apache.maven.plugins/maven-docck-plugin/1.1-SNAPSHOT/maven-docck-plugin-1.1-SNAPSHOT.jar
[JENKINS] Archiving <https://builds.apache.org/job/maven-plugins/ws/pom.xml> to /home/hudson/hudson/jobs/maven-plugins/modules/org.apache.maven.plugins$maven-plugins-aggregator/builds/2012-09-13_13-54-54/archive/org.apache.maven.plugins/maven-plugins-aggregator/1-SNAPSHOT/maven-plugins-aggregator-1-SNAPSHOT.pom
[JENKINS] Archiving <https://builds.apache.org/job/maven-plugins/ws/maven-idea-plugin/pom.xml> to /home/hudson/hudson/jobs/maven-plugins/modules/org.apache.maven.plugins$maven-idea-plugin/builds/2012-09-13_13-54-57/archive/org.apache.maven.plugins/maven-idea-plugin/2.3-SNAPSHOT/maven-idea-plugin-2.3-SNAPSHOT.pom
[JENKINS] Archiving <https://builds.apache.org/job/maven-plugins/ws/maven-idea-plugin/target/maven-idea-plugin-2.3-SNAPSHOT.jar> to /home/hudson/hudson/jobs/maven-plugins/modules/org.apache.maven.plugins$maven-idea-plugin/builds/2012-09-13_13-54-57/archive/org.apache.maven.plugins/maven-idea-plugin/2.3-SNAPSHOT/maven-idea-plugin-2.3-SNAPSHOT.jar
[JENKINS] Archiving <https://builds.apache.org/job/maven-plugins/ws/maven-toolchains-plugin/pom.xml> to /home/hudson/hudson/jobs/maven-plugins/modules/org.apache.maven.plugins$maven-toolchains-plugin/builds/2012-09-13_13-54-59/archive/org.apache.maven.plugins/maven-toolchains-plugin/1.1-SNAPSHOT/maven-toolchains-plugin-1.1-SNAPSHOT.pom
[JENKINS] Archiving <https://builds.apache.org/job/maven-plugins/ws/maven-toolchains-plugin/target/maven-toolchains-plugin-1.1-SNAPSHOT.jar> to /home/hudson/hudson/jobs/maven-plugins/modules/org.apache.maven.plugins$maven-toolchains-plugin/builds/2012-09-13_13-54-59/archive/org.apache.maven.plugins/maven-toolchains-plugin/1.1-SNAPSHOT/maven-toolchains-plugin-1.1-SNAPSHOT.jar
[JENKINS] Archiving <https://builds.apache.org/job/maven-plugins/ws/maven-pmd-plugin/pom.xml> to /home/hudson/hudson/jobs/maven-plugins/modules/org.apache.maven.plugins$maven-pmd-plugin/builds/2012-09-13_13-54-58/archive/org.apache.maven.plugins/maven-pmd-plugin/2.8-SNAPSHOT/maven-pmd-plugin-2.8-SNAPSHOT.pom
[JENKINS] Archiving <https://builds.apache.org/job/maven-plugins/ws/maven-pmd-plugin/target/maven-pmd-plugin-2.8-SNAPSHOT.jar> to /home/hudson/hudson/jobs/maven-plugins/modules/org.apache.maven.plugins$maven-pmd-plugin/builds/2012-09-13_13-54-58/archive/org.apache.maven.plugins/maven-pmd-plugin/2.8-SNAPSHOT/maven-pmd-plugin-2.8-SNAPSHOT.jar
[JENKINS] Archiving <https://builds.apache.org/job/maven-plugins/ws/maven-eclipse-plugin/pom.xml> to /home/hudson/hudson/jobs/maven-plugins/modules/org.apache.maven.plugins$maven-eclipse-plugin/builds/2012-09-13_13-54-55/archive/org.apache.maven.plugins/maven-eclipse-plugin/2.10-SNAPSHOT/maven-eclipse-plugin-2.10-SNAPSHOT.pom
[JENKINS] Archiving <https://builds.apache.org/job/maven-plugins/ws/maven-eclipse-plugin/target/maven-eclipse-plugin-2.10-SNAPSHOT.jar> to /home/hudson/hudson/jobs/maven-plugins/modules/org.apache.maven.plugins$maven-eclipse-plugin/builds/2012-09-13_13-54-55/archive/org.apache.maven.plugins/maven-eclipse-plugin/2.10-SNAPSHOT/maven-eclipse-plugin-2.10-SNAPSHOT.jar
[JENKINS] Archiving <https://builds.apache.org/job/maven-plugins/ws/maven-gpg-plugin/pom.xml> to /home/hudson/hudson/jobs/maven-plugins/modules/org.apache.maven.plugins$maven-gpg-plugin/builds/2012-09-13_13-54-57/archive/org.apache.maven.plugins/maven-gpg-plugin/1.5-SNAPSHOT/maven-gpg-plugin-1.5-SNAPSHOT.pom
[JENKINS] Archiving <https://builds.apache.org/job/maven-plugins/ws/maven-gpg-plugin/target/maven-gpg-plugin-1.5-SNAPSHOT.jar> to /home/hudson/hudson/jobs/maven-plugins/modules/org.apache.maven.plugins$maven-gpg-plugin/builds/2012-09-13_13-54-57/archive/org.apache.maven.plugins/maven-gpg-plugin/1.5-SNAPSHOT/maven-gpg-plugin-1.5-SNAPSHOT.jar
[JENKINS] Archiving <https://builds.apache.org/job/maven-plugins/ws/maven-clean-plugin/pom.xml> to /home/hudson/hudson/jobs/maven-plugins/modules/org.apache.maven.plugins$maven-clean-plugin/builds/2012-09-13_13-54-56/archive/org.apache.maven.plugins/maven-clean-plugin/2.6-SNAPSHOT/maven-clean-plugin-2.6-SNAPSHOT.pom
[JENKINS] Archiving <https://builds.apache.org/job/maven-plugins/ws/maven-clean-plugin/target/maven-clean-plugin-2.6-SNAPSHOT.jar> to /home/hudson/hudson/jobs/maven-plugins/modules/org.apache.maven.plugins$maven-clean-plugin/builds/2012-09-13_13-54-56/archive/org.apache.maven.plugins/maven-clean-plugin/2.6-SNAPSHOT/maven-clean-plugin-2.6-SNAPSHOT.jar
[JENKINS] Archiving <https://builds.apache.org/job/maven-plugins/ws/maven-jar-plugin/pom.xml> to /home/hudson/hudson/jobs/maven-plugins/modules/org.apache.maven.plugins$maven-jar-plugin/builds/2012-09-13_13-54-57/archive/org.apache.maven.plugins/maven-jar-plugin/2.5-SNAPSHOT/maven-jar-plugin-2.5-SNAPSHOT.pom
[JENKINS] Archiving <https://builds.apache.org/job/maven-plugins/ws/maven-jar-plugin/target/maven-jar-plugin-2.5-SNAPSHOT.jar> to /home/hudson/hudson/jobs/maven-plugins/modules/org.apache.maven.plugins$maven-jar-plugin/builds/2012-09-13_13-54-57/archive/org.apache.maven.plugins/maven-jar-plugin/2.5-SNAPSHOT/maven-jar-plugin-2.5-SNAPSHOT.jar
[JENKINS] Archiving <https://builds.apache.org/job/maven-plugins/ws/maven-site-plugin/dependency-reduced-pom.xml> to /home/hudson/hudson/jobs/maven-plugins/modules/org.apache.maven.plugins$maven-site-plugin/builds/2012-09-13_13-54-59/archive/org.apache.maven.plugins/maven-site-plugin/3.2-SNAPSHOT/maven-site-plugin-3.2-SNAPSHOT.pom
[JENKINS] Archiving <https://builds.apache.org/job/maven-plugins/ws/maven-site-plugin/target/maven-site-plugin-3.2-SNAPSHOT.jar> to /home/hudson/hudson/jobs/maven-plugins/modules/org.apache.maven.plugins$maven-site-plugin/builds/2012-09-13_13-54-59/archive/org.apache.maven.plugins/maven-site-plugin/3.2-SNAPSHOT/maven-site-plugin-3.2-SNAPSHOT.jar
[JENKINS] Archiving <https://builds.apache.org/job/maven-plugins/ws/maven-patch-plugin/pom.xml> to /home/hudson/hudson/jobs/maven-plugins/modules/org.apache.maven.plugins$maven-patch-plugin/builds/2012-09-13_13-54-58/archive/org.apache.maven.plugins/maven-patch-plugin/1.1.2-SNAPSHOT/maven-patch-plugin-1.1.2-SNAPSHOT.pom
[JENKINS] Archiving <https://builds.apache.org/job/maven-plugins/ws/maven-patch-plugin/target/maven-patch-plugin-1.1.2-SNAPSHOT.jar> to /home/hudson/hudson/jobs/maven-plugins/modules/org.apache.maven.plugins$maven-patch-plugin/builds/2012-09-13_13-54-58/archive/org.apache.maven.plugins/maven-patch-plugin/1.1.2-SNAPSHOT/maven-patch-plugin-1.1.2-SNAPSHOT.jar
[JENKINS] Archiving <https://builds.apache.org/job/maven-plugins/ws/maven-install-plugin/pom.xml> to /home/hudson/hudson/jobs/maven-plugins/modules/org.apache.maven.plugins$maven-install-plugin/builds/2012-09-13_13-54-57/archive/org.apache.maven.plugins/maven-install-plugin/2.5-SNAPSHOT/maven-install-plugin-2.5-SNAPSHOT.pom
[JENKINS] Archiving <https://builds.apache.org/job/maven-plugins/ws/maven-install-plugin/target/maven-install-plugin-2.5-SNAPSHOT.jar> to /home/hudson/hudson/jobs/maven-plugins/modules/org.apache.maven.plugins$maven-install-plugin/builds/2012-09-13_13-54-57/archive/org.apache.maven.plugins/maven-install-plugin/2.5-SNAPSHOT/maven-install-plugin-2.5-SNAPSHOT.jar
[JENKINS] Archiving <https://builds.apache.org/job/maven-plugins/ws/maven-antrun-plugin/pom.xml> to /home/hudson/hudson/jobs/maven-plugins/modules/org.apache.maven.plugins$maven-antrun-plugin/builds/2012-09-13_13-54-55/archive/org.apache.maven.plugins/maven-antrun-plugin/1.8-SNAPSHOT/maven-antrun-plugin-1.8-SNAPSHOT.pom
[JENKINS] Archiving <https://builds.apache.org/job/maven-plugins/ws/maven-antrun-plugin/target/maven-antrun-plugin-1.8-SNAPSHOT.jar> to /home/hudson/hudson/jobs/maven-plugins/modules/org.apache.maven.plugins$maven-antrun-plugin/builds/2012-09-13_13-54-55/archive/org.apache.maven.plugins/maven-antrun-plugin/1.8-SNAPSHOT/maven-antrun-plugin-1.8-SNAPSHOT.jar
[JENKINS] Archiving <https://builds.apache.org/job/maven-plugins/ws/maven-changes-plugin/pom.xml> to /home/hudson/hudson/jobs/maven-plugins/modules/org.apache.maven.plugins$maven-changes-plugin/builds/2012-09-13_13-54-56/archive/org.apache.maven.plugins/maven-changes-plugin/2.9-SNAPSHOT/maven-changes-plugin-2.9-SNAPSHOT.pom
[JENKINS] Archiving <https://builds.apache.org/job/maven-plugins/ws/maven-changes-plugin/target/maven-changes-plugin-2.9-SNAPSHOT.jar> to /home/hudson/hudson/jobs/maven-plugins/modules/org.apache.maven.plugins$maven-changes-plugin/builds/2012-09-13_13-54-56/archive/org.apache.maven.plugins/maven-changes-plugin/2.9-SNAPSHOT/maven-changes-plugin-2.9-SNAPSHOT.jar
[JENKINS] Archiving <https://builds.apache.org/job/maven-plugins/ws/maven-rar-plugin/pom.xml> to /home/hudson/hudson/jobs/maven-plugins/modules/org.apache.maven.plugins$maven-rar-plugin/builds/2012-09-13_13-54-58/archive/org.apache.maven.plugins/maven-rar-plugin/2.3-SNAPSHOT/maven-rar-plugin-2.3-SNAPSHOT.pom
[JENKINS] Archiving <https://builds.apache.org/job/maven-plugins/ws/maven-rar-plugin/target/maven-rar-plugin-2.3-SNAPSHOT.jar> to /home/hudson/hudson/jobs/maven-plugins/modules/org.apache.maven.plugins$maven-rar-plugin/builds/2012-09-13_13-54-58/archive/org.apache.maven.plugins/maven-rar-plugin/2.3-SNAPSHOT/maven-rar-plugin-2.3-SNAPSHOT.jar
[JENKINS] Archiving <https://builds.apache.org/job/maven-plugins/ws/maven-jarsigner-plugin/pom.xml> to /home/hudson/hudson/jobs/maven-plugins/modules/org.apache.maven.plugins$maven-jarsigner-plugin/builds/2012-09-13_13-54-58/archive/org.apache.maven.plugins/maven-jarsigner-plugin/1.3-SNAPSHOT/maven-jarsigner-plugin-1.3-SNAPSHOT.pom
[JENKINS] Archiving <https://builds.apache.org/job/maven-plugins/ws/maven-jarsigner-plugin/target/maven-jarsigner-plugin-1.3-SNAPSHOT.jar> to /home/hudson/hudson/jobs/maven-plugins/modules/org.apache.maven.plugins$maven-jarsigner-plugin/builds/2012-09-13_13-54-58/archive/org.apache.maven.plugins/maven-jarsigner-plugin/1.3-SNAPSHOT/maven-jarsigner-plugin-1.3-SNAPSHOT.jar
[JENKINS] Archiving <https://builds.apache.org/job/maven-plugins/ws/maven-ear-plugin/pom.xml> to /home/hudson/hudson/jobs/maven-plugins/modules/org.apache.maven.plugins$maven-ear-plugin/builds/2012-09-13_13-54-57/archive/org.apache.maven.plugins/maven-ear-plugin/2.9-SNAPSHOT/maven-ear-plugin-2.9-SNAPSHOT.pom
[JENKINS] Archiving <https://builds.apache.org/job/maven-plugins/ws/maven-ear-plugin/target/maven-ear-plugin-2.9-SNAPSHOT.jar> to /home/hudson/hudson/jobs/maven-plugins/modules/org.apache.maven.plugins$maven-ear-plugin/builds/2012-09-13_13-54-57/archive/org.apache.maven.plugins/maven-ear-plugin/2.9-SNAPSHOT/maven-ear-plugin-2.9-SNAPSHOT.jar
[JENKINS] Archiving <https://builds.apache.org/job/maven-plugins/ws/maven-changelog-plugin/pom.xml> to /home/hudson/hudson/jobs/maven-plugins/modules/org.apache.maven.plugins$maven-changelog-plugin/builds/2012-09-13_13-54-56/archive/org.apache.maven.plugins/maven-changelog-plugin/2.3-SNAPSHOT/maven-changelog-plugin-2.3-SNAPSHOT.pom
[JENKINS] Archiving <https://builds.apache.org/job/maven-plugins/ws/maven-changelog-plugin/target/maven-changelog-plugin-2.3-SNAPSHOT.jar> to /home/hudson/hudson/jobs/maven-plugins/modules/org.apache.maven.plugins$maven-changelog-plugin/builds/2012-09-13_13-54-56/archive/org.apache.maven.plugins/maven-changelog-plugin/2.3-SNAPSHOT/maven-changelog-plugin-2.3-SNAPSHOT.jar
[JENKINS] Archiving <https://builds.apache.org/job/maven-plugins/ws/maven-verifier-plugin/pom.xml> to /home/hudson/hudson/jobs/maven-plugins/modules/org.apache.maven.plugins$maven-verifier-plugin/builds/2012-09-13_13-54-59/archive/org.apache.maven.plugins/maven-verifier-plugin/1.1-SNAPSHOT/maven-verifier-plugin-1.1-SNAPSHOT.pom
[JENKINS] Archiving <https://builds.apache.org/job/maven-plugins/ws/maven-verifier-plugin/target/maven-verifier-plugin-1.1-SNAPSHOT.jar> to /home/hudson/hudson/jobs/maven-plugins/modules/org.apache.maven.plugins$maven-verifier-plugin/builds/2012-09-13_13-54-59/archive/org.apache.maven.plugins/maven-verifier-plugin/1.1-SNAPSHOT/maven-verifier-plugin-1.1-SNAPSHOT.jar
[JENKINS] Archiving <https://builds.apache.org/job/maven-plugins/ws/maven-ant-plugin/pom.xml> to /home/hudson/hudson/jobs/maven-plugins/modules/org.apache.maven.plugins$maven-ant-plugin/builds/2012-09-13_13-54-55/archive/org.apache.maven.plugins/maven-ant-plugin/2.4-SNAPSHOT/maven-ant-plugin-2.4-SNAPSHOT.pom
[JENKINS] Archiving <https://builds.apache.org/job/maven-plugins/ws/maven-ant-plugin/target/maven-ant-plugin-2.4-SNAPSHOT.jar> to /home/hudson/hudson/jobs/maven-plugins/modules/org.apache.maven.plugins$maven-ant-plugin/builds/2012-09-13_13-54-55/archive/org.apache.maven.plugins/maven-ant-plugin/2.4-SNAPSHOT/maven-ant-plugin-2.4-SNAPSHOT.jar
[JENKINS] Archiving <https://builds.apache.org/job/maven-plugins/ws/maven-ejb-plugin/pom.xml> to /home/hudson/hudson/jobs/maven-plugins/modules/org.apache.maven.plugins$maven-ejb-plugin/builds/2012-09-13_13-54-57/archive/org.apache.maven.plugins/maven-ejb-plugin/2.4-SNAPSHOT/maven-ejb-plugin-2.4-SNAPSHOT.pom
[JENKINS] Archiving <https://builds.apache.org/job/maven-plugins/ws/maven-stage-plugin/pom.xml> to /home/hudson/hudson/jobs/maven-plugins/modules/org.apache.maven.plugins$maven-stage-plugin/builds/2012-09-13_13-54-59/archive/org.apache.maven.plugins/maven-stage-plugin/1.0-alpha-3-SNAPSHOT/maven-stage-plugin-1.0-alpha-3-SNAPSHOT.pom
[JENKINS] Archiving <https://builds.apache.org/job/maven-plugins/ws/maven-stage-plugin/target/maven-stage-plugin-1.0-alpha-3-SNAPSHOT.jar> to /home/hudson/hudson/jobs/maven-plugins/modules/org.apache.maven.plugins$maven-stage-plugin/builds/2012-09-13_13-54-59/archive/org.apache.maven.plugins/maven-stage-plugin/1.0-alpha-3-SNAPSHOT/maven-stage-plugin-1.0-alpha-3-SNAPSHOT.jar
[JENKINS] Archiving <https://builds.apache.org/job/maven-plugins/ws/maven-scm-publish-plugin/pom.xml> to /home/hudson/hudson/jobs/maven-plugins/modules/org.apache.maven.plugins$maven-scm-publish-plugin/builds/2012-09-13_13-54-59/archive/org.apache.maven.plugins/maven-scm-publish-plugin/1.0-SNAPSHOT/maven-scm-publish-plugin-1.0-SNAPSHOT.pom
[JENKINS] Archiving <https://builds.apache.org/job/maven-plugins/ws/maven-scm-publish-plugin/target/maven-scm-publish-plugin-1.0-SNAPSHOT.jar> to /home/hudson/hudson/jobs/maven-plugins/modules/org.apache.maven.plugins$maven-scm-publish-plugin/builds/2012-09-13_13-54-59/archive/org.apache.maven.plugins/maven-scm-publish-plugin/1.0-SNAPSHOT/maven-scm-publish-plugin-1.0-SNAPSHOT.jar
[JENKINS] Archiving <https://builds.apache.org/job/maven-plugins/ws/maven-compiler-plugin/pom.xml> to /home/hudson/hudson/jobs/maven-plugins/modules/org.apache.maven.plugins$maven-compiler-plugin/builds/2012-09-13_13-54-56/archive/org.apache.maven.plugins/maven-compiler-plugin/2.6-SNAPSHOT/maven-compiler-plugin-2.6-SNAPSHOT.pom
[JENKINS] Archiving <https://builds.apache.org/job/maven-plugins/ws/maven-compiler-plugin/target/maven-compiler-plugin-2.6-SNAPSHOT.jar> to /home/hudson/hudson/jobs/maven-plugins/modules/org.apache.maven.plugins$maven-compiler-plugin/builds/2012-09-13_13-54-56/archive/org.apache.maven.plugins/maven-compiler-plugin/2.6-SNAPSHOT/maven-compiler-plugin-2.6-SNAPSHOT.jar
[JENKINS] Archiving <https://builds.apache.org/job/maven-plugins/ws/maven-reactor-plugin/pom.xml> to /home/hudson/hudson/jobs/maven-plugins/modules/org.apache.maven.plugins$maven-reactor-plugin/builds/2012-09-13_13-54-58/archive/org.apache.maven.plugins/maven-reactor-plugin/1.1-SNAPSHOT/maven-reactor-plugin-1.1-SNAPSHOT.pom
[JENKINS] Archiving <https://builds.apache.org/job/maven-plugins/ws/maven-reactor-plugin/target/maven-reactor-plugin-1.1-SNAPSHOT.jar> to /home/hudson/hudson/jobs/maven-plugins/modules/org.apache.maven.plugins$maven-reactor-plugin/builds/2012-09-13_13-54-58/archive/org.apache.maven.plugins/maven-reactor-plugin/1.1-SNAPSHOT/maven-reactor-plugin-1.1-SNAPSHOT.jar
[JENKINS] Archiving <https://builds.apache.org/job/maven-plugins/ws/maven-doap-plugin/pom.xml> to /home/hudson/hudson/jobs/maven-plugins/modules/org.apache.maven.plugins$maven-doap-plugin/builds/2012-09-13_13-54-57/archive/org.apache.maven.plugins/maven-doap-plugin/1.2-SNAPSHOT/maven-doap-plugin-1.2-SNAPSHOT.pom
[JENKINS] Archiving <https://builds.apache.org/job/maven-plugins/ws/maven-doap-plugin/target/maven-doap-plugin-1.2-SNAPSHOT.jar> to /home/hudson/hudson/jobs/maven-plugins/modules/org.apache.maven.plugins$maven-doap-plugin/builds/2012-09-13_13-54-57/archive/org.apache.maven.plugins/maven-doap-plugin/1.2-SNAPSHOT/maven-doap-plugin-1.2-SNAPSHOT.jar
[JENKINS] Archiving <https://builds.apache.org/job/maven-plugins/ws/maven-checkstyle-plugin/pom.xml> to /home/hudson/hudson/jobs/maven-plugins/modules/org.apache.maven.plugins$maven-checkstyle-plugin/builds/2012-09-13_13-54-56/archive/org.apache.maven.plugins/maven-checkstyle-plugin/2.10-SNAPSHOT/maven-checkstyle-plugin-2.10-SNAPSHOT.pom
[JENKINS] Archiving <https://builds.apache.org/job/maven-plugins/ws/maven-checkstyle-plugin/target/maven-checkstyle-plugin-2.10-SNAPSHOT.jar> to /home/hudson/hudson/jobs/maven-plugins/modules/org.apache.maven.plugins$maven-checkstyle-plugin/builds/2012-09-13_13-54-56/archive/org.apache.maven.plugins/maven-checkstyle-plugin/2.10-SNAPSHOT/maven-checkstyle-plugin-2.10-SNAPSHOT.jar
[JENKINS] Archiving <https://builds.apache.org/job/maven-plugins/ws/maven-source-plugin/pom.xml> to /home/hudson/hudson/jobs/maven-plugins/modules/org.apache.maven.plugins$maven-source-plugin/builds/2012-09-13_13-54-59/archive/org.apache.maven.plugins/maven-source-plugin/2.3-SNAPSHOT/maven-source-plugin-2.3-SNAPSHOT.pom
[JENKINS] Archiving <https://builds.apache.org/job/maven-plugins/ws/maven-source-plugin/target/maven-source-plugin-2.3-SNAPSHOT.jar> to /home/hudson/hudson/jobs/maven-plugins/modules/org.apache.maven.plugins$maven-source-plugin/builds/2012-09-13_13-54-59/archive/org.apache.maven.plugins/maven-source-plugin/2.3-SNAPSHOT/maven-source-plugin-2.3-SNAPSHOT.jar
[JENKINS] Archiving <https://builds.apache.org/job/maven-plugins/ws/maven-dependency-plugin/pom.xml> to /home/hudson/hudson/jobs/maven-plugins/modules/org.apache.maven.plugins$maven-dependency-plugin/builds/2012-09-13_13-54-57/archive/org.apache.maven.plugins/maven-dependency-plugin/2.6-SNAPSHOT/maven-dependency-plugin-2.6-SNAPSHOT.pom
[JENKINS] Archiving <https://builds.apache.org/job/maven-plugins/ws/maven-dependency-plugin/target/maven-dependency-plugin-2.6-SNAPSHOT.jar> to /home/hudson/hudson/jobs/maven-plugins/modules/org.apache.maven.plugins$maven-dependency-plugin/builds/2012-09-13_13-54-57/archive/org.apache.maven.plugins/maven-dependency-plugin/2.6-SNAPSHOT/maven-dependency-plugin-2.6-SNAPSHOT.jar
[JENKINS] Archiving <https://builds.apache.org/job/maven-plugins/ws/maven-javadoc-plugin/pom.xml> to /home/hudson/hudson/jobs/maven-plugins/modules/org.apache.maven.plugins$maven-javadoc-plugin/builds/2012-09-13_13-54-58/archive/org.apache.maven.plugins/maven-javadoc-plugin/2.8.2-SNAPSHOT/maven-javadoc-plugin-2.8.2-SNAPSHOT.pom
[JENKINS] Archiving <https://builds.apache.org/job/maven-plugins/ws/maven-deploy-plugin/pom.xml> to /home/hudson/hudson/jobs/maven-plugins/modules/org.apache.maven.plugins$maven-deploy-plugin/builds/2012-09-13_13-54-57/archive/org.apache.maven.plugins/maven-deploy-plugin/2.8-SNAPSHOT/maven-deploy-plugin-2.8-SNAPSHOT.pom
[JENKINS] Archiving <https://builds.apache.org/job/maven-plugins/ws/maven-deploy-plugin/target/maven-deploy-plugin-2.8-SNAPSHOT.jar> to /home/hudson/hudson/jobs/maven-plugins/modules/org.apache.maven.plugins$maven-deploy-plugin/builds/2012-09-13_13-54-57/archive/org.apache.maven.plugins/maven-deploy-plugin/2.8-SNAPSHOT/maven-deploy-plugin-2.8-SNAPSHOT.jar
[JENKINS] Archiving <https://builds.apache.org/job/maven-plugins/ws/maven-acr-plugin/pom.xml> to /home/hudson/hudson/jobs/maven-plugins/modules/org.apache.maven.plugins$maven-acr-plugin/builds/2012-09-13_13-54-55/archive/org.apache.maven.plugins/maven-acr-plugin/1.0.1-SNAPSHOT/maven-acr-plugin-1.0.1-SNAPSHOT.pom
[JENKINS] Archiving <https://builds.apache.org/job/maven-plugins/ws/maven-repository-plugin/pom.xml> to /home/hudson/hudson/jobs/maven-plugins/modules/org.apache.maven.plugins$maven-repository-plugin/builds/2012-09-13_13-54-58/archive/org.apache.maven.plugins/maven-repository-plugin/2.3.2-SNAPSHOT/maven-repository-plugin-2.3.2-SNAPSHOT.pom
[JENKINS] Archiving <https://builds.apache.org/job/maven-plugins/ws/maven-repository-plugin/target/maven-repository-plugin-2.3.2-SNAPSHOT.jar> to /home/hudson/hudson/jobs/maven-plugins/modules/org.apache.maven.plugins$maven-repository-plugin/builds/2012-09-13_13-54-58/archive/org.apache.maven.plugins/maven-repository-plugin/2.3.2-SNAPSHOT/maven-repository-plugin-2.3.2-SNAPSHOT.jar
[JENKINS] Archiving <https://builds.apache.org/job/maven-plugins/ws/maven-assembly-plugin/pom.xml> to /home/hudson/hudson/jobs/maven-plugins/modules/org.apache.maven.plugins$maven-assembly-plugin/builds/2012-09-13_13-54-56/archive/org.apache.maven.plugins/maven-assembly-plugin/2.4-SNAPSHOT/maven-assembly-plugin-2.4-SNAPSHOT.pom
[JENKINS] Archiving <https://builds.apache.org/job/maven-plugins/ws/maven-assembly-plugin/target/maven-assembly-plugin-2.4-SNAPSHOT.jar> to /home/hudson/hudson/jobs/maven-plugins/modules/org.apache.maven.plugins$maven-assembly-plugin/builds/2012-09-13_13-54-56/archive/org.apache.maven.plugins/maven-assembly-plugin/2.4-SNAPSHOT/maven-assembly-plugin-2.4-SNAPSHOT.jar
[JENKINS] Archiving <https://builds.apache.org/job/maven-plugins/ws/maven-project-info-reports-plugin/pom.xml> to /home/hudson/hudson/jobs/maven-plugins/modules/org.apache.maven.plugins$maven-project-info-reports-plugin/builds/2012-09-13_13-54-59/archive/org.apache.maven.plugins/maven-project-info-reports-plugin/2.6-SNAPSHOT/maven-project-info-reports-plugin-2.6-SNAPSHOT.pom
[JENKINS] Archiving <https://builds.apache.org/job/maven-plugins/ws/maven-project-info-reports-plugin/target/maven-project-info-reports-plugin-2.6-SNAPSHOT.jar> to /home/hudson/hudson/jobs/maven-plugins/modules/org.apache.maven.plugins$maven-project-info-reports-plugin/builds/2012-09-13_13-54-59/archive/org.apache.maven.plugins/maven-project-info-reports-plugin/2.6-SNAPSHOT/maven-project-info-reports-plugin-2.6-SNAPSHOT.jar
[JENKINS] Archiving <https://builds.apache.org/job/maven-plugins/ws/maven-one-plugin/pom.xml> to /home/hudson/hudson/jobs/maven-plugins/modules/org.apache.maven.plugins$maven-one-plugin/builds/2012-09-13_13-54-58/archive/org.apache.maven.plugins/maven-one-plugin/1.3-SNAPSHOT/maven-one-plugin-1.3-SNAPSHOT.pom
[JENKINS] Archiving <https://builds.apache.org/job/maven-plugins/ws/maven-one-plugin/target/maven-one-plugin-1.3-SNAPSHOT.jar> to /home/hudson/hudson/jobs/maven-plugins/modules/org.apache.maven.plugins$maven-one-plugin/builds/2012-09-13_13-54-58/archive/org.apache.maven.plugins/maven-one-plugin/1.3-SNAPSHOT/maven-one-plugin-1.3-SNAPSHOT.jar
[JENKINS] Archiving <https://builds.apache.org/job/maven-plugins/ws/maven-help-plugin/pom.xml> to /home/hudson/hudson/jobs/maven-plugins/modules/org.apache.maven.plugins$maven-help-plugin/builds/2012-09-13_13-54-57/archive/org.apache.maven.plugins/maven-help-plugin/2.2-SNAPSHOT/maven-help-plugin-2.2-SNAPSHOT.pom
[JENKINS] Archiving <https://builds.apache.org/job/maven-plugins/ws/maven-help-plugin/target/maven-help-plugin-2.2-SNAPSHOT.jar> to /home/hudson/hudson/jobs/maven-plugins/modules/org.apache.maven.plugins$maven-help-plugin/builds/2012-09-13_13-54-57/archive/org.apache.maven.plugins/maven-help-plugin/2.2-SNAPSHOT/maven-help-plugin-2.2-SNAPSHOT.jar
[JENKINS] Archiving <https://builds.apache.org/job/maven-plugins/ws/maven-invoker-plugin/pom.xml> to /home/hudson/hudson/jobs/maven-plugins/modules/org.apache.maven.plugins$maven-invoker-plugin/builds/2012-09-13_13-54-59/archive/org.apache.maven.plugins/maven-invoker-plugin/1.8-SNAPSHOT/maven-invoker-plugin-1.8-SNAPSHOT.pom
[JENKINS] Archiving <https://builds.apache.org/job/maven-plugins/ws/maven-invoker-plugin/target/maven-invoker-plugin-1.8-SNAPSHOT.jar> to /home/hudson/hudson/jobs/maven-plugins/modules/org.apache.maven.plugins$maven-invoker-plugin/builds/2012-09-13_13-54-59/archive/org.apache.maven.plugins/maven-invoker-plugin/1.8-SNAPSHOT/maven-invoker-plugin-1.8-SNAPSHOT.jar
[JENKINS] Archiving <https://builds.apache.org/job/maven-plugins/ws/maven-remote-resources-plugin/pom.xml> to /home/hudson/hudson/jobs/maven-plugins/modules/org.apache.maven.plugins$maven-remote-resources-plugin/builds/2012-09-13_13-55-00/archive/org.apache.maven.plugins/maven-remote-resources-plugin/1.4-SNAPSHOT/maven-remote-resources-plugin-1.4-SNAPSHOT.pom
[JENKINS] Archiving <https://builds.apache.org/job/maven-plugins/ws/maven-remote-resources-plugin/target/maven-remote-resources-plugin-1.4-SNAPSHOT.jar> to /home/hudson/hudson/jobs/maven-plugins/modules/org.apache.maven.plugins$maven-remote-resources-plugin/builds/2012-09-13_13-55-00/archive/org.apache.maven.plugins/maven-remote-resources-plugin/1.4-SNAPSHOT/maven-remote-resources-plugin-1.4-SNAPSHOT.jar
[JENKINS] Archiving <https://builds.apache.org/job/maven-plugins/ws/maven-pdf-plugin/pom.xml> to /home/hudson/hudson/jobs/maven-plugins/modules/org.apache.maven.plugins$maven-pdf-plugin/builds/2012-09-13_13-54-58/archive/org.apache.maven.plugins/maven-pdf-plugin/1.2-SNAPSHOT/maven-pdf-plugin-1.2-SNAPSHOT.pom
[JENKINS] Archiving <https://builds.apache.org/job/maven-plugins/ws/maven-pdf-plugin/target/maven-pdf-plugin-1.2-SNAPSHOT.jar> to /home/hudson/hudson/jobs/maven-plugins/modules/org.apache.maven.plugins$maven-pdf-plugin/builds/2012-09-13_13-54-58/archive/org.apache.maven.plugins/maven-pdf-plugin/1.2-SNAPSHOT/maven-pdf-plugin-1.2-SNAPSHOT.jar
[JENKINS] Archiving <https://builds.apache.org/job/maven-plugins/ws/maven-shade-plugin/pom.xml> to /home/hudson/hudson/jobs/maven-plugins/modules/org.apache.maven.plugins$maven-shade-plugin/builds/2012-09-13_13-55-00/archive/org.apache.maven.plugins/maven-shade-plugin/2.0.1-SNAPSHOT/maven-shade-plugin-2.0.1-SNAPSHOT.pom
[JENKINS] Archiving <https://builds.apache.org/job/maven-plugins/ws/maven-shade-plugin/target/maven-shade-plugin-2.0.1-SNAPSHOT.jar> to /home/hudson/hudson/jobs/maven-plugins/modules/org.apache.maven.plugins$maven-shade-plugin/builds/2012-09-13_13-55-00/archive/org.apache.maven.plugins/maven-shade-plugin/2.0.1-SNAPSHOT/maven-shade-plugin-2.0.1-SNAPSHOT.jar
[JENKINS] Archiving <https://builds.apache.org/job/maven-plugins/ws/maven-plugins/pom.xml> to /home/hudson/hudson/jobs/maven-plugins/modules/org.apache.maven.plugins$maven-plugins/builds/2012-09-13_13-54-55/archive/org.apache.maven.plugins/maven-plugins/24-SNAPSHOT/maven-plugins-24-SNAPSHOT.pom
[JENKINS] Archiving <https://builds.apache.org/job/maven-plugins/ws/maven-plugins/target/maven-plugins-24-SNAPSHOT-site.xml> to /home/hudson/hudson/jobs/maven-plugins/modules/org.apache.maven.plugins$maven-plugins/builds/2012-09-13_13-54-55/archive/org.apache.maven.plugins/maven-plugins/24-SNAPSHOT/maven-plugins-24-SNAPSHOT-site.xml
[JENKINS] Archiving <https://builds.apache.org/job/maven-plugins/ws/maven-linkcheck-plugin/pom.xml> to /home/hudson/hudson/jobs/maven-plugins/modules/org.apache.maven.plugins$maven-linkcheck-plugin/builds/2012-09-13_13-54-58/archive/org.apache.maven.plugins/maven-linkcheck-plugin/1.2-SNAPSHOT/maven-linkcheck-plugin-1.2-SNAPSHOT.pom
[JENKINS] Archiving <https://builds.apache.org/job/maven-plugins/ws/maven-linkcheck-plugin/target/maven-linkcheck-plugin-1.2-SNAPSHOT.jar> to /home/hudson/hudson/jobs/maven-plugins/modules/org.apache.maven.plugins$maven-linkcheck-plugin/builds/2012-09-13_13-54-58/archive/org.apache.maven.plugins/maven-linkcheck-plugin/1.2-SNAPSHOT/maven-linkcheck-plugin-1.2-SNAPSHOT.jar
[JENKINS] Archiving <https://builds.apache.org/job/maven-plugins/ws/maven-resources-plugin/pom.xml> to /home/hudson/hudson/jobs/maven-plugins/modules/org.apache.maven.plugins$maven-resources-plugin/builds/2012-09-13_13-54-59/archive/org.apache.maven.plugins/maven-resources-plugin/2.7-SNAPSHOT/maven-resources-plugin-2.7-SNAPSHOT.pom
[JENKINS] Archiving <https://builds.apache.org/job/maven-plugins/ws/maven-resources-plugin/target/maven-resources-plugin-2.7-SNAPSHOT.jar> to /home/hudson/hudson/jobs/maven-plugins/modules/org.apache.maven.plugins$maven-resources-plugin/builds/2012-09-13_13-54-59/archive/org.apache.maven.plugins/maven-resources-plugin/2.7-SNAPSHOT/maven-resources-plugin-2.7-SNAPSHOT.jar
Waiting for Jenkins to finish collecting data
mavenExecutionResult exceptions not empty
message : Failed to execute goal org.apache.maven.plugins:maven-compiler-plugin:2.5.1:compile (default-compile) on project maven-acr-plugin: Compilation failure
<https://builds.apache.org/job/maven-plugins/ws/maven-acr-plugin/src/main/java/org/apache/maven/plugin/acr/AcrMojo.java>:[22,-1] cannot access org.apache.commons.io.IOUtils
bad class file: /home/hudson/hudson-slave/maven-repositories/1/commons-io/commons-io/2.4/commons-io-2.4.jar(org/apache/commons/io/IOUtils.class)
class file has wrong version 50.0, should be 49.0

cause : Compilation failure
<https://builds.apache.org/job/maven-plugins/ws/maven-acr-plugin/src/main/java/org/apache/maven/plugin/acr/AcrMojo.java>:[22,-1] cannot access org.apache.commons.io.IOUtils
bad class file: /home/hudson/hudson-slave/maven-repositories/1/commons-io/commons-io/2.4/commons-io-2.4.jar(org/apache/commons/io/IOUtils.class)
class file has wrong version 50.0, should be 49.0

Stack trace : 
org.apache.maven.lifecycle.LifecycleExecutionException: Failed to execute goal org.apache.maven.plugins:maven-compiler-plugin:2.5.1:compile (default-compile) on project maven-acr-plugin: Compilation failure
<https://builds.apache.org/job/maven-plugins/ws/maven-acr-plugin/src/main/java/org/apache/maven/plugin/acr/AcrMojo.java>:[22,-1] cannot access org.apache.commons.io.IOUtils
bad class file: /home/hudson/hudson-slave/maven-repositories/1/commons-io/commons-io/2.4/commons-io-2.4.jar(org/apache/commons/io/IOUtils.class)
class file has wrong version 50.0, should be 49.0

	at org.apache.maven.lifecycle.internal.MojoExecutor.execute(MojoExecutor.java:213)
	at org.apache.maven.lifecycle.internal.MojoExecutor.execute(MojoExecutor.java:153)
	at org.apache.maven.lifecycle.internal.MojoExecutor.execute(MojoExecutor.java:145)
	at org.apache.maven.lifecycle.internal.LifecycleModuleBuilder.buildProject(LifecycleModuleBuilder.java:84)
	at org.apache.maven.lifecycle.internal.LifecycleThreadedBuilder$1.call(LifecycleThreadedBuilder.java:167)
	at org.apache.maven.lifecycle.internal.LifecycleThreadedBuilder$1.call(LifecycleThreadedBuilder.java:163)
	at java.util.concurrent.FutureTask$Sync.innerRun(FutureTask.java:269)
	at java.util.concurrent.FutureTask.run(FutureTask.java:123)
	at java.util.concurrent.ThreadPoolExecutor$Worker.runTask(ThreadPoolExecutor.java:651)
	at java.util.concurrent.ThreadPoolExecutor$Worker.run(ThreadPoolExecutor.java:676)
	at java.lang.Thread.run(Thread.java:595)
Caused by: org.apache.maven.plugin.CompilationFailureException: Compilation failure
<https://builds.apache.org/job/maven-plugins/ws/maven-acr-plugin/src/main/java/org/apache/maven/plugin/acr/AcrMojo.java>:[22,-1] cannot access org.apache.commons.io.IOUtils
bad class file: /home/hudson/hudson-slave/maven-repositories/1/commons-io/commons-io/2.4/commons-io-2.4.jar(org/apache/commons/io/IOUtils.class)
class file has wrong version 50.0, should be 49.0

	at org.apache.maven.plugin.AbstractCompilerMojo.execute(AbstractCompilerMojo.java:729)
	at org.apache.maven.plugin.CompilerMojo.execute(CompilerMojo.java:128)
	at org.apache.maven.plugin.DefaultBuildPluginManager.executeMojo(DefaultBuildPluginManager.java:101)
	at org.apache.maven.lifecycle.internal.MojoExecutor.execute(MojoExecutor.java:209)
	... 10 more
message : Failed to execute goal org.apache.maven.plugins:maven-compiler-plugin:2.5.1:compile (default-compile) on project maven-ejb-plugin: Compilation failure
<https://builds.apache.org/job/maven-plugins/ws/maven-ejb-plugin/src/main/java/org/apache/maven/plugin/ejb/EjbMojo.java>:[22,-1] cannot access org.apache.commons.io.IOUtils
bad class file: /home/hudson/hudson-slave/maven-repositories/1/commons-io/commons-io/2.4/commons-io-2.4.jar(org/apache/commons/io/IOUtils.class)
class file has wrong version 50.0, should be 49.0

cause : Compilation failure
<https://builds.apache.org/job/maven-plugins/ws/maven-ejb-plugin/src/main/java/org/apache/maven/plugin/ejb/EjbMojo.java>:[22,-1] cannot access org.apache.commons.io.IOUtils
bad class file: /home/hudson/hudson-slave/maven-repositories/1/commons-io/commons-io/2.4/commons-io-2.4.jar(org/apache/commons/io/IOUtils.class)
class file has wrong version 50.0, should be 49.0

Stack trace : 
org.apache.maven.lifecycle.LifecycleExecutionException: Failed to execute goal org.apache.maven.plugins:maven-compiler-plugin:2.5.1:compile (default-compile) on project maven-ejb-plugin: Compilation failure
<https://builds.apache.org/job/maven-plugins/ws/maven-ejb-plugin/src/main/java/org/apache/maven/plugin/ejb/EjbMojo.java>:[22,-1] cannot access org.apache.commons.io.IOUtils
bad class file: /home/hudson/hudson-slave/maven-repositories/1/commons-io/commons-io/2.4/commons-io-2.4.jar(org/apache/commons/io/IOUtils.class)
class file has wrong version 50.0, should be 49.0

	at org.apache.maven.lifecycle.internal.MojoExecutor.execute(MojoExecutor.java:213)
	at org.apache.maven.lifecycle.internal.MojoExecutor.execute(MojoExecutor.java:153)
	at org.apache.maven.lifecycle.internal.MojoExecutor.execute(MojoExecutor.java:145)
	at org.apache.maven.lifecycle.internal.LifecycleModuleBuilder.buildProject(LifecycleModuleBuilder.java:84)
	at org.apache.maven.lifecycle.internal.LifecycleThreadedBuilder$1.call(LifecycleThreadedBuilder.java:167)
	at org.apache.maven.lifecycle.internal.LifecycleThreadedBuilder$1.call(LifecycleThreadedBuilder.java:163)
	at java.util.concurrent.FutureTask$Sync.innerRun(FutureTask.java:269)
	at java.util.concurrent.FutureTask.run(FutureTask.java:123)
	at java.util.concurrent.ThreadPoolExecutor$Worker.runTask(ThreadPoolExecutor.java:651)
	at java.util.concurrent.ThreadPoolExecutor$Worker.run(ThreadPoolExecutor.java:676)
	at java.lang.Thread.run(Thread.java:595)
Caused by: org.apache.maven.plugin.CompilationFailureException: Compilation failure
<https://builds.apache.org/job/maven-plugins/ws/maven-ejb-plugin/src/main/java/org/apache/maven/plugin/ejb/EjbMojo.java>:[22,-1] cannot access org.apache.commons.io.IOUtils
bad class file: /home/hudson/hudson-slave/maven-repositories/1/commons-io/commons-io/2.4/commons-io-2.4.jar(org/apache/commons/io/IOUtils.class)
class file has wrong version 50.0, should be 49.0

	at org.apache.maven.plugin.AbstractCompilerMojo.execute(AbstractCompilerMojo.java:729)
	at org.apache.maven.plugin.CompilerMojo.execute(CompilerMojo.java:128)
	at org.apache.maven.plugin.DefaultBuildPluginManager.executeMojo(DefaultBuildPluginManager.java:101)
	at org.apache.maven.lifecycle.internal.MojoExecutor.execute(MojoExecutor.java:209)
	... 10 more
message : Failed to execute goal org.apache.maven.plugins:maven-compiler-plugin:2.5.1:compile (default-compile) on project maven-javadoc-plugin: Compilation failure
<https://builds.apache.org/job/maven-plugins/ws/maven-javadoc-plugin/src/main/java/org/apache/maven/plugin/javadoc/AbstractFixJavadocMojo.java>:[34,-1] cannot access org.apache.commons.io.IOUtils
bad class file: /home/hudson/hudson-slave/maven-repositories/1/commons-io/commons-io/2.4/commons-io-2.4.jar(org/apache/commons/io/IOUtils.class)
class file has wrong version 50.0, should be 49.0

cause : Compilation failure
<https://builds.apache.org/job/maven-plugins/ws/maven-javadoc-plugin/src/main/java/org/apache/maven/plugin/javadoc/AbstractFixJavadocMojo.java>:[34,-1] cannot access org.apache.commons.io.IOUtils
bad class file: /home/hudson/hudson-slave/maven-repositories/1/commons-io/commons-io/2.4/commons-io-2.4.jar(org/apache/commons/io/IOUtils.class)
class file has wrong version 50.0, should be 49.0

Stack trace : 
org.apache.maven.lifecycle.LifecycleExecutionException: Failed to execute goal org.apache.maven.plugins:maven-compiler-plugin:2.5.1:compile (default-compile) on project maven-javadoc-plugin: Compilation failure
<https://builds.apache.org/job/maven-plugins/ws/maven-javadoc-plugin/src/main/java/org/apache/maven/plugin/javadoc/AbstractFixJavadocMojo.java>:[34,-1] cannot access org.apache.commons.io.IOUtils
bad class file: /home/hudson/hudson-slave/maven-repositories/1/commons-io/commons-io/2.4/commons-io-2.4.jar(org/apache/commons/io/IOUtils.class)
class file has wrong version 50.0, should be 49.0

	at org.apache.maven.lifecycle.internal.MojoExecutor.execute(MojoExecutor.java:213)
	at org.apache.maven.lifecycle.internal.MojoExecutor.execute(MojoExecutor.java:153)
	at org.apache.maven.lifecycle.internal.MojoExecutor.execute(MojoExecutor.java:145)
	at org.apache.maven.lifecycle.internal.LifecycleModuleBuilder.buildProject(LifecycleModuleBuilder.java:84)
	at org.apache.maven.lifecycle.internal.LifecycleThreadedBuilder$1.call(LifecycleThreadedBuilder.java:167)
	at org.apache.maven.lifecycle.internal.LifecycleThreadedBuilder$1.call(LifecycleThreadedBuilder.java:163)
	at java.util.concurrent.FutureTask$Sync.innerRun(FutureTask.java:269)
	at java.util.concurrent.FutureTask.run(FutureTask.java:123)
	at java.util.concurrent.ThreadPoolExecutor$Worker.runTask(ThreadPoolExecutor.java:651)
	at java.util.concurrent.ThreadPoolExecutor$Worker.run(ThreadPoolExecutor.java:676)
	at java.lang.Thread.run(Thread.java:595)
Caused by: org.apache.maven.plugin.CompilationFailureException: Compilation failure
<https://builds.apache.org/job/maven-plugins/ws/maven-javadoc-plugin/src/main/java/org/apache/maven/plugin/javadoc/AbstractFixJavadocMojo.java>:[34,-1] cannot access org.apache.commons.io.IOUtils
bad class file: /home/hudson/hudson-slave/maven-repositories/1/commons-io/commons-io/2.4/commons-io-2.4.jar(org/apache/commons/io/IOUtils.class)
class file has wrong version 50.0, should be 49.0

	at org.apache.maven.plugin.AbstractCompilerMojo.execute(AbstractCompilerMojo.java:729)
	at org.apache.maven.plugin.CompilerMojo.execute(CompilerMojo.java:128)
	at org.apache.maven.plugin.DefaultBuildPluginManager.executeMojo(DefaultBuildPluginManager.java:101)
	at org.apache.maven.lifecycle.internal.MojoExecutor.execute(MojoExecutor.java:209)
	... 10 more
Sending e-mails to: notifications@maven.apache.org
channel stopped

Mime
View raw message