maven-notifications mailing list archives

Site index · List index
Message view « Date » · « Thread »
Top « Date » · « Thread »
From Apache Jenkins Server <jenk...@builds.apache.org>
Subject Build failed in Jenkins: maven-enforcer #31
Date Wed, 05 Sep 2012 21:22:24 GMT
See <https://builds.apache.org/job/maven-enforcer/31/changes>

Changes:

[olamy] [MENFORCER-136] New enforcer for environment variables.
Submitted by Marvin Froeder.

------------------------------------------
[...truncated 276 lines...]
AU        enforcer-rules/src/site/apt/noSnapshots.apt.vm
AU        enforcer-rules/src/site/apt/requireNoRepositories.apt.vm
AU        enforcer-rules/src/site/apt/requireProperty.apt.vm
AU        enforcer-rules/src/site/apt/requireReleaseVersion.apt.vm
AU        enforcer-rules/src/site/apt/evaluateBeanshell.apt.vm
AU        enforcer-rules/src/site/apt/requireJavaVersion.apt.vm
AU        enforcer-rules/src/site/apt/requirePluginVersions.apt.vm
AU        enforcer-rules/src/site/apt/index.apt
AU        enforcer-rules/src/site/apt/alwaysPass.apt.vm
AU        enforcer-rules/src/site/apt/requireReleaseDeps.apt.vm
AU        enforcer-rules/src/site/apt/requireFilesSize.apt.vm
A         enforcer-rules/src/site/apt/requireUpperBoundDeps.apt.vm
AU        enforcer-rules/src/site/apt/alwaysFail.apt.vm
AU        enforcer-rules/src/site/apt/dependencyConvergence.apt.vm
AU        enforcer-rules/src/site/apt/bannedDependencies.apt.vm
AU        enforcer-rules/src/site/apt/requireFilesDontExist.apt.vm
AU        enforcer-rules/src/site/apt/versionRanges.apt
AU        enforcer-rules/src/site/apt/requireMavenVersion.apt.vm
AU        enforcer-rules/pom.xml
 U        .
At revision 1381367
Parsing POMs
[maven-enforcer] $ /home/hudson/tools/java/latest1.5/bin/java -cp /export/home/hudson/hudson-slave/maven3-agent.jar:/home/hudson/tools/maven/apache-maven-3.0.3/boot/plexus-classworlds-2.4.jar
org.jvnet.hudson.maven3.agent.Maven3Main /home/hudson/tools/maven/apache-maven-3.0.3 /zonestorage/hudson_solaris/home/hudson/hudson-slave/slave.jar
/export/home/hudson/hudson-slave/maven3-interceptor.jar 54391
channel started
<===[JENKINS REMOTING CAPACITY]===>   log4j:WARN No appenders could be found for logger
(org.apache.commons.beanutils.converters.BooleanConverter).
log4j:WARN Please initialize the log4j system properly.
Executing Maven:  -B -f <https://builds.apache.org/job/maven-enforcer/ws/pom.xml> -Dmaven.repo.local=/export/home/hudson/hudson-slave/maven-repositories/0
clean install -B -U -e -fae -V
Apache Maven 3.0.3 (r1075438; 2011-02-28 17:31:09+0000)
Maven home: /zonestorage/hudson_solaris/home/hudson/tools/maven/apache-maven-3.0.3
Java version: 1.5.0_22, vendor: Sun Microsystems Inc.
Java home: /zonestorage/hudson_solaris/home/hudson/tools/java/jdk1.5.0_22/jre
Default locale: en, platform encoding: ISO646-US
OS name: "sunos", version: "5.10", arch: "x86", family: "unix"
[INFO] Error stacktraces are turned on.
[INFO] Scanning for projects...
[INFO] ------------------------------------------------------------------------
[INFO] Reactor Build Order:
[INFO] 
[INFO] Enforcer
[INFO] Enforcer API
[INFO] Enforcer Rules
[INFO] Maven Enforcer Plugin
Projects to build: [MavenProject: org.apache.maven.enforcer:enforcer:1.2-SNAPSHOT @ <https://builds.apache.org/job/maven-enforcer/ws/pom.xml,>
MavenProject: org.apache.maven.enforcer:enforcer-api:1.2-SNAPSHOT @ <https://builds.apache.org/job/maven-enforcer/ws/enforcer-api/pom.xml,>
MavenProject: org.apache.maven.enforcer:enforcer-rules:1.2-SNAPSHOT @ <https://builds.apache.org/job/maven-enforcer/ws/enforcer-rules/pom.xml,>
MavenProject: org.apache.maven.plugins:maven-enforcer-plugin:1.2-SNAPSHOT @ <https://builds.apache.org/job/maven-enforcer/ws/maven-enforcer-plugin/pom.xml]>
projectStarted org.apache.maven.enforcer:enforcer:1.2-SNAPSHOT
[INFO]                                                                         
[INFO] ------------------------------------------------------------------------
[INFO] Building Enforcer 1.2-SNAPSHOT
[INFO] ------------------------------------------------------------------------
mojoStarted org.apache.maven.plugins:maven-clean-plugin:2.5(default-clean)
[INFO] 
[INFO] --- maven-clean-plugin:2.5:clean (default-clean) @ enforcer ---
mojoSucceeded org.apache.maven.plugins:maven-clean-plugin:2.5(default-clean)
mojoStarted org.apache.maven.plugins:maven-remote-resources-plugin:1.3(default)
[INFO] 
[INFO] --- maven-remote-resources-plugin:1.3:process (default) @ enforcer ---
mojoSucceeded org.apache.maven.plugins:maven-remote-resources-plugin:1.3(default)
mojoStarted org.apache.maven.plugins:maven-site-plugin:3.1(attach-descriptor)
[INFO] 
[INFO] --- maven-site-plugin:3.1:attach-descriptor (attach-descriptor) @ enforcer ---
mojoSucceeded org.apache.maven.plugins:maven-site-plugin:3.1(attach-descriptor)
mojoStarted org.apache.maven.plugins:maven-install-plugin:2.3.1(default-install)
[INFO] 
[INFO] Installing <https://builds.apache.org/job/maven-enforcer/ws/pom.xml> to /export/home/hudson/hudson-slave/maven-repositories/0/org/apache/maven/enforcer/enforcer/1.2-SNAPSHOT/enforcer-1.2-SNAPSHOT.pom
[INFO] --- maven-install-plugin:2.3.1:install (default-install) @ enforcer ---
[INFO] Installing <https://builds.apache.org/job/maven-enforcer/ws/target/enforcer-1.2-SNAPSHOT-site.xml>
to /export/home/hudson/hudson-slave/maven-repositories/0/org/apache/maven/enforcer/enforcer/1.2-SNAPSHOT/enforcer-1.2-SNAPSHOT-site.xml
mojoSucceeded org.apache.maven.plugins:maven-install-plugin:2.3.1(default-install)
projectSucceeded org.apache.maven.enforcer:enforcer:1.2-SNAPSHOT
projectStarted org.apache.maven.enforcer:enforcer-api:1.2-SNAPSHOT
[INFO]                                                                         
[INFO] ------------------------------------------------------------------------
[INFO] Building Enforcer API 1.2-SNAPSHOT
[INFO] ------------------------------------------------------------------------
mojoStarted org.apache.maven.plugins:maven-clean-plugin:2.5(default-clean)
[INFO] 
[INFO] --- maven-clean-plugin:2.5:clean (default-clean) @ enforcer-api ---
mojoSucceeded org.apache.maven.plugins:maven-clean-plugin:2.5(default-clean)
mojoStarted org.apache.maven.plugins:maven-remote-resources-plugin:1.3(default)
[INFO] 
[INFO] --- maven-remote-resources-plugin:1.3:process (default) @ enforcer-api ---
mojoSucceeded org.apache.maven.plugins:maven-remote-resources-plugin:1.3(default)
mojoStarted org.apache.maven.plugins:maven-resources-plugin:2.5(default-resources)
[INFO] 
[INFO] --- maven-resources-plugin:2.5:resources (default-resources) @ enforcer-api ---
[debug] execute contextualize
[INFO] Using 'UTF-8' encoding to copy filtered resources.
[INFO] skip non existing resourceDirectory <https://builds.apache.org/job/maven-enforcer/ws/enforcer-api/src/main/resources>
[INFO] Copying 3 resources
mojoSucceeded org.apache.maven.plugins:maven-resources-plugin:2.5(default-resources)
mojoStarted org.apache.maven.plugins:maven-compiler-plugin:2.5.1(default-compile)
[INFO] 
[INFO] --- maven-compiler-plugin:2.5.1:compile (default-compile) @ enforcer-api ---
[INFO] Compiling 3 source files to <https://builds.apache.org/job/maven-enforcer/ws/enforcer-api/target/classes>
mojoSucceeded org.apache.maven.plugins:maven-compiler-plugin:2.5.1(default-compile)
mojoStarted org.codehaus.plexus:plexus-maven-plugin:1.3.8(default)
[INFO] 
[INFO] --- plexus-maven-plugin:1.3.8:descriptor (default) @ enforcer-api ---
mojoSucceeded org.codehaus.plexus:plexus-maven-plugin:1.3.8(default)
mojoStarted org.apache.maven.plugins:maven-resources-plugin:2.5(default-testResources)
[INFO] 
[debug] execute contextualize
[INFO] Using 'UTF-8' encoding to copy filtered resources.
[INFO] skip non existing resourceDirectory <https://builds.apache.org/job/maven-enforcer/ws/enforcer-api/src/test/resources>
[INFO] Copying 3 resources
[INFO] --- maven-resources-plugin:2.5:testResources (default-testResources) @ enforcer-api
---
mojoSucceeded org.apache.maven.plugins:maven-resources-plugin:2.5(default-testResources)
mojoStarted org.apache.maven.plugins:maven-compiler-plugin:2.5.1(default-testCompile)
[INFO] 
[INFO] No sources to compile
[INFO] --- maven-compiler-plugin:2.5.1:testCompile (default-testCompile) @ enforcer-api ---
mojoSucceeded org.apache.maven.plugins:maven-compiler-plugin:2.5.1(default-testCompile)
mojoStarted org.apache.maven.plugins:maven-surefire-plugin:2.12(default-test)
[INFO] 
[INFO] --- maven-surefire-plugin:2.12:test (default-test) @ enforcer-api ---
[INFO] Surefire report directory: <https://builds.apache.org/job/maven-enforcer/ws/enforcer-api/target/surefire-reports>

-------------------------------------------------------
 T E S T S
-------------------------------------------------------

Results :

Tests run: 0, Failures: 0, Errors: 0, Skipped: 0

mojoSucceeded org.apache.maven.plugins:maven-surefire-plugin:2.12(default-test)
[JENKINS] Recording test results
mojoStarted org.apache.maven.plugins:maven-jar-plugin:2.4(default-jar)
[INFO] 
[INFO] --- maven-jar-plugin:2.4:jar (default-jar) @ enforcer-api ---
[INFO] Building jar: <https://builds.apache.org/job/maven-enforcer/ws/enforcer-api/target/enforcer-api-1.2-SNAPSHOT.jar>
mojoSucceeded org.apache.maven.plugins:maven-jar-plugin:2.4(default-jar)
mojoStarted org.apache.maven.plugins:maven-site-plugin:3.1(attach-descriptor)
[INFO] 
[INFO] --- maven-site-plugin:3.1:attach-descriptor (attach-descriptor) @ enforcer-api ---
mojoSucceeded org.apache.maven.plugins:maven-site-plugin:3.1(attach-descriptor)
mojoStarted org.apache.maven.plugins:maven-install-plugin:2.3.1(default-install)
[INFO] 
[INFO] Installing <https://builds.apache.org/job/maven-enforcer/ws/enforcer-api/target/enforcer-api-1.2-SNAPSHOT.jar>
to /export/home/hudson/hudson-slave/maven-repositories/0/org/apache/maven/enforcer/enforcer-api/1.2-SNAPSHOT/enforcer-api-1.2-SNAPSHOT.jar
[INFO] Installing <https://builds.apache.org/job/maven-enforcer/ws/enforcer-api/pom.xml>
to /export/home/hudson/hudson-slave/maven-repositories/0/org/apache/maven/enforcer/enforcer-api/1.2-SNAPSHOT/enforcer-api-1.2-SNAPSHOT.pom
[INFO] --- maven-install-plugin:2.3.1:install (default-install) @ enforcer-api ---
mojoSucceeded org.apache.maven.plugins:maven-install-plugin:2.3.1(default-install)
projectSucceeded org.apache.maven.enforcer:enforcer-api:1.2-SNAPSHOT
projectStarted org.apache.maven.enforcer:enforcer-rules:1.2-SNAPSHOT
[INFO]                                                                         
[INFO] ------------------------------------------------------------------------
[INFO] Building Enforcer Rules 1.2-SNAPSHOT
[INFO] ------------------------------------------------------------------------
mojoStarted org.apache.maven.plugins:maven-clean-plugin:2.5(default-clean)
[INFO] 
[INFO] --- maven-clean-plugin:2.5:clean (default-clean) @ enforcer-rules ---
mojoSucceeded org.apache.maven.plugins:maven-clean-plugin:2.5(default-clean)
mojoStarted org.apache.maven.plugins:maven-remote-resources-plugin:1.3(default)
[INFO] 
[INFO] --- maven-remote-resources-plugin:1.3:process (default) @ enforcer-rules ---
mojoSucceeded org.apache.maven.plugins:maven-remote-resources-plugin:1.3(default)
mojoStarted org.apache.maven.plugins:maven-resources-plugin:2.5(default-resources)
[INFO] 
[debug] execute contextualize
[INFO] Using 'UTF-8' encoding to copy filtered resources.
[INFO] skip non existing resourceDirectory <https://builds.apache.org/job/maven-enforcer/ws/enforcer-rules/src/main/resources>
[INFO] Copying 3 resources
[INFO] --- maven-resources-plugin:2.5:resources (default-resources) @ enforcer-rules ---
mojoSucceeded org.apache.maven.plugins:maven-resources-plugin:2.5(default-resources)
mojoStarted org.apache.maven.plugins:maven-compiler-plugin:2.5.1(default-compile)
[INFO] 
[INFO] --- maven-compiler-plugin:2.5.1:compile (default-compile) @ enforcer-rules ---
[INFO] Compiling 30 source files to <https://builds.apache.org/job/maven-enforcer/ws/enforcer-rules/target/classes>
[INFO] -------------------------------------------------------------
[ERROR] COMPILATION ERROR : 
[INFO] -------------------------------------------------------------
[ERROR] <https://builds.apache.org/job/maven-enforcer/ws/enforcer-rules/src/main/java/org/apache/maven/plugins/enforcer/RequireProperty.java>:[32,12]
cannot find symbol
symbol: class AbstractPropertyEnforcerRule
    extends AbstractPropertyEnforcerRule
[ERROR] <https://builds.apache.org/job/maven-enforcer/ws/enforcer-rules/src/main/java/org/apache/maven/plugins/enforcer/RequireProperty.java>:[38,5]
method does not override a method from its superclass
[ERROR] <https://builds.apache.org/job/maven-enforcer/ws/enforcer-rules/src/main/java/org/apache/maven/plugins/enforcer/RequireProperty.java>:[59,5]
method does not override a method from its superclass
[ERROR] <https://builds.apache.org/job/maven-enforcer/ws/enforcer-rules/src/main/java/org/apache/maven/plugins/enforcer/RequireProperty.java>:[65,5]
method does not override a method from its superclass
[INFO] 4 errors 
[INFO] -------------------------------------------------------------
mojoFailed org.apache.maven.plugins:maven-compiler-plugin:2.5.1(default-compile)
projectFailed org.apache.maven.enforcer:enforcer-rules:1.2-SNAPSHOT
projectSkipped org.apache.maven.plugins:maven-enforcer-plugin:1.2-SNAPSHOT
[INFO]                                                                         
[INFO] ------------------------------------------------------------------------
[INFO] Skipping Maven Enforcer Plugin
[INFO] This project has been banned from the build due to previous failures.
[INFO] ------------------------------------------------------------------------
sessionEnded
[INFO] ------------------------------------------------------------------------
[INFO] Reactor Summary:
[INFO] 
[INFO] Enforcer .......................................... SUCCESS [2:11.252s]
[INFO] Enforcer API ...................................... SUCCESS [42.356s]
[INFO] Enforcer Rules .................................... FAILURE [17.125s]
[INFO] Maven Enforcer Plugin ............................. SKIPPED
[INFO] ------------------------------------------------------------------------
[INFO] BUILD FAILURE
[INFO] ------------------------------------------------------------------------
[INFO] Total time: 3:34.009s
[INFO] Finished at: Wed Sep 05 21:22:04 GMT+00:00 2012
[INFO] Final Memory: 15M/194M
[INFO] ------------------------------------------------------------------------
Projects to build: [MavenProject: org.apache.maven.enforcer:enforcer:1.2-SNAPSHOT @ <https://builds.apache.org/job/maven-enforcer/ws/pom.xml,>
MavenProject: org.apache.maven.enforcer:enforcer-api:1.2-SNAPSHOT @ <https://builds.apache.org/job/maven-enforcer/ws/enforcer-api/pom.xml,>
MavenProject: org.apache.maven.enforcer:enforcer-rules:1.2-SNAPSHOT @ <https://builds.apache.org/job/maven-enforcer/ws/enforcer-rules/pom.xml,>
MavenProject: org.apache.maven.plugins:maven-enforcer-plugin:1.2-SNAPSHOT @ <https://builds.apache.org/job/maven-enforcer/ws/maven-enforcer-plugin/pom.xml]>
[JENKINS] Archiving <https://builds.apache.org/job/maven-enforcer/ws/enforcer-api/pom.xml>
to /home/hudson/hudson/jobs/maven-enforcer/modules/org.apache.maven.enforcer$enforcer-api/builds/2012-09-05_21-16-38/archive/org.apache.maven.enforcer/enforcer-api/1.2-SNAPSHOT/enforcer-api-1.2-SNAPSHOT.pom
[JENKINS] Archiving <https://builds.apache.org/job/maven-enforcer/ws/enforcer-api/target/enforcer-api-1.2-SNAPSHOT.jar>
to /home/hudson/hudson/jobs/maven-enforcer/modules/org.apache.maven.enforcer$enforcer-api/builds/2012-09-05_21-16-38/archive/org.apache.maven.enforcer/enforcer-api/1.2-SNAPSHOT/enforcer-api-1.2-SNAPSHOT.jar
[JENKINS] Archiving <https://builds.apache.org/job/maven-enforcer/ws/pom.xml> to /home/hudson/hudson/jobs/maven-enforcer/modules/org.apache.maven.enforcer$enforcer/builds/2012-09-05_21-16-38/archive/org.apache.maven.enforcer/enforcer/1.2-SNAPSHOT/enforcer-1.2-SNAPSHOT.pom
[JENKINS] Archiving <https://builds.apache.org/job/maven-enforcer/ws/target/enforcer-1.2-SNAPSHOT-site.xml>
to /home/hudson/hudson/jobs/maven-enforcer/modules/org.apache.maven.enforcer$enforcer/builds/2012-09-05_21-16-38/archive/org.apache.maven.enforcer/enforcer/1.2-SNAPSHOT/enforcer-1.2-SNAPSHOT-site.xml
[JENKINS] Archiving <https://builds.apache.org/job/maven-enforcer/ws/maven-enforcer-plugin/pom.xml>
to /home/hudson/hudson/jobs/maven-enforcer/modules/org.apache.maven.plugins$maven-enforcer-plugin/builds/2012-09-05_21-16-39/archive/org.apache.maven.plugins/maven-enforcer-plugin/1.2-SNAPSHOT/maven-enforcer-plugin-1.2-SNAPSHOT.pom
[JENKINS] Archiving <https://builds.apache.org/job/maven-enforcer/ws/enforcer-rules/pom.xml>
to /home/hudson/hudson/jobs/maven-enforcer/modules/org.apache.maven.enforcer$enforcer-rules/builds/2012-09-05_21-16-38/archive/org.apache.maven.enforcer/enforcer-rules/1.2-SNAPSHOT/enforcer-rules-1.2-SNAPSHOT.pom
Waiting for Jenkins to finish collecting data
mavenExecutionResult exceptions not empty
message : Failed to execute goal org.apache.maven.plugins:maven-compiler-plugin:2.5.1:compile
(default-compile) on project enforcer-rules: Compilation failure
cause : Compilation failure
Stack trace : 
org.apache.maven.lifecycle.LifecycleExecutionException: Failed to execute goal org.apache.maven.plugins:maven-compiler-plugin:2.5.1:compile
(default-compile) on project enforcer-rules: Compilation failure
	at org.apache.maven.lifecycle.internal.MojoExecutor.execute(MojoExecutor.java:213)
	at org.apache.maven.lifecycle.internal.MojoExecutor.execute(MojoExecutor.java:153)
	at org.apache.maven.lifecycle.internal.MojoExecutor.execute(MojoExecutor.java:145)
	at org.apache.maven.lifecycle.internal.LifecycleModuleBuilder.buildProject(LifecycleModuleBuilder.java:84)
	at org.apache.maven.lifecycle.internal.LifecycleModuleBuilder.buildProject(LifecycleModuleBuilder.java:59)
	at org.apache.maven.lifecycle.internal.LifecycleStarter.singleThreadedBuild(LifecycleStarter.java:183)
	at org.apache.maven.lifecycle.internal.LifecycleStarter.execute(LifecycleStarter.java:161)
	at org.apache.maven.DefaultMaven.doExecute(DefaultMaven.java:319)
	at org.apache.maven.DefaultMaven.execute(DefaultMaven.java:156)
	at org.jvnet.hudson.maven3.launcher.Maven3Launcher.main(Maven3Launcher.java:79)
	at sun.reflect.NativeMethodAccessorImpl.invoke0(Native Method)
	at sun.reflect.NativeMethodAccessorImpl.invoke(NativeMethodAccessorImpl.java:39)
	at sun.reflect.DelegatingMethodAccessorImpl.invoke(DelegatingMethodAccessorImpl.java:25)
	at java.lang.reflect.Method.invoke(Method.java:592)
	at org.codehaus.plexus.classworlds.launcher.Launcher.launchStandard(Launcher.java:329)
	at org.codehaus.plexus.classworlds.launcher.Launcher.launch(Launcher.java:239)
	at org.jvnet.hudson.maven3.agent.Maven3Main.launch(Maven3Main.java:158)
	at hudson.maven.Maven3Builder.call(Maven3Builder.java:98)
	at hudson.maven.Maven3Builder.call(Maven3Builder.java:64)
	at hudson.remoting.UserRequest.perform(UserRequest.java:118)
	at hudson.remoting.UserRequest.perform(UserRequest.java:48)
	at hudson.remoting.Request$2.run(Request.java:326)
	at hudson.remoting.InterceptingExecutorService$1.call(InterceptingExecutorService.java:72)
	at java.util.concurrent.FutureTask$Sync.innerRun(FutureTask.java:269)
	at java.util.concurrent.FutureTask.run(FutureTask.java:123)
	at java.util.concurrent.ThreadPoolExecutor$Worker.runTask(ThreadPoolExecutor.java:651)
	at java.util.concurrent.ThreadPoolExecutor$Worker.run(ThreadPoolExecutor.java:676)
	at java.lang.Thread.run(Thread.java:595)
Caused by: org.apache.maven.plugin.CompilationFailureException: Compilation failure
	at org.apache.maven.plugin.AbstractCompilerMojo.execute(AbstractCompilerMojo.java:729)
	at org.apache.maven.plugin.CompilerMojo.execute(CompilerMojo.java:128)
	at org.apache.maven.plugin.DefaultBuildPluginManager.executeMojo(DefaultBuildPluginManager.java:101)
	at org.apache.maven.lifecycle.internal.MojoExecutor.execute(MojoExecutor.java:209)
	... 27 more
Sending e-mails to: notifications@maven.apache.org olamy@apache.org
channel stopped

Mime
View raw message