maven-notifications mailing list archives

Site index · List index
Message view « Date » · « Thread »
Top « Date » · « Thread »
From Apache Jenkins Server <jenk...@builds.apache.org>
Subject Build failed in Jenkins: maven-plugins-ITs-m3 #622
Date Tue, 04 Sep 2012 22:25:51 GMT
See <https://builds.apache.org/job/maven-plugins-ITs-m3/622/changes>

Changes:

[olamy] remove an other user.home use

[olamy] herve doesn't like user.home :-)

[olamy] fix documentation

------------------------------------------
[...truncated 562 lines...]
Tests run: 2, Failures: 0, Errors: 0, Skipped: 0, Time elapsed: 0.067 sec
Running org.apache.maven.plugin.eclipse.writers.EclipseOSGiManifestWriterTest
Tests run: 3, Failures: 0, Errors: 0, Skipped: 0, Time elapsed: 0 sec
Running org.apache.maven.plugin.eclipse.writers.workspace.EclipseCodeFormatterTest
Tests run: 1, Failures: 0, Errors: 0, Skipped: 0, Time elapsed: 0.011 sec
Running org.apache.maven.plugin.eclipse.writers.EclipseProjectWriterTest
[info] File /x1/jenkins/jenkins-slave/workspace/maven-plugins-ITs-m3/maven-eclipse-plugin/target/EclipseProjectWriter.unitTest.1346797243653/.project
already exists.
       Additional settings will be preserved, run mvn eclipse:clean if you want old settings
to be removed.
Tests run: 1, Failures: 0, Errors: 0, Skipped: 0, Time elapsed: 0.027 sec
Running org.apache.maven.plugin.eclipse.EclipseSourceDirTest
Tests run: 9, Failures: 0, Errors: 0, Skipped: 0, Time elapsed: 0.001 sec
Running org.apache.maven.plugin.eclipse.EclipsePluginUnitTest
[debug] testOutput toRelativeAndFixSeparator /x1/jenkins/jenkins-slave/workspace/maven-plugins-ITs-m3/maven-eclipse-plugin/target/EclipsePlugin.unitTest.1346797243686
, target/main-output
[debug] testOutput after toRelative : target/main-output
[debug] Processing resource dir: src/main/resources
[debug] Making relative and fixing separator: { /x1/jenkins/jenkins-slave/workspace/maven-plugins-ITs-m3/maven-eclipse-plugin/target/EclipsePlugin.unitTest.1346797243686,
/x1/jenkins/jenkins-slave/workspace/maven-plugins-ITs-m3/maven-eclipse-plugin/target/EclipsePlugin.unitTest.1346797243686/target/main-output,
false }.
[debug] Processing resource dir: src/main/resources
[debug] Making relative and fixing separator: { /x1/jenkins/jenkins-slave/workspace/maven-plugins-ITs-m3/maven-eclipse-plugin/target/EclipsePlugin.unitTest.1346797243726,
/x1/jenkins/jenkins-slave/workspace/maven-plugins-ITs-m3/maven-eclipse-plugin/target/EclipsePlugin.unitTest.1346797243726/target/classes/main-output,
false }.
[debug] Processing resource dir: src/main/resources
[debug] Making relative and fixing separator: { /x1/jenkins/jenkins-slave/workspace/maven-plugins-ITs-m3/maven-eclipse-plugin/target/EclipsePlugin.unitTest.1346797243748,
/x1/jenkins/jenkins-slave/workspace/maven-plugins-ITs-m3/maven-eclipse-plugin/target/EclipsePlugin.unitTest.1346797243748/target/main-output,
false }.
[debug] Processing resource dir: src/main/resources
[debug] Making relative and fixing separator: { /x1/jenkins/jenkins-slave/workspace/maven-plugins-ITs-m3/maven-eclipse-plugin/target/EclipsePlugin.unitTest.1346797243770,
/x1/jenkins/jenkins-slave/workspace/maven-plugins-ITs-m3/maven-eclipse-plugin/target/EclipsePlugin.unitTest.1346797243770/target/classes,
false }.
[debug] Processing resource dir: src/test/resources
[debug] Making relative and fixing separator: { /x1/jenkins/jenkins-slave/workspace/maven-plugins-ITs-m3/maven-eclipse-plugin/target/EclipsePlugin.unitTest.1346797243770,
/x1/jenkins/jenkins-slave/workspace/maven-plugins-ITs-m3/maven-eclipse-plugin/target/EclipsePlugin.unitTest.1346797243770/target/test-classes,
false }.
[debug] Processing resource dir: src/main/resources
[debug] Making relative and fixing separator: { /x1/jenkins/jenkins-slave/workspace/maven-plugins-ITs-m3/maven-eclipse-plugin/target/EclipsePlugin.unitTest.1346797243814,
/x1/jenkins/jenkins-slave/workspace/maven-plugins-ITs-m3/maven-eclipse-plugin/target/EclipsePlugin.unitTest.1346797243814/target/classes,
false }.
[debug] Processing resource dir: src/test/resources
[debug] Making relative and fixing separator: { /x1/jenkins/jenkins-slave/workspace/maven-plugins-ITs-m3/maven-eclipse-plugin/target/EclipsePlugin.unitTest.1346797243814,
/x1/jenkins/jenkins-slave/workspace/maven-plugins-ITs-m3/maven-eclipse-plugin/target/EclipsePlugin.unitTest.1346797243814/target/test-classes,
false }.
Tests run: 5, Failures: 0, Errors: 0, Skipped: 0, Time elapsed: 0.155 sec
Running org.apache.maven.plugin.eclipse.EclipseToMavenTest
Tests run: 5, Failures: 0, Errors: 0, Skipped: 0, Time elapsed: 0.014 sec
Running org.apache.maven.plugin.eclipse.MakeArtifactsTest
Tests run: 5, Failures: 0, Errors: 0, Skipped: 0, Time elapsed: 0 sec
Running org.apache.maven.plugin.eclipse.InstallPluginsMojoTest
[debug] Processing Eclipse plugin dependency: jira.meclipse_418:correct_bundle_headers:eclipse-plugin:classifier-unused:1
[debug] Copying: jira.meclipse_418:correct_bundle_headers:eclipse-plugin:classifier-unused:1
to: /x1/jenkins/jenkins-slave/workspace/maven-plugins-ITs-m3/maven-eclipse-plugin/target/InstallPluginsMojo.test.1346797243860/plugins/jira.meclipse_418_1.0.0.jar
[debug] Processing Eclipse plugin dependency: jira.meclipse_418:no_bundle_name:eclipse-plugin:classifier-unused:1
[debug] Copying: jira.meclipse_418:no_bundle_name:eclipse-plugin:classifier-unused:1 to: /x1/jenkins/jenkins-slave/workspace/maven-plugins-ITs-m3/maven-eclipse-plugin/target/InstallPluginsMojo.test.1346797243923/plugins/jira.meclipse_418_1.0.0.jar
[debug] Processing Eclipse plugin dependency: jira.meclipse_418:no_bundle_symbolicname:eclipse-plugin:classifier-unused:1
[debug] Copying: jira.meclipse_418:no_bundle_symbolicname:eclipse-plugin:classifier-unused:1
to: /x1/jenkins/jenkins-slave/workspace/maven-plugins-ITs-m3/maven-eclipse-plugin/target/InstallPluginsMojo.test.1346797243946/plugins/jira.meclipse_418.no_bundle_symbolicname_1.0.0.jar
[debug] Processing Eclipse plugin dependency: jira.meclipse_418:no_manifest_headers:eclipse-plugin:classifier-unused:1
[debug] Ignoring no_manifest_headers as it is not an OSGi bundle (no Bundle-SymbolicName or
Bundle-Name in manifest)
[debug] Processing Eclipse plugin dependency: jira:meclipse_488:eclipse-plugin:classifier-unused:1
[debug] Ignoring meclipse_488 as it is does not have a Manifest (and so is not an OSGi bundle)
[debug] Processing Eclipse plugin dependency: org.eclipse.core:runtime:eclipse-plugin:classifier-unused:3.2.0-v20060603
[debug] Copying: org.eclipse.core:runtime:eclipse-plugin:classifier-unused:3.2.0-v20060603
to: /x1/jenkins/jenkins-slave/workspace/maven-plugins-ITs-m3/maven-eclipse-plugin/target/InstallPluginsMojo.test.1346797244015/plugins/org.eclipse.core.runtime_3.2.0.v20060603.jar
[debug] Processing Eclipse plugin dependency: org.eclipse.core:runtime:eclipse-plugin:classifier-unused:3.2.0-v20060603
[debug] Copying: org.eclipse.core:runtime:eclipse-plugin:classifier-unused:3.2.0-v20060603
to: /x1/jenkins/jenkins-slave/workspace/maven-plugins-ITs-m3/maven-eclipse-plugin/target/InstallPluginsMojo.test.1346797244038/plugins/org.eclipse.core.runtime_3.2.0.v20060603.jar
[debug] Processing Eclipse plugin dependency: org.eclipse.core:runtime:eclipse-plugin:classifier-unused:3.2.0-v20060603
[debug] Expanding: org.eclipse.core:runtime:eclipse-plugin:classifier-unused:3.2.0-v20060603
into: /x1/jenkins/jenkins-slave/workspace/maven-plugins-ITs-m3/maven-eclipse-plugin/target/InstallPluginsMojo.test.1346797244062/plugins/org.eclipse.core.runtime_3.2.0.v20060603
[INFO] Expanding: /x1/jenkins/jenkins-slave/workspace/maven-plugins-ITs-m3/maven-eclipse-plugin/target/test-classes/m2repo/eclipseinstall/org/eclipse/core/runtime/3.2.0-v20060603/runtime-3.2.0-v20060603.jar
into /x1/jenkins/jenkins-slave/workspace/maven-plugins-ITs-m3/maven-eclipse-plugin/target/InstallPluginsMojo.test.1346797244062/plugins/org.eclipse.core.runtime_3.2.0.v20060603
[debug] Processing Eclipse plugin dependency: org.eclipse.core:runtime:eclipse-plugin:classifier-unused:3.2.0-v20060603
[debug] Copying: org.eclipse.core:runtime:eclipse-plugin:classifier-unused:3.2.0-v20060603
to: /x1/jenkins/jenkins-slave/workspace/maven-plugins-ITs-m3/maven-eclipse-plugin/target/InstallPluginsMojo.test.1346797244126/plugins/org.eclipse.core.runtime_3.2.0.v20060603.jar
[debug] Skipping dependency: org.eclipse.core:runtime:eclipse-plugin:classifier-unused:3.2.0-v20060603.
Set pluginDependencyTypes with a comma-separated list of types to change this.
[debug] Processing Eclipse plugin dependency: org.eclipse.core:runtime:eclipse-plugin:classifier-unused:3.2.0-v20060603
[warn] Overwriting old plugin with contents of: org.eclipse.core:runtime:eclipse-plugin:classifier-unused:3.2.0-v20060603
[debug] Removing old plugin from both: /x1/jenkins/jenkins-slave/workspace/maven-plugins-ITs-m3/maven-eclipse-plugin/target/InstallPluginsMojo.test.1346797244171/plugins/org.eclipse.core.runtime_3.2.0.v20060603.jar
and: /x1/jenkins/jenkins-slave/workspace/maven-plugins-ITs-m3/maven-eclipse-plugin/target/InstallPluginsMojo.test.1346797244171/plugins/org.eclipse.core.runtime_3.2.0.v20060603
[debug] Removal of old plugin is complete; proceeding with plugin installation.
[debug] Expanding: org.eclipse.core:runtime:eclipse-plugin:classifier-unused:3.2.0-v20060603
into: /x1/jenkins/jenkins-slave/workspace/maven-plugins-ITs-m3/maven-eclipse-plugin/target/InstallPluginsMojo.test.1346797244171/plugins/org.eclipse.core.runtime_3.2.0.v20060603
[INFO] Expanding: /x1/jenkins/jenkins-slave/workspace/maven-plugins-ITs-m3/maven-eclipse-plugin/target/test-classes/m2repo/eclipseinstall/org/eclipse/core/runtime/3.2.0-v20060603/runtime-3.2.0-v20060603.jar
into /x1/jenkins/jenkins-slave/workspace/maven-plugins-ITs-m3/maven-eclipse-plugin/target/InstallPluginsMojo.test.1346797244171/plugins/org.eclipse.core.runtime_3.2.0.v20060603
[debug] Processing Eclipse plugin dependency: org.eclipse.core:runtime:eclipse-plugin:classifier-unused:3.2.0-v20060603
[warn] Overwriting old plugin with contents of: org.eclipse.core:runtime:eclipse-plugin:classifier-unused:3.2.0-v20060603
[debug] Removing old plugin from both: /x1/jenkins/jenkins-slave/workspace/maven-plugins-ITs-m3/maven-eclipse-plugin/target/InstallPluginsMojo.test.1346797244223/plugins/org.eclipse.core.runtime_3.2.0.v20060603.jar
and: /x1/jenkins/jenkins-slave/workspace/maven-plugins-ITs-m3/maven-eclipse-plugin/target/InstallPluginsMojo.test.1346797244223/plugins/org.eclipse.core.runtime_3.2.0.v20060603
[debug] Removal of old plugin is complete; proceeding with plugin installation.
[debug] Copying: org.eclipse.core:runtime:eclipse-plugin:classifier-unused:3.2.0-v20060603
to: /x1/jenkins/jenkins-slave/workspace/maven-plugins-ITs-m3/maven-eclipse-plugin/target/InstallPluginsMojo.test.1346797244223/plugins/org.eclipse.core.runtime_3.2.0.v20060603.jar
Tests run: 12, Failures: 0, Errors: 0, Skipped: 0, Time elapsed: 0.403 sec
Running org.apache.maven.plugin.eclipse.reader.ReadWorkspaceLocationsTest
Tests run: 5, Failures: 0, Errors: 0, Skipped: 0, Time elapsed: 0.126 sec
Running org.apache.maven.plugin.ide.IdeUtilsTest
Tests run: 5, Failures: 0, Errors: 0, Skipped: 0, Time elapsed: 0 sec

Results :

Tests run: 56, Failures: 0, Errors: 0, Skipped: 0

[INFO] 
[INFO] --- maven-jar-plugin:2.4:jar (default-jar) @ maven-eclipse-plugin ---
[INFO] Building jar: /x1/jenkins/jenkins-slave/workspace/maven-plugins-ITs-m3/maven-eclipse-plugin/target/maven-eclipse-plugin-2.10-SNAPSHOT.jar
[INFO] 
[INFO] --- maven-plugin-plugin:2.4.3:addPluginArtifactMetadata (default-addPluginArtifactMetadata)
@ maven-eclipse-plugin ---
[INFO] 
[INFO] --- maven-invoker-plugin:1.6:install (integration-test) @ maven-eclipse-plugin ---
[INFO] Installing /x1/jenkins/jenkins-slave/workspace/maven-plugins-ITs-m3/maven-eclipse-plugin/pom.xml
to /x1/jenkins/jenkins-slave/workspace/maven-plugins-ITs-m3/maven-eclipse-plugin/target/local-repo/org/apache/maven/plugins/maven-eclipse-plugin/2.10-SNAPSHOT/maven-eclipse-plugin-2.10-SNAPSHOT.pom
[INFO] Installing /x1/jenkins/jenkins-slave/workspace/maven-plugins-ITs-m3/maven-eclipse-plugin/target/maven-eclipse-plugin-2.10-SNAPSHOT.jar
to /x1/jenkins/jenkins-slave/workspace/maven-plugins-ITs-m3/maven-eclipse-plugin/target/local-repo/org/apache/maven/plugins/maven-eclipse-plugin/2.10-SNAPSHOT/maven-eclipse-plugin-2.10-SNAPSHOT.jar
[INFO] 
[INFO] --- maven-failsafe-plugin:2.12:integration-test (default) @ maven-eclipse-plugin ---
[INFO] Failsafe report directory: /x1/jenkins/jenkins-slave/workspace/maven-plugins-ITs-m3/maven-eclipse-plugin/target/failsafe-reports

-------------------------------------------------------
 T E S T S
-------------------------------------------------------
Running org.apache.maven.plugin.eclipse.it.EclipsePluginMasterProjectIT
*** Running test builds; output will be directed to: target/failsafe-reports/build-output

Using target/it-build-target and target/it-build-target/classes to build IT version of plugin
Now Building test version of the plugin...
Using staged plugin-pom: /x1/jenkins/jenkins-slave/workspace/maven-plugins-ITs-m3/maven-eclipse-plugin/pom-test.xml
Using IT Plugin Jar: /x1/jenkins/jenkins-slave/workspace/maven-plugins-ITs-m3/maven-eclipse-plugin/target/it-build-target/maven-eclipse-plugin-test.jar
[INFO] Installing /x1/jenkins/jenkins-slave/workspace/maven-plugins-ITs-m3/maven-eclipse-plugin/target/it-build-target/maven-eclipse-plugin-test.jar
to /x1/jenkins/jenkins-slave/workspace/maven-plugins-ITs-m3/maven-eclipse-plugin/target/test-classes/m2repo/org/apache/maven/plugins/maven-eclipse-plugin/test/maven-eclipse-plugin-test.jar
[INFO] Installing /x1/jenkins/jenkins-slave/workspace/maven-plugins-ITs-m3/maven-eclipse-plugin/../maven-plugins/pom.xml
to /x1/jenkins/jenkins-slave/workspace/maven-plugins-ITs-m3/maven-eclipse-plugin/target/test-classes/m2repo/org/apache/maven/plugins/maven-plugins/24-SNAPSHOT/maven-plugins-24-SNAPSHOT.pom
*** Installed test-version of the Eclipse plugin to: /x1/jenkins/jenkins-slave/workspace/maven-plugins-ITs-m3/maven-eclipse-plugin/target/test-classes/m2repo

  Building master-test
  Building master-test
  Building master-test
  Building master-test
  Building master-test
  Building master-test
Tests run: 6, Failures: 0, Errors: 0, Skipped: 0, Time elapsed: 43.705 sec
Running org.apache.maven.plugin.eclipse.it.EclipsePluginIT
  Building project-Z
  Building project-01
  Building project-02
  Building project-03
  Building project-04
  Building project-05
  Building project-06
  Building project-07
  Building project-08
  Building project-09
  Building project-10
  Building project-11
  Building project-12
  Building project-13
  Building project-14
  Building project-15
  Building project-16
  Building project-17
  Building project-18
  Building project-19
  Building project-20
  Building project-21
  Building project-22
  Building project-23
  Building project-24
  Building project-25
  Building project-26
  Building project-27
  Building module-1
  Building project-29
  Building project-30
  Building project-31
  Building project-32
  Building project-33
  Building project-34
  Building project-35
  Building project-36
  Building project-36
  Building project-37
  Building MECLIPSE-56_encoding
  Building project-38
  Building project-39-a
  Building project-39-b
  Building project-39-c
  Building project-40-a
  Building project-40-b
  Building project-40-c
  Building project-41
  Building project-42
  Building project-43
  Building project-44
  Building project-45
  Building project-46
  Building project-47
  Building project-48
  Building project-49
  Building project-50-MECLIPSE-415
  Building project-51-MECLIPSE-415
  Building project-52-MECLIPSE-104
  Building project-53-MECLIPSE-551
  Building project-54-MECLIPSE-178
  Building project-55-MECLIPSE-178
  Building project-56-MECLIPSE-603
  Building project-57-MECLIPSE-368
  Building project-58-MECLIPSE-621
  Building project-59-MECLIPSE-576
  Building project-60-MECLIPSE-652
  Building project-61-MECLIPSE-548
  Building project-62-MECLIPSE-561
  Building project-63-MECLIPSE-388
  Building project-64-MECLIPSE-388
  Building project-65-MECLIPSE-642
  Building groovy
  Building j2ee-simple
  Building j2ee-simple
Tests run: 73, Failures: 0, Errors: 0, Skipped: 0, Time elapsed: 197.22 sec
Running org.apache.maven.plugin.eclipse.it.RemoveCacheMojoIT
  Building project-46
  Building project-46
Tests run: 1, Failures: 0, Errors: 0, Skipped: 0, Time elapsed: 4.211 sec
Running org.apache.maven.plugin.eclipse.it.EclipseAjdtPluginIT
  Building project-ajdt-01
  Building project-ajdt-02
  Building project-ajdt-03
  Building project-ajdt-04
  Building project-ajdt-05
  Building project-ajdt-06
  Building project-ajdt-07
  Building project-ajdt-08
  Building project-ajdt-09
  Building project-ajdt-10-MECLIPSE-538
  Building project-ajdt-11-MECLIPSE-104
Tests run: 11, Failures: 0, Errors: 0, Skipped: 0, Time elapsed: 27.129 sec
Running org.apache.maven.plugin.eclipse.it.RadPluginIT
  Building project-rad-1
  Building project-rad-2
  Building project-rad-3
  Building project-rad-4
  Building project-rad-5
  Building project-rad-6
  Building project-rad-7
  Building project-rad-8
Tests run: 8, Failures: 0, Errors: 0, Skipped: 0, Time elapsed: 22.625 sec
Running org.apache.maven.plugin.eclipse.it.MyEclipsePluginIT
  Building project-myeclipse-01
  Building project-myeclipse-02
  Building project-myeclipse-03
  Building project-myeclipse-04
FATAL: hudson.remoting.RequestAbortedException: java.io.IOException: Unexpected termination
of the channel
hudson.remoting.RequestAbortedException: hudson.remoting.RequestAbortedException: java.io.IOException:
Unexpected termination of the channel
	at hudson.remoting.Request.call(Request.java:174)
	at hudson.remoting.Channel.call(Channel.java:663)
	at hudson.remoting.RemoteInvocationHandler.invoke(RemoteInvocationHandler.java:158)
	at $Proxy38.join(Unknown Source)
	at hudson.Launcher$RemoteLauncher$ProcImpl.join(Launcher.java:861)
	at hudson.Launcher$ProcStarter.join(Launcher.java:345)
	at hudson.tasks.Maven.perform(Maven.java:263)
	at hudson.tasks.BuildStepMonitor$1.perform(BuildStepMonitor.java:19)
	at hudson.model.AbstractBuild$AbstractBuildExecution.perform(AbstractBuild.java:717)
	at hudson.model.Build$BuildExecution.build(Build.java:199)
	at hudson.model.Build$BuildExecution.doRun(Build.java:160)
	at hudson.model.AbstractBuild$AbstractBuildExecution.run(AbstractBuild.java:499)
	at hudson.model.Run.execute(Run.java:1502)
	at hudson.model.FreeStyleBuild.run(FreeStyleBuild.java:46)
	at hudson.model.ResourceController.execute(ResourceController.java:88)
	at hudson.model.Executor.run(Executor.java:236)
Caused by: hudson.remoting.RequestAbortedException: java.io.IOException: Unexpected termination
of the channel
	at hudson.remoting.Request.abort(Request.java:299)
	at hudson.remoting.Channel.terminate(Channel.java:719)
	at hudson.remoting.SynchronousCommandTransport$ReaderThread.run(SynchronousCommandTransport.java:69)
Caused by: java.io.IOException: Unexpected termination of the channel
	at hudson.remoting.SynchronousCommandTransport$ReaderThread.run(SynchronousCommandTransport.java:50)
Caused by: java.io.EOFException
	at java.io.ObjectInputStream$BlockDataInputStream.peekByte(ObjectInputStream.java:2571)
	at java.io.ObjectInputStream.readObject0(ObjectInputStream.java:1315)
	at java.io.ObjectInputStream.readObject(ObjectInputStream.java:369)
	at hudson.remoting.Command.readFrom(Command.java:90)
	at hudson.remoting.ClassicCommandTransport.read(ClassicCommandTransport.java:59)
	at hudson.remoting.SynchronousCommandTransport$ReaderThread.run(SynchronousCommandTransport.java:48)

Mime
View raw message