maven-notifications mailing list archives

Site index · List index
Message view « Date » · « Thread »
Top « Date » · « Thread »
From Apache Jenkins Server <jenk...@builds.apache.org>
Subject Build failed in Jenkins: maven-plugins-ITs-m2 #731
Date Wed, 05 Sep 2012 10:14:52 GMT
See <https://builds.apache.org/job/maven-plugins-ITs-m2/731/>

------------------------------------------
[...truncated 2896 lines...]
[INFO] [compiler:testCompile {execution: default-testCompile}]
[INFO] No sources to compile
[INFO] [surefire:test {execution: default-test}]
[INFO] Surefire report directory: /x1/jenkins/jenkins-slave/workspace/maven-plugins-ITs-m2/maven-scm-publish-plugin/target/surefire-reports

-------------------------------------------------------
 T E S T S
-------------------------------------------------------

Results :

Tests run: 0, Failures: 0, Errors: 0, Skipped: 0

[INFO] ------------------------------------------------------------------------
[INFO] Building Maven Plugins Aggregator
[INFO]    task-segment: [clean, install]
[INFO] ------------------------------------------------------------------------
[INFO] [clean:clean {execution: default-clean}]
[INFO] Deleting /x1/jenkins/jenkins-slave/workspace/maven-plugins-ITs-m2/target
[INFO] [remote-resources:process {execution: default}]
[INFO] [site:attach-descriptor {execution: default-attach-descriptor}]
[INFO] [install:install {execution: default-install}]
[INFO] Installing /x1/jenkins/jenkins-slave/workspace/maven-plugins-ITs-m2/pom.xml to <https://builds.apache.org/job/maven-plugins-ITs-m2/ws/.repository/org/apache/maven/plugins/maven-plugins-aggregator/1-SNAPSHOT/maven-plugins-aggregator-1-SNAPSHOT.pom>
[INFO] 
[INFO] 
[INFO] ------------------------------------------------------------------------
[INFO] Reactor Summary:
[INFO] ------------------------------------------------------------------------
[INFO] Maven Plugins ......................................... SUCCESS [8.030s]
[INFO] Maven ACR Plugin ...................................... SUCCESS [21.884s]
[INFO] Maven Ant Plugin ...................................... SUCCESS [58.799s]
[INFO] Maven AntRun Plugin ................................... SUCCESS [36.923s]
[INFO] Maven Eclipse Plugin .................................. FAILED [2:36.124s]
[INFO] Maven Assembly Plugin ................................. FAILED [5.280s]
[INFO] Maven Changelog Plugin ................................ FAILED [2.232s]
[INFO] Maven Compiler Plugin ................................. FAILED [3.585s]
[INFO] Maven Changes Report Plugin ........................... SKIPPED (dependency build failed
or was skipped)
[INFO] Maven Checkstyle Plugin ............................... FAILED [2.831s]
[INFO] Maven Clean Plugin .................................... FAILED [0.795s]
[INFO] Maven Dependency Plugin ............................... FAILED [4.115s]
[INFO] Maven Deploy Plugin ................................... FAILED [1.274s]
[INFO] Maven DOAP Plugin ..................................... FAILED [2.962s]
[INFO] Maven Documentation Checker Plugin .................... FAILED [0.947s]
[INFO] Maven EAR Plugin ...................................... FAILED [10.486s]
[INFO] Maven EJB Plugin ...................................... FAILED [0.940s]
[INFO] Maven GPG Plugin ...................................... FAILED [0.667s]
[INFO] Maven Help Plugin ..................................... FAILED [12.820s]
[INFO] Maven IDEA Plugin ..................................... FAILED [2.850s]
[INFO] Maven Install Plugin .................................. FAILED [1.045s]
[INFO] Maven JAR Plugin ...................................... FAILED [1.046s]
[INFO] Maven Jarsigner Plugin ................................ FAILED [0.593s]
[INFO] Maven Javadoc Plugin .................................. FAILED [4.870s]
[INFO] Maven Linkcheck Plugin ................................ FAILED [0.972s]
[INFO] Maven One Plugin ...................................... FAILED [0.788s]
[INFO] Maven Patch Plugin .................................... FAILED [0.347s]
[INFO] Maven PDF Plugin ...................................... FAILED [9.714s]
[INFO] Maven PMD Plugin ...................................... FAILED [4.602s]
[INFO] Maven RAR Plugin ...................................... FAILED [0.999s]
[INFO] Maven Reactor Plugin .................................. FAILED [1.107s]
[INFO] Maven Repository Plugin ............................... FAILED [1.348s]
[INFO] Maven Resources Plugin ................................ SKIPPED (dependency build failed
or was skipped)
[INFO] Maven Site Plugin 3 ................................... FAILED [4.000s]
[INFO] Maven Source Plugin ................................... FAILED [0.911s]
[INFO] Maven Stage Plugin .................................... FAILED [0.989s]
[INFO] Maven Toolchains Plugin ............................... FAILED [0.641s]
[INFO] Maven Verifier Plugin ................................. FAILED [0.606s]
[INFO] Maven WAR Plugin ...................................... FAILED [1.445s]
[INFO] SCM Publish Maven Plugin .............................. FAILED [6.032s]
[INFO] Maven Plugins Aggregator .............................. SUCCESS [0.729s]
[INFO] ------------------------------------------------------------------------
[INFO] Error for project: Maven Eclipse Plugin (during install)
[INFO] ------------------------------------------------------------------------
[INFO] 3 builds in error. See console output above for details.
[INFO] ------------------------------------------------------------------------
[INFO] Error for project: Maven Assembly Plugin (during install)
[INFO] ------------------------------------------------------------------------
[INFO] Error while executing forked tests.; nested exception is java.io.IOException: java.io.IOException:
Cannot allocate memory

[INFO] ------------------------------------------------------------------------
[INFO] Error for project: Maven Changelog Plugin (during install)
[INFO] ------------------------------------------------------------------------
[INFO] Error while executing forked tests.; nested exception is java.io.IOException: java.io.IOException:
Cannot allocate memory

[INFO] ------------------------------------------------------------------------
[INFO] Error for project: Maven Compiler Plugin (during install)
[INFO] ------------------------------------------------------------------------
[INFO] Error while executing forked tests.; nested exception is java.io.IOException: java.io.IOException:
Cannot allocate memory

[INFO] ------------------------------------------------------------------------
[INFO] Error for project: Maven Checkstyle Plugin (during install)
[INFO] ------------------------------------------------------------------------
[INFO] Error while executing forked tests.; nested exception is java.io.IOException: java.io.IOException:
Cannot allocate memory

[INFO] ------------------------------------------------------------------------
[INFO] Error for project: Maven Clean Plugin (during install)
[INFO] ------------------------------------------------------------------------
[INFO] Error while executing forked tests.; nested exception is java.io.IOException: java.io.IOException:
Cannot allocate memory

[INFO] ------------------------------------------------------------------------
[INFO] Error for project: Maven Dependency Plugin (during install)
[INFO] ------------------------------------------------------------------------
[INFO] Error while executing forked tests.; nested exception is java.io.IOException: java.io.IOException:
Cannot allocate memory

[INFO] ------------------------------------------------------------------------
[INFO] Error for project: Maven Deploy Plugin (during install)
[INFO] ------------------------------------------------------------------------
[INFO] Error while executing forked tests.; nested exception is java.io.IOException: java.io.IOException:
Cannot allocate memory

[INFO] ------------------------------------------------------------------------
[INFO] Error for project: Maven DOAP Plugin (during install)
[INFO] ------------------------------------------------------------------------
[INFO] Error while executing forked tests.; nested exception is java.io.IOException: java.io.IOException:
Cannot allocate memory

[INFO] ------------------------------------------------------------------------
[INFO] Error for project: Maven Documentation Checker Plugin (during install)
[INFO] ------------------------------------------------------------------------
[INFO] Error while executing forked tests.; nested exception is java.io.IOException: java.io.IOException:
Cannot allocate memory

[INFO] ------------------------------------------------------------------------
[INFO] Error for project: Maven EAR Plugin (during install)
[INFO] ------------------------------------------------------------------------
[INFO] Error while executing forked tests.; nested exception is java.io.IOException: java.io.IOException:
Cannot allocate memory

[INFO] ------------------------------------------------------------------------
[INFO] Error for project: Maven EJB Plugin (during install)
[INFO] ------------------------------------------------------------------------
[INFO] Error while executing forked tests.; nested exception is java.io.IOException: java.io.IOException:
Cannot allocate memory

[INFO] ------------------------------------------------------------------------
[INFO] Error for project: Maven GPG Plugin (during install)
[INFO] ------------------------------------------------------------------------
[INFO] Error while executing forked tests.; nested exception is java.io.IOException: java.io.IOException:
Cannot allocate memory

[INFO] ------------------------------------------------------------------------
[INFO] Error for project: Maven Help Plugin (during install)
[INFO] ------------------------------------------------------------------------
[INFO] 8 builds in error. See console output above for details.
[INFO] ------------------------------------------------------------------------
[INFO] Error for project: Maven IDEA Plugin (during install)
[INFO] ------------------------------------------------------------------------
[INFO] Error while executing forked tests.; nested exception is java.io.IOException: java.io.IOException:
Cannot allocate memory

[INFO] ------------------------------------------------------------------------
[INFO] Error for project: Maven Install Plugin (during install)
[INFO] ------------------------------------------------------------------------
[INFO] Error while executing forked tests.; nested exception is java.io.IOException: java.io.IOException:
Cannot allocate memory

[INFO] ------------------------------------------------------------------------
[INFO] Error for project: Maven JAR Plugin (during install)
[INFO] ------------------------------------------------------------------------
[INFO] Error while executing forked tests.; nested exception is java.io.IOException: java.io.IOException:
Cannot allocate memory

[INFO] ------------------------------------------------------------------------
[INFO] Error for project: Maven Jarsigner Plugin (during install)
[INFO] ------------------------------------------------------------------------
[INFO] Error while executing forked tests.; nested exception is java.io.IOException: java.io.IOException:
Cannot allocate memory

[INFO] ------------------------------------------------------------------------
[INFO] Error for project: Maven Javadoc Plugin (during install)
[INFO] ------------------------------------------------------------------------
[INFO] Error while executing forked tests.; nested exception is java.io.IOException: java.io.IOException:
Cannot allocate memory

[INFO] ------------------------------------------------------------------------
[INFO] Error for project: Maven Linkcheck Plugin (during install)
[INFO] ------------------------------------------------------------------------
[INFO] Error while executing forked tests.; nested exception is java.io.IOException: java.io.IOException:
Cannot allocate memory

[INFO] ------------------------------------------------------------------------
[INFO] Error for project: Maven One Plugin (during install)
[INFO] ------------------------------------------------------------------------
[INFO] Error while executing forked tests.; nested exception is java.io.IOException: java.io.IOException:
Cannot allocate memory

[INFO] ------------------------------------------------------------------------
[INFO] Error for project: Maven Patch Plugin (during install)
[INFO] ------------------------------------------------------------------------
[INFO] Error while executing forked tests.; nested exception is java.io.IOException: java.io.IOException:
Cannot allocate memory

[INFO] ------------------------------------------------------------------------
[INFO] Error for project: Maven PDF Plugin (during install)
[INFO] ------------------------------------------------------------------------
[INFO] Error assembling JAR

Embedded error: Failed to read filesystem attributes for: /x1/jenkins/jenkins-slave/workspace/maven-plugins-ITs-m2/maven-pdf-plugin/pom.xml
java.io.IOException: Cannot allocate memory
[INFO] ------------------------------------------------------------------------
[INFO] Error for project: Maven PMD Plugin (during install)
[INFO] ------------------------------------------------------------------------
[INFO] Error while executing forked tests.; nested exception is java.io.IOException: java.io.IOException:
Cannot allocate memory

[INFO] ------------------------------------------------------------------------
[INFO] Error for project: Maven RAR Plugin (during install)
[INFO] ------------------------------------------------------------------------
[INFO] Error while executing forked tests.; nested exception is java.io.IOException: java.io.IOException:
Cannot allocate memory

[INFO] ------------------------------------------------------------------------
[INFO] Error for project: Maven Reactor Plugin (during install)
[INFO] ------------------------------------------------------------------------
[INFO] Error while executing forked tests.; nested exception is java.io.IOException: java.io.IOException:
Cannot allocate memory

[INFO] ------------------------------------------------------------------------
[INFO] Error for project: Maven Repository Plugin (during install)
[INFO] ------------------------------------------------------------------------
[INFO] Error while executing forked tests.; nested exception is java.io.IOException: java.io.IOException:
Cannot allocate memory

[INFO] ------------------------------------------------------------------------
[INFO] Error for project: Maven Site Plugin 3 (during install)
[INFO] ------------------------------------------------------------------------
[INFO] Error while executing forked tests.; nested exception is java.io.IOException: java.io.IOException:
Cannot allocate memory

[INFO] ------------------------------------------------------------------------
[INFO] Error for project: Maven Source Plugin (during install)
[INFO] ------------------------------------------------------------------------
[INFO] Error while executing forked tests.; nested exception is java.io.IOException: java.io.IOException:
Cannot allocate memory

[INFO] ------------------------------------------------------------------------
[INFO] Error for project: Maven Stage Plugin (during install)
[INFO] ------------------------------------------------------------------------
[INFO] Error while executing forked tests.; nested exception is java.io.IOException: java.io.IOException:
Cannot allocate memory

[INFO] ------------------------------------------------------------------------
[INFO] Error for project: Maven Toolchains Plugin (during install)
[INFO] ------------------------------------------------------------------------
[INFO] Error while executing forked tests.; nested exception is java.io.IOException: java.io.IOException:
Cannot allocate memory

[INFO] ------------------------------------------------------------------------
[INFO] Error for project: Maven Verifier Plugin (during install)
[INFO] ------------------------------------------------------------------------
[INFO] Error while executing forked tests.; nested exception is java.io.IOException: java.io.IOException:
Cannot allocate memory

[INFO] ------------------------------------------------------------------------
[INFO] Error for project: Maven WAR Plugin (during install)
[INFO] ------------------------------------------------------------------------
[INFO] Error while executing forked tests.; nested exception is java.io.IOException: java.io.IOException:
Cannot allocate memory

[INFO] ------------------------------------------------------------------------
[INFO] Error for project: SCM Publish Maven Plugin (during install)
[INFO] ------------------------------------------------------------------------
[INFO] Error while executing forked tests.; nested exception is java.io.IOException: java.io.IOException:
Cannot allocate memory

[INFO] ------------------------------------------------------------------------
[INFO] For more information, run Maven with the -e switch
[INFO] ------------------------------------------------------------------------
[INFO] BUILD ERRORS
[INFO] ------------------------------------------------------------------------
[INFO] Total time: 6 minutes 18 seconds
[INFO] Finished at: Wed Sep 05 10:14:51 GMT 2012
[INFO] Final Memory: 290M/1009M
[INFO] ------------------------------------------------------------------------
Build step 'Invoke top-level Maven targets' marked build as failure

Mime
View raw message