maven-notifications mailing list archives

Site index · List index
Message view « Date » · « Thread »
Top « Date » · « Thread »
From Apache Jenkins Server <jenk...@builds.apache.org>
Subject Build failed in Jenkins: doxia-tools » JDK 1.5 (latest),Ubuntu #28
Date Sun, 23 Sep 2012 14:03:17 GMT
See <https://builds.apache.org/job/doxia-tools/./jdk=JDK%201.5%20(latest),label=Ubuntu/28/changes>

Changes:

[dennisl] [maven-release-plugin] prepare for next development iteration

[dennisl] [maven-release-plugin] prepare release doxia-integration-tools-1.5

[dennisl] Use doxia-tools:2 as parent.

[dennisl] [maven-release-plugin] prepare for next development iteration

[dennisl] [maven-release-plugin] prepare release doxia-tools-2

[dennisl] Use latest decoration schema.
Synchronize the menus so they look the same.

[dennisl] Inherit plugin versions from parent.

------------------------------------------
Started by upstream project "doxia-tools" build number 28
Building remotely on ubuntu5 in workspace <https://builds.apache.org/job/doxia-tools/./jdk=JDK%201.5%20(latest),label=Ubuntu/ws/>
Updating http://svn.apache.org/repos/asf/maven/doxia/doxia-tools/trunk
U         doxia-book-renderer/src/site/site.xml
U         doxia-tools/src/site/site.xml
U         doxia-tools/pom.xml
U         doxia-integration-tools/src/site/site.xml
U         doxia-integration-tools/pom.xml
U         doxia-converter/src/site/site.xml
U         doxia-book-maven-plugin/src/site/site.xml
U         doxia-linkcheck/src/site/site.xml
At revision 1389056
[Ubuntu] $ /home/hudson/tools/maven/apache-maven-2.2.1/bin/mvn -Dlabel=Ubuntu "-Djdk=JDK 1.5
(latest)" clean install -fae -B -U -e -V
+ Error stacktraces are turned on.
Apache Maven 2.2.1 (r801777; 2009-08-06 19:16:01+0000)
Java version: 1.5.0_22
Java home: /home/jenkins/tools/java/jdk1.5.0_22-32/jre
Default locale: en_US, platform encoding: ANSI_X3.4-1968
OS name: "linux" version: "2.6.32-41-server" arch: "i386" Family: "unix"
[INFO] Scanning for projects...
Downloading: http://repo1.maven.org/maven2/org/apache/maven/doxia/doxia-tools/2/doxia-tools-2.pom
[INFO] Unable to find resource 'org.apache.maven.doxia:doxia-tools:pom:2' in repository central
(http://repo1.maven.org/maven2)
[INFO] ------------------------------------------------------------------------
[ERROR] FATAL ERROR
[INFO] ------------------------------------------------------------------------
[INFO] Failed to resolve artifact.

GroupId: org.apache.maven.doxia
ArtifactId: doxia-tools
Version: 2

Reason: Unable to download the artifact from any repository

  org.apache.maven.doxia:doxia-tools:pom:2

from the specified remote repositories:
  central (http://repo1.maven.org/maven2)



[INFO] ------------------------------------------------------------------------
[INFO] Trace
org.apache.maven.reactor.MavenExecutionException: Cannot find parent: org.apache.maven.doxia:doxia-tools
for project: null:doxia-integration-tools:jar:1.6-SNAPSHOT for project null:doxia-integration-tools:jar:1.6-SNAPSHOT
	at org.apache.maven.DefaultMaven.getProjects(DefaultMaven.java:404)
	at org.apache.maven.DefaultMaven.doExecute(DefaultMaven.java:272)
	at org.apache.maven.DefaultMaven.execute(DefaultMaven.java:138)
	at org.apache.maven.cli.MavenCli.main(MavenCli.java:362)
	at org.apache.maven.cli.compat.CompatibleMain.main(CompatibleMain.java:60)
	at sun.reflect.NativeMethodAccessorImpl.invoke0(Native Method)
	at sun.reflect.NativeMethodAccessorImpl.invoke(NativeMethodAccessorImpl.java:39)
	at sun.reflect.DelegatingMethodAccessorImpl.invoke(DelegatingMethodAccessorImpl.java:25)
	at java.lang.reflect.Method.invoke(Method.java:592)
	at org.codehaus.classworlds.Launcher.launchEnhanced(Launcher.java:315)
	at org.codehaus.classworlds.Launcher.launch(Launcher.java:255)
	at org.codehaus.classworlds.Launcher.mainWithExitCode(Launcher.java:430)
	at org.codehaus.classworlds.Launcher.main(Launcher.java:375)
Caused by: org.apache.maven.project.ProjectBuildingException: Cannot find parent: org.apache.maven.doxia:doxia-tools
for project: null:doxia-integration-tools:jar:1.6-SNAPSHOT for project null:doxia-integration-tools:jar:1.6-SNAPSHOT
	at org.apache.maven.project.DefaultMavenProjectBuilder.assembleLineage(DefaultMavenProjectBuilder.java:1396)
	at org.apache.maven.project.DefaultMavenProjectBuilder.buildInternal(DefaultMavenProjectBuilder.java:823)
	at org.apache.maven.project.DefaultMavenProjectBuilder.buildFromSourceFileInternal(DefaultMavenProjectBuilder.java:508)
	at org.apache.maven.project.DefaultMavenProjectBuilder.build(DefaultMavenProjectBuilder.java:200)
	at org.apache.maven.DefaultMaven.getProject(DefaultMaven.java:604)
	at org.apache.maven.DefaultMaven.collectProjects(DefaultMaven.java:487)
	at org.apache.maven.DefaultMaven.collectProjects(DefaultMaven.java:560)
	at org.apache.maven.DefaultMaven.getProjects(DefaultMaven.java:391)
	... 12 more
Caused by: org.apache.maven.project.ProjectBuildingException: POM 'org.apache.maven.doxia:doxia-tools'
not found in repository: Unable to download the artifact from any repository

  org.apache.maven.doxia:doxia-tools:pom:2

from the specified remote repositories:
  central (http://repo1.maven.org/maven2)

 for project org.apache.maven.doxia:doxia-tools
	at org.apache.maven.project.DefaultMavenProjectBuilder.findModelFromRepository(DefaultMavenProjectBuilder.java:605)
	at org.apache.maven.project.DefaultMavenProjectBuilder.assembleLineage(DefaultMavenProjectBuilder.java:1392)
	... 19 more
Caused by: org.apache.maven.artifact.resolver.ArtifactNotFoundException: Unable to download
the artifact from any repository

  org.apache.maven.doxia:doxia-tools:pom:2

from the specified remote repositories:
  central (http://repo1.maven.org/maven2)


	at org.apache.maven.artifact.resolver.DefaultArtifactResolver.resolve(DefaultArtifactResolver.java:228)
	at org.apache.maven.artifact.resolver.DefaultArtifactResolver.resolve(DefaultArtifactResolver.java:90)
	at org.apache.maven.project.DefaultMavenProjectBuilder.findModelFromRepository(DefaultMavenProjectBuilder.java:558)
	... 20 more
Caused by: org.apache.maven.wagon.ResourceDoesNotExistException: Unable to download the artifact
from any repository
	at org.apache.maven.artifact.manager.DefaultWagonManager.getArtifact(DefaultWagonManager.java:404)
	at org.apache.maven.artifact.resolver.DefaultArtifactResolver.resolve(DefaultArtifactResolver.java:216)
	... 22 more
[INFO] ------------------------------------------------------------------------
[INFO] Total time: < 1 second
[INFO] Finished at: Sun Sep 23 14:03:16 UTC 2012
[INFO] Final Memory: 3M/273M
[INFO] ------------------------------------------------------------------------
Build step 'Invoke top-level Maven targets' marked build as failure

Mime
View raw message