maven-notifications mailing list archives

Site index · List index
Message view « Date » · « Thread »
Top « Date » · « Thread »
From Apache Jenkins Server <jenk...@builds.apache.org>
Subject Build failed in Jenkins: maven-plugins-ITs-m2 #728
Date Wed, 05 Sep 2012 01:17:19 GMT
See <https://builds.apache.org/job/maven-plugins-ITs-m2/728/changes>

Changes:

[hboutemy] updated maven-plugin-testing-harness

------------------------------------------
[...truncated 9732 lines...]
[INFO] snapshot org.apache.maven.scm:maven-scm:1.8-SNAPSHOT: checking for updates from apache.snapshots
Downloading: http://repository.apache.org/snapshots/org/apache/maven/scm/maven-scm/1.8-SNAPSHOT/maven-scm-1.8-20120904.102546-30.pom

Downloading: http://repo1.maven.org/maven2/org/codehaus/plexus/plexus-utils/3.0.3/plexus-utils-3.0.3.pom
2K downloaded  (plexus-utils-3.0.3.pom)
[INFO] snapshot org.apache.maven.scm:maven-scm-provider-gitexe:1.8-SNAPSHOT: checking for
updates from apache.snapshots
Downloading: http://repository.apache.org/snapshots/org/apache/maven/scm/maven-scm-provider-gitexe/1.8-SNAPSHOT/maven-scm-provider-gitexe-1.8-20120904.102601-30.pom

[INFO] snapshot org.apache.maven.scm:maven-scm-providers-git:1.8-SNAPSHOT: checking for updates
from apache.snapshots
Downloading: http://repository.apache.org/snapshots/org/apache/maven/scm/maven-scm-providers-git/1.8-SNAPSHOT/maven-scm-providers-git-1.8-20120904.102613-30.pom

[INFO] snapshot org.apache.maven.scm:maven-scm-providers:1.8-SNAPSHOT: checking for updates
from apache.snapshots
Downloading: http://repository.apache.org/snapshots/org/apache/maven/scm/maven-scm-providers/1.8-SNAPSHOT/maven-scm-providers-1.8-20120904.102612-30.pom

[INFO] snapshot org.apache.maven.scm:maven-scm-provider-git-commons:1.8-SNAPSHOT: checking
for updates from apache.snapshots
Downloading: http://repository.apache.org/snapshots/org/apache/maven/scm/maven-scm-provider-git-commons/1.8-SNAPSHOT/maven-scm-provider-git-commons-1.8-20120904.102600-30.pom

[INFO] snapshot org.apache.maven.scm:maven-scm-provider-svnexe:1.8-SNAPSHOT: checking for
updates from apache.snapshots
Downloading: http://repository.apache.org/snapshots/org/apache/maven/scm/maven-scm-provider-svnexe/1.8-SNAPSHOT/maven-scm-provider-svnexe-1.8-20120904.102608-30.pom

[INFO] snapshot org.apache.maven.scm:maven-scm-providers-svn:1.8-SNAPSHOT: checking for updates
from apache.snapshots
Downloading: http://repository.apache.org/snapshots/org/apache/maven/scm/maven-scm-providers-svn/1.8-SNAPSHOT/maven-scm-providers-svn-1.8-20120904.102615-30.pom

[INFO] snapshot org.apache.maven.scm:maven-scm-provider-svn-commons:1.8-SNAPSHOT: checking
for updates from apache.snapshots
Downloading: http://repository.apache.org/snapshots/org/apache/maven/scm/maven-scm-provider-svn-commons/1.8-SNAPSHOT/maven-scm-provider-svn-commons-1.8-20120904.102607-30.pom

[INFO] snapshot org.apache.maven.scm:maven-scm-provider-svntest:1.8-SNAPSHOT: checking for
updates from apache.snapshots
Downloading: http://repository.apache.org/snapshots/org/apache/maven/scm/maven-scm-provider-svntest/1.8-SNAPSHOT/maven-scm-provider-svntest-1.8-20120904.102609-30.pom

[INFO] snapshot org.apache.maven.scm:maven-scm-test:1.8-SNAPSHOT: checking for updates from
apache.snapshots
Downloading: http://repository.apache.org/snapshots/org/apache/maven/scm/maven-scm-test/1.8-SNAPSHOT/maven-scm-test-1.8-20120904.102615-30.pom

[INFO] snapshot org.apache.maven.scm:maven-scm-manager-plexus:1.8-SNAPSHOT: checking for updates
from apache.snapshots
Downloading: http://repository.apache.org/snapshots/org/apache/maven/scm/maven-scm-manager-plexus/1.8-SNAPSHOT/maven-scm-manager-plexus-1.8-20120904.102551-30.pom

[INFO] snapshot org.apache.maven.scm:maven-scm-managers:1.8-SNAPSHOT: checking for updates
from apache.snapshots
Downloading: http://repository.apache.org/snapshots/org/apache/maven/scm/maven-scm-managers/1.8-SNAPSHOT/maven-scm-managers-1.8-20120904.102552-30.pom

Downloading: http://repository.apache.org/snapshots/org/apache/maven/scm/maven-scm-api/1.8-SNAPSHOT/maven-scm-api-1.8-20120904.102547-30.jar
102K downloaded  (maven-scm-api-1.8-20120904.102547-30.jar)
Downloading: http://repository.apache.org/snapshots/org/apache/maven/scm/maven-scm-provider-gitexe/1.8-SNAPSHOT/maven-scm-provider-gitexe-1.8-20120904.102601-30.jar
61K downloaded  (maven-scm-provider-gitexe-1.8-20120904.102601-30.jar)
Downloading: http://repository.apache.org/snapshots/org/apache/maven/scm/maven-scm-provider-git-commons/1.8-SNAPSHOT/maven-scm-provider-git-commons-1.8-20120904.102600-30.jar
36K downloaded  (maven-scm-provider-git-commons-1.8-20120904.102600-30.jar)
Downloading: http://repository.apache.org/snapshots/org/apache/maven/scm/maven-scm-provider-svnexe/1.8-SNAPSHOT/maven-scm-provider-svnexe-1.8-20120904.102608-30.jar
74K downloaded  (maven-scm-provider-svnexe-1.8-20120904.102608-30.jar)
Downloading: http://repository.apache.org/snapshots/org/apache/maven/scm/maven-scm-provider-svn-commons/1.8-SNAPSHOT/maven-scm-provider-svn-commons-1.8-20120904.102607-30.jar
39K downloaded  (maven-scm-provider-svn-commons-1.8-20120904.102607-30.jar)
Downloading: http://repository.apache.org/snapshots/org/apache/maven/scm/maven-scm-provider-svntest/1.8-SNAPSHOT/maven-scm-provider-svntest-1.8-20120904.102609-30.jar
22K downloaded  (maven-scm-provider-svntest-1.8-20120904.102609-30.jar)
Downloading: http://repository.apache.org/snapshots/org/apache/maven/scm/maven-scm-test/1.8-SNAPSHOT/maven-scm-test-1.8-20120904.102615-30.jar
47K downloaded  (maven-scm-test-1.8-20120904.102615-30.jar)
[INFO] [enforcer:enforce {execution: ensure-no-container-api}]
[INFO] [plugin:helpmojo {execution: generated-helpmojo}]
[INFO] Using 'UTF-8' encoding to read mojo metadata.
[INFO] Applying mojo extractor for language: java
[INFO] Mojo extractor for language: java found 1 mojo descriptors.
[INFO] Applying mojo extractor for language: bsh
[INFO] Mojo extractor for language: bsh found 0 mojo descriptors.
[INFO] Applying mojo extractor for language: java-annotations
[INFO] Mojo extractor for language: java-annotations found 0 mojo descriptors.
[INFO] [plugin:descriptor {execution: default-descriptor}]
[INFO] Using 'UTF-8' encoding to read mojo metadata.
[INFO] Applying mojo extractor for language: java
[INFO] Mojo extractor for language: java found 2 mojo descriptors.
[INFO] Applying mojo extractor for language: bsh
[INFO] Mojo extractor for language: bsh found 0 mojo descriptors.
[INFO] Applying mojo extractor for language: java-annotations
[INFO] Mojo extractor for language: java-annotations found 0 mojo descriptors.
[WARNING] The parameter expression: 'project.build.resources' used in mojo: 'process' has
been deprecated. Use 'project.resources' instead.
[INFO] [remote-resources:process {execution: default}]
[debug] execute contextualize
[INFO] [resources:resources {execution: default-resources}]
[INFO] Using 'UTF-8' encoding to copy filtered resources.
[INFO] Copying 2 resources
[INFO] Copying 3 resources
[INFO] [compiler:compile {execution: default-compile}]
[INFO] Compiling 7 source files to /x1/jenkins/jenkins-slave/workspace/maven-plugins-ITs-m2/maven-scm-publish-plugin/target/classes
[INFO] [plugin:descriptor {execution: mojo-descriptor}]
[INFO] Using 'UTF-8' encoding to read mojo metadata.
[INFO] Applying mojo extractor for language: java
[INFO] Mojo extractor for language: java found 2 mojo descriptors.
[INFO] Applying mojo extractor for language: bsh
[INFO] Mojo extractor for language: bsh found 0 mojo descriptors.
[INFO] Applying mojo extractor for language: java-annotations
[INFO] Mojo extractor for language: java-annotations found 3 mojo descriptors.
[debug] execute contextualize
[INFO] [resources:testResources {execution: default-testResources}]
[INFO] Using 'UTF-8' encoding to copy filtered resources.
[INFO] skip non existing resourceDirectory /x1/jenkins/jenkins-slave/workspace/maven-plugins-ITs-m2/maven-scm-publish-plugin/src/test/resources
[INFO] Copying 3 resources
[INFO] [compiler:testCompile {execution: default-testCompile}]
[INFO] No sources to compile
[INFO] [surefire:test {execution: default-test}]
[INFO] Surefire report directory: /x1/jenkins/jenkins-slave/workspace/maven-plugins-ITs-m2/maven-scm-publish-plugin/target/surefire-reports

-------------------------------------------------------
 T E S T S
-------------------------------------------------------

Results :

Tests run: 0, Failures: 0, Errors: 0, Skipped: 0

[INFO] [jar:jar {execution: default-jar}]
[INFO] Building jar: /x1/jenkins/jenkins-slave/workspace/maven-plugins-ITs-m2/maven-scm-publish-plugin/target/maven-scm-publish-plugin-1.0-SNAPSHOT.jar
[INFO] [plugin:addPluginArtifactMetadata {execution: default-addPluginArtifactMetadata}]
[INFO] [invoker:install {execution: integration-test}]
[INFO] Installing /x1/jenkins/jenkins-slave/workspace/maven-plugins-ITs-m2/maven-scm-publish-plugin/pom.xml
to /x1/jenkins/jenkins-slave/workspace/maven-plugins-ITs-m2/maven-scm-publish-plugin/target/local-repo/org/apache/maven/plugins/maven-scm-publish-plugin/1.0-SNAPSHOT/maven-scm-publish-plugin-1.0-SNAPSHOT.pom
[INFO] Installing /x1/jenkins/jenkins-slave/workspace/maven-plugins-ITs-m2/maven-scm-publish-plugin/target/maven-scm-publish-plugin-1.0-SNAPSHOT.jar
to /x1/jenkins/jenkins-slave/workspace/maven-plugins-ITs-m2/maven-scm-publish-plugin/target/local-repo/org/apache/maven/plugins/maven-scm-publish-plugin/1.0-SNAPSHOT/maven-scm-publish-plugin-1.0-SNAPSHOT.jar
[INFO] [invoker:integration-test {execution: integration-test}]
[INFO] Building: 006-site-multi-module/pom.xml
[INFO] run script /x1/jenkins/jenkins-slave/workspace/maven-plugins-ITs-m2/maven-scm-publish-plugin/target/it/006-site-multi-module/setup.bsh
[INFO] ..SUCCESS (16.6 s)
[INFO] Building: 005-site-lifecycle/pom.xml
[INFO] run script /x1/jenkins/jenkins-slave/workspace/maven-plugins-ITs-m2/maven-scm-publish-plugin/target/it/005-site-lifecycle/setup.bsh
[INFO] ..FAILED (9.5 s)
[INFO]   The build exited with code 1. See /x1/jenkins/jenkins-slave/workspace/maven-plugins-ITs-m2/maven-scm-publish-plugin/target/it/005-site-lifecycle/build.log
for details.
[INFO] Building: 004-publish-scm/pom.xml
[INFO] run script /x1/jenkins/jenkins-slave/workspace/maven-plugins-ITs-m2/maven-scm-publish-plugin/target/it/004-publish-scm/setup.bsh
[INFO] ..FAILED (9.8 s)
[INFO]   The build exited with code 1. See /x1/jenkins/jenkins-slave/workspace/maven-plugins-ITs-m2/maven-scm-publish-plugin/target/it/004-publish-scm/build.log
for details.
[INFO] Building: 003-lifecycle/pom.xml
[INFO] run script /x1/jenkins/jenkins-slave/workspace/maven-plugins-ITs-m2/maven-scm-publish-plugin/target/it/003-lifecycle/setup.bsh
[INFO] ..SUCCESS (5.6 s)
[INFO] Building: 002-perform/pom.xml
[INFO] run script /x1/jenkins/jenkins-slave/workspace/maven-plugins-ITs-m2/maven-scm-publish-plugin/target/it/002-perform/setup.bsh
[INFO] ..FAILED (3.0 s)
[INFO]   The build exited with code 1. See /x1/jenkins/jenkins-slave/workspace/maven-plugins-ITs-m2/maven-scm-publish-plugin/target/it/002-perform/build.log
for details.
[INFO] Building: 001-prepare/pom.xml
[INFO] run script /x1/jenkins/jenkins-slave/workspace/maven-plugins-ITs-m2/maven-scm-publish-plugin/target/it/001-prepare/setup.bsh
[INFO] ..FAILED (3.4 s)
[INFO]   The build exited with code 1. See /x1/jenkins/jenkins-slave/workspace/maven-plugins-ITs-m2/maven-scm-publish-plugin/target/it/001-prepare/build.log
for details.
[INFO] [invoker:verify {execution: integration-test}]
[INFO] -------------------------------------------------
[INFO] Build Summary:
[INFO]   Passed: 2, Failed: 4, Errors: 0, Skipped: 0
[INFO] -------------------------------------------------
[ERROR] The following builds failed:
[ERROR] *  004-publish-scm/pom.xml
[ERROR] *  001-prepare/pom.xml
[ERROR] *  005-site-lifecycle/pom.xml
[ERROR] *  002-perform/pom.xml
[INFO] -------------------------------------------------
[INFO] ------------------------------------------------------------------------
[INFO] Building Maven Plugins Aggregator
[INFO]    task-segment: [clean, install]
[INFO] ------------------------------------------------------------------------
[INFO] [clean:clean {execution: default-clean}]
[INFO] Deleting /x1/jenkins/jenkins-slave/workspace/maven-plugins-ITs-m2/target
[INFO] [remote-resources:process {execution: default}]
[INFO] [site:attach-descriptor {execution: default-attach-descriptor}]
[INFO] [install:install {execution: default-install}]
[INFO] Installing /x1/jenkins/jenkins-slave/workspace/maven-plugins-ITs-m2/pom.xml to <https://builds.apache.org/job/maven-plugins-ITs-m2/ws/.repository/org/apache/maven/plugins/maven-plugins-aggregator/1-SNAPSHOT/maven-plugins-aggregator-1-SNAPSHOT.pom>
[INFO] 
[INFO] 
[INFO] ------------------------------------------------------------------------
[INFO] Reactor Summary:
[INFO] ------------------------------------------------------------------------
[INFO] Maven Plugins ......................................... SUCCESS [41.631s]
[INFO] Maven ACR Plugin ...................................... SUCCESS [23.811s]
[INFO] Maven Ant Plugin ...................................... SUCCESS [52.935s]
[INFO] Maven AntRun Plugin ................................... SUCCESS [37.677s]
[INFO] Maven Eclipse Plugin .................................. SUCCESS [5:05.614s]
[INFO] Maven Assembly Plugin ................................. SUCCESS [8:25.910s]
[INFO] Maven Changelog Plugin ................................ SUCCESS [41.029s]
[INFO] Maven Compiler Plugin ................................. SUCCESS [34.800s]
[INFO] Maven Changes Report Plugin ........................... SUCCESS [55.440s]
[INFO] Maven Checkstyle Plugin ............................... SUCCESS [1:41.143s]
[INFO] Maven Clean Plugin .................................... SUCCESS [10.999s]
[INFO] Maven Dependency Plugin ............................... SUCCESS [1:50.310s]
[INFO] Maven Deploy Plugin ................................... SUCCESS [56.059s]
[INFO] Maven DOAP Plugin ..................................... SUCCESS [12.908s]
[INFO] Maven Documentation Checker Plugin .................... SUCCESS [8.024s]
[INFO] Maven EAR Plugin ...................................... SUCCESS [2:41.802s]
[INFO] Maven EJB Plugin ...................................... SUCCESS [18.600s]
[INFO] Maven GPG Plugin ...................................... SUCCESS [7.841s]
[INFO] Maven Help Plugin ..................................... SUCCESS [22.151s]
[INFO] Maven IDEA Plugin ..................................... SUCCESS [6.840s]
[INFO] Maven Install Plugin .................................. SUCCESS [31.075s]
[INFO] Maven JAR Plugin ...................................... SUCCESS [49.813s]
[INFO] Maven Jarsigner Plugin ................................ SUCCESS [18.556s]
[INFO] Maven Javadoc Plugin .................................. SUCCESS [4:06.621s]
[INFO] Maven Linkcheck Plugin ................................ SUCCESS [2.248s]
[INFO] Maven One Plugin ...................................... SUCCESS [1.569s]
[INFO] Maven Patch Plugin .................................... SUCCESS [8.264s]
[INFO] Maven PDF Plugin ...................................... SUCCESS [32.780s]
[INFO] Maven PMD Plugin ...................................... SUCCESS [35.972s]
[INFO] Maven RAR Plugin ...................................... SUCCESS [8.105s]
[INFO] Maven Reactor Plugin .................................. SUCCESS [2.561s]
[INFO] Maven Repository Plugin ............................... FAILED [19.136s]
[INFO] Maven Resources Plugin ................................ SUCCESS [42.813s]
[INFO] Maven Site Plugin 3 ................................... FAILED [3:44.705s]
[INFO] Maven Source Plugin ................................... FAILED [2.329s]
[INFO] Maven Stage Plugin .................................... FAILED [1.210s]
[INFO] Maven Toolchains Plugin ............................... FAILED [1.264s]
[INFO] Maven Verifier Plugin ................................. FAILED [1.208s]
[INFO] Maven WAR Plugin ...................................... FAILED [3.374s]
[INFO] SCM Publish Maven Plugin .............................. FAILED [55.789s]
[INFO] Maven Plugins Aggregator .............................. SUCCESS [1.262s]
[INFO] ------------------------------------------------------------------------
[INFO] Error for project: Maven Repository Plugin (during install)
[INFO] ------------------------------------------------------------------------
[INFO] There are test failures.

Please refer to /x1/jenkins/jenkins-slave/workspace/maven-plugins-ITs-m2/maven-repository-plugin/target/surefire-reports
for the individual test results.
[INFO] ------------------------------------------------------------------------
[INFO] Error for project: Maven Site Plugin 3 (during install)
[INFO] ------------------------------------------------------------------------
[INFO] 1 build failed. See console output above for details.
[INFO] ------------------------------------------------------------------------
[INFO] Error for project: Maven Source Plugin (during install)
[INFO] ------------------------------------------------------------------------
[INFO] Error while executing forked tests.; nested exception is java.io.IOException: java.io.IOException:
Cannot allocate memory

[INFO] ------------------------------------------------------------------------
[INFO] Error for project: Maven Stage Plugin (during install)
[INFO] ------------------------------------------------------------------------
[INFO] Error while executing forked tests.; nested exception is java.io.IOException: java.io.IOException:
Cannot allocate memory

[INFO] ------------------------------------------------------------------------
[INFO] Error for project: Maven Toolchains Plugin (during install)
[INFO] ------------------------------------------------------------------------
[INFO] Error while executing forked tests.; nested exception is java.io.IOException: java.io.IOException:
Cannot allocate memory

[INFO] ------------------------------------------------------------------------
[INFO] Error for project: Maven Verifier Plugin (during install)
[INFO] ------------------------------------------------------------------------
[INFO] Error while executing forked tests.; nested exception is java.io.IOException: java.io.IOException:
Cannot allocate memory

[INFO] ------------------------------------------------------------------------
[INFO] Error for project: Maven WAR Plugin (during install)
[INFO] ------------------------------------------------------------------------
[INFO] Error while executing forked tests.; nested exception is java.io.IOException: java.io.IOException:
Cannot allocate memory

[INFO] ------------------------------------------------------------------------
[INFO] Error for project: SCM Publish Maven Plugin (during install)
[INFO] ------------------------------------------------------------------------
[INFO] 4 builds failed. See console output above for details.
[INFO] ------------------------------------------------------------------------
[INFO] For more information, run Maven with the -e switch
[INFO] ------------------------------------------------------------------------
[INFO] BUILD ERRORS
[INFO] ------------------------------------------------------------------------
[INFO] Total time: 40 minutes 16 seconds
[INFO] Finished at: Wed Sep 05 01:17:16 GMT 2012
[INFO] Final Memory: 277M/1017M
[INFO] ------------------------------------------------------------------------
Build step 'Invoke top-level Maven targets' marked build as failure

Mime
View raw message