maven-notifications mailing list archives

Site index · List index
Message view « Date » · « Thread »
Top « Date » · « Thread »
From Apache Jenkins Server <jenk...@builds.apache.org>
Subject Build failed in Jenkins: maven-plugins-ITs-m3.0.3 #205
Date Wed, 03 Apr 2013 02:26:54 GMT
See <https://builds.apache.org/job/maven-plugins-ITs-m3.0.3/205/changes>

Changes:

[olamy] [maven-release-plugin] prepare for next development iteration

[olamy] [maven-release-plugin] prepare release maven-compiler-plugin-3.2

[olamy] use shared incremental release

[olamy] add contributor

[olamy] [MDEP-295] Add ability to strip classifier
Submitted by Holger Mense.

------------------------------------------
[...truncated 29294 lines...]
[INFO] Installing <https://builds.apache.org/job/maven-plugins-ITs-m3.0.3/ws/maven-resources-plugin/pom.xml>
to <https://builds.apache.org/job/maven-plugins-ITs-m3.0.3/ws/maven-shade-plugin/target/local-repo/org/apache/maven/plugins/maven-resources-plugin/2.7-SNAPSHOT/maven-resources-plugin-2.7-SNAPSHOT.pom>
[INFO] Installing <https://builds.apache.org/job/maven-plugins-ITs-m3.0.3/ws/maven-resources-plugin/target/maven-resources-plugin-2.7-SNAPSHOT-tests.jar>
to <https://builds.apache.org/job/maven-plugins-ITs-m3.0.3/ws/maven-shade-plugin/target/local-repo/org/apache/maven/plugins/maven-resources-plugin/2.7-SNAPSHOT/maven-resources-plugin-2.7-SNAPSHOT-tests.jar>
[INFO] Installing <https://builds.apache.org/job/maven-plugins-ITs-m3.0.3/ws/maven-site-plugin/dependency-reduced-pom.xml>
to <https://builds.apache.org/job/maven-plugins-ITs-m3.0.3/ws/maven-shade-plugin/target/local-repo/org/apache/maven/plugins/maven-site-plugin/3.3-SNAPSHOT/maven-site-plugin-3.3-SNAPSHOT.pom>
[INFO] Installing <https://builds.apache.org/job/maven-plugins-ITs-m3.0.3/ws/maven-site-plugin/target/maven-site-plugin-3.3-SNAPSHOT.jar>
to <https://builds.apache.org/job/maven-plugins-ITs-m3.0.3/ws/maven-shade-plugin/target/local-repo/org/apache/maven/plugins/maven-site-plugin/3.3-SNAPSHOT/maven-site-plugin-3.3-SNAPSHOT.jar>
[INFO] Installing <https://builds.apache.org/job/maven-plugins-ITs-m3.0.3/ws/maven-site-plugin/dependency-reduced-pom.xml>
to <https://builds.apache.org/job/maven-plugins-ITs-m3.0.3/ws/maven-shade-plugin/target/local-repo/org/apache/maven/plugins/maven-site-plugin/3.3-SNAPSHOT/maven-site-plugin-3.3-SNAPSHOT.pom>
[INFO] Installing <https://builds.apache.org/job/maven-plugins-ITs-m3.0.3/ws/maven-source-plugin/pom.xml>
to <https://builds.apache.org/job/maven-plugins-ITs-m3.0.3/ws/maven-shade-plugin/target/local-repo/org/apache/maven/plugins/maven-source-plugin/2.3-SNAPSHOT/maven-source-plugin-2.3-SNAPSHOT.pom>
[INFO] Installing <https://builds.apache.org/job/maven-plugins-ITs-m3.0.3/ws/maven-source-plugin/target/maven-source-plugin-2.3-SNAPSHOT.jar>
to <https://builds.apache.org/job/maven-plugins-ITs-m3.0.3/ws/maven-shade-plugin/target/local-repo/org/apache/maven/plugins/maven-source-plugin/2.3-SNAPSHOT/maven-source-plugin-2.3-SNAPSHOT.jar>
[INFO] Installing <https://builds.apache.org/job/maven-plugins-ITs-m3.0.3/ws/maven-source-plugin/pom.xml>
to <https://builds.apache.org/job/maven-plugins-ITs-m3.0.3/ws/maven-shade-plugin/target/local-repo/org/apache/maven/plugins/maven-source-plugin/2.3-SNAPSHOT/maven-source-plugin-2.3-SNAPSHOT.pom>
[INFO] Installing <https://builds.apache.org/job/maven-plugins-ITs-m3.0.3/ws/maven-stage-plugin/pom.xml>
to <https://builds.apache.org/job/maven-plugins-ITs-m3.0.3/ws/maven-shade-plugin/target/local-repo/org/apache/maven/plugins/maven-stage-plugin/1.0-SNAPSHOT/maven-stage-plugin-1.0-SNAPSHOT.pom>
[INFO] Installing <https://builds.apache.org/job/maven-plugins-ITs-m3.0.3/ws/maven-stage-plugin/target/maven-stage-plugin-1.0-SNAPSHOT.jar>
to <https://builds.apache.org/job/maven-plugins-ITs-m3.0.3/ws/maven-shade-plugin/target/local-repo/org/apache/maven/plugins/maven-stage-plugin/1.0-SNAPSHOT/maven-stage-plugin-1.0-SNAPSHOT.jar>
[INFO] Installing <https://builds.apache.org/job/maven-plugins-ITs-m3.0.3/ws/maven-stage-plugin/pom.xml>
to <https://builds.apache.org/job/maven-plugins-ITs-m3.0.3/ws/maven-shade-plugin/target/local-repo/org/apache/maven/plugins/maven-stage-plugin/1.0-SNAPSHOT/maven-stage-plugin-1.0-SNAPSHOT.pom>
[INFO] Installing <https://builds.apache.org/job/maven-plugins-ITs-m3.0.3/ws/maven-toolchains-plugin/pom.xml>
to <https://builds.apache.org/job/maven-plugins-ITs-m3.0.3/ws/maven-shade-plugin/target/local-repo/org/apache/maven/plugins/maven-toolchains-plugin/1.1-SNAPSHOT/maven-toolchains-plugin-1.1-SNAPSHOT.pom>
[INFO] Installing <https://builds.apache.org/job/maven-plugins-ITs-m3.0.3/ws/maven-toolchains-plugin/target/maven-toolchains-plugin-1.1-SNAPSHOT.jar>
to <https://builds.apache.org/job/maven-plugins-ITs-m3.0.3/ws/maven-shade-plugin/target/local-repo/org/apache/maven/plugins/maven-toolchains-plugin/1.1-SNAPSHOT/maven-toolchains-plugin-1.1-SNAPSHOT.jar>
[INFO] Installing <https://builds.apache.org/job/maven-plugins-ITs-m3.0.3/ws/maven-toolchains-plugin/pom.xml>
to <https://builds.apache.org/job/maven-plugins-ITs-m3.0.3/ws/maven-shade-plugin/target/local-repo/org/apache/maven/plugins/maven-toolchains-plugin/1.1-SNAPSHOT/maven-toolchains-plugin-1.1-SNAPSHOT.pom>
[INFO] Installing <https://builds.apache.org/job/maven-plugins-ITs-m3.0.3/ws/maven-verifier-plugin/pom.xml>
to <https://builds.apache.org/job/maven-plugins-ITs-m3.0.3/ws/maven-shade-plugin/target/local-repo/org/apache/maven/plugins/maven-verifier-plugin/1.1-SNAPSHOT/maven-verifier-plugin-1.1-SNAPSHOT.pom>
[INFO] Installing <https://builds.apache.org/job/maven-plugins-ITs-m3.0.3/ws/maven-verifier-plugin/target/maven-verifier-plugin-1.1-SNAPSHOT.jar>
to <https://builds.apache.org/job/maven-plugins-ITs-m3.0.3/ws/maven-shade-plugin/target/local-repo/org/apache/maven/plugins/maven-verifier-plugin/1.1-SNAPSHOT/maven-verifier-plugin-1.1-SNAPSHOT.jar>
[INFO] Installing <https://builds.apache.org/job/maven-plugins-ITs-m3.0.3/ws/maven-verifier-plugin/pom.xml>
to <https://builds.apache.org/job/maven-plugins-ITs-m3.0.3/ws/maven-shade-plugin/target/local-repo/org/apache/maven/plugins/maven-verifier-plugin/1.1-SNAPSHOT/maven-verifier-plugin-1.1-SNAPSHOT.pom>
[INFO] Installing <https://builds.apache.org/job/maven-plugins-ITs-m3.0.3/ws/maven-war-plugin/pom.xml>
to <https://builds.apache.org/job/maven-plugins-ITs-m3.0.3/ws/maven-shade-plugin/target/local-repo/org/apache/maven/plugins/maven-war-plugin/2.4-SNAPSHOT/maven-war-plugin-2.4-SNAPSHOT.pom>
[INFO] Installing <https://builds.apache.org/job/maven-plugins-ITs-m3.0.3/ws/maven-war-plugin/target/maven-war-plugin-2.4-SNAPSHOT.jar>
to <https://builds.apache.org/job/maven-plugins-ITs-m3.0.3/ws/maven-shade-plugin/target/local-repo/org/apache/maven/plugins/maven-war-plugin/2.4-SNAPSHOT/maven-war-plugin-2.4-SNAPSHOT.jar>
[INFO] Installing <https://builds.apache.org/job/maven-plugins-ITs-m3.0.3/ws/maven-war-plugin/pom.xml>
to <https://builds.apache.org/job/maven-plugins-ITs-m3.0.3/ws/maven-shade-plugin/target/local-repo/org/apache/maven/plugins/maven-war-plugin/2.4-SNAPSHOT/maven-war-plugin-2.4-SNAPSHOT.pom>
[INFO] Installing <https://builds.apache.org/job/maven-plugins-ITs-m3.0.3/ws/maven-scm-publish-plugin/pom.xml>
to <https://builds.apache.org/job/maven-plugins-ITs-m3.0.3/ws/maven-shade-plugin/target/local-repo/org/apache/maven/plugins/maven-scm-publish-plugin/1.0-SNAPSHOT/maven-scm-publish-plugin-1.0-SNAPSHOT.pom>
[INFO] Installing <https://builds.apache.org/job/maven-plugins-ITs-m3.0.3/ws/maven-scm-publish-plugin/target/maven-scm-publish-plugin-1.0-SNAPSHOT.jar>
to <https://builds.apache.org/job/maven-plugins-ITs-m3.0.3/ws/maven-shade-plugin/target/local-repo/org/apache/maven/plugins/maven-scm-publish-plugin/1.0-SNAPSHOT/maven-scm-publish-plugin-1.0-SNAPSHOT.jar>
[INFO] Installing <https://builds.apache.org/job/maven-plugins-ITs-m3.0.3/ws/maven-scm-publish-plugin/pom.xml>
to <https://builds.apache.org/job/maven-plugins-ITs-m3.0.3/ws/maven-shade-plugin/target/local-repo/org/apache/maven/plugins/maven-scm-publish-plugin/1.0-SNAPSHOT/maven-scm-publish-plugin-1.0-SNAPSHOT.pom>
[INFO] Installing <https://builds.apache.org/job/maven-plugins-ITs-m3.0.3/ws/maven-invoker-plugin/pom.xml>
to <https://builds.apache.org/job/maven-plugins-ITs-m3.0.3/ws/maven-shade-plugin/target/local-repo/org/apache/maven/plugins/maven-invoker-plugin/1.9-SNAPSHOT/maven-invoker-plugin-1.9-SNAPSHOT.pom>
[INFO] Installing <https://builds.apache.org/job/maven-plugins-ITs-m3.0.3/ws/maven-invoker-plugin/target/maven-invoker-plugin-1.9-SNAPSHOT.jar>
to <https://builds.apache.org/job/maven-plugins-ITs-m3.0.3/ws/maven-shade-plugin/target/local-repo/org/apache/maven/plugins/maven-invoker-plugin/1.9-SNAPSHOT/maven-invoker-plugin-1.9-SNAPSHOT.jar>
[INFO] Installing <https://builds.apache.org/job/maven-plugins-ITs-m3.0.3/ws/maven-invoker-plugin/pom.xml>
to <https://builds.apache.org/job/maven-plugins-ITs-m3.0.3/ws/maven-shade-plugin/target/local-repo/org/apache/maven/plugins/maven-invoker-plugin/1.9-SNAPSHOT/maven-invoker-plugin-1.9-SNAPSHOT.pom>
[INFO] Installing <https://builds.apache.org/job/maven-plugins-ITs-m3.0.3/ws/maven-project-info-reports-plugin/pom.xml>
to <https://builds.apache.org/job/maven-plugins-ITs-m3.0.3/ws/maven-shade-plugin/target/local-repo/org/apache/maven/plugins/maven-project-info-reports-plugin/2.7-SNAPSHOT/maven-project-info-reports-plugin-2.7-SNAPSHOT.pom>
[INFO] Installing <https://builds.apache.org/job/maven-plugins-ITs-m3.0.3/ws/maven-project-info-reports-plugin/target/maven-project-info-reports-plugin-2.7-SNAPSHOT.jar>
to <https://builds.apache.org/job/maven-plugins-ITs-m3.0.3/ws/maven-shade-plugin/target/local-repo/org/apache/maven/plugins/maven-project-info-reports-plugin/2.7-SNAPSHOT/maven-project-info-reports-plugin-2.7-SNAPSHOT.jar>
[INFO] Installing <https://builds.apache.org/job/maven-plugins-ITs-m3.0.3/ws/maven-project-info-reports-plugin/pom.xml>
to <https://builds.apache.org/job/maven-plugins-ITs-m3.0.3/ws/maven-shade-plugin/target/local-repo/org/apache/maven/plugins/maven-project-info-reports-plugin/2.7-SNAPSHOT/maven-project-info-reports-plugin-2.7-SNAPSHOT.pom>
[INFO] Installing <https://builds.apache.org/job/maven-plugins-ITs-m3.0.3/ws/maven-remote-resources-plugin/pom.xml>
to <https://builds.apache.org/job/maven-plugins-ITs-m3.0.3/ws/maven-shade-plugin/target/local-repo/org/apache/maven/plugins/maven-remote-resources-plugin/1.5-SNAPSHOT/maven-remote-resources-plugin-1.5-SNAPSHOT.pom>
[INFO] Installing <https://builds.apache.org/job/maven-plugins-ITs-m3.0.3/ws/maven-remote-resources-plugin/target/maven-remote-resources-plugin-1.5-SNAPSHOT.jar>
to <https://builds.apache.org/job/maven-plugins-ITs-m3.0.3/ws/maven-shade-plugin/target/local-repo/org/apache/maven/plugins/maven-remote-resources-plugin/1.5-SNAPSHOT/maven-remote-resources-plugin-1.5-SNAPSHOT.jar>
[INFO] Installing <https://builds.apache.org/job/maven-plugins-ITs-m3.0.3/ws/maven-remote-resources-plugin/pom.xml>
to <https://builds.apache.org/job/maven-plugins-ITs-m3.0.3/ws/maven-shade-plugin/target/local-repo/org/apache/maven/plugins/maven-remote-resources-plugin/1.5-SNAPSHOT/maven-remote-resources-plugin-1.5-SNAPSHOT.pom>
[INFO] Installing <https://builds.apache.org/job/maven-plugins-ITs-m3.0.3/ws/maven-shade-plugin/pom.xml>
to <https://builds.apache.org/job/maven-plugins-ITs-m3.0.3/ws/maven-shade-plugin/target/local-repo/org/apache/maven/plugins/maven-shade-plugin/3.0-SNAPSHOT/maven-shade-plugin-3.0-SNAPSHOT.pom>
[INFO] Installing <https://builds.apache.org/job/maven-plugins-ITs-m3.0.3/ws/maven-shade-plugin/target/maven-shade-plugin-3.0-SNAPSHOT.jar>
to <https://builds.apache.org/job/maven-plugins-ITs-m3.0.3/ws/maven-shade-plugin/target/local-repo/org/apache/maven/plugins/maven-shade-plugin/3.0-SNAPSHOT/maven-shade-plugin-3.0-SNAPSHOT.jar>
[INFO] Installing <https://builds.apache.org/job/maven-plugins-ITs-m3.0.3/ws/maven-shade-plugin/target/maven-shade-plugin-3.0-SNAPSHOT-tests.jar>
to <https://builds.apache.org/job/maven-plugins-ITs-m3.0.3/ws/maven-shade-plugin/target/local-repo/org/apache/maven/plugins/maven-shade-plugin/3.0-SNAPSHOT/maven-shade-plugin-3.0-SNAPSHOT-tests.jar>
[INFO] 
[INFO] --- maven-invoker-plugin:1.8:integration-test (integration-test) @ maven-shade-plugin
---
[INFO] Building: duplicate-classes-without-reloc/pom.xml
[INFO] ..SUCCESS (4.0 s)
[INFO] Building: filter-artifact-contents/pom.xml
[INFO] run script verify.bsh
[INFO] ..SUCCESS (4.0 s)
[INFO] Building: project-with-reactors-included/pom.xml
[INFO] run script verify.bsh
[INFO] ..SUCCESS (6.9 s)
[INFO] Building: reloc-includes-excludes/pom.xml
[INFO] run script verify.bsh
[INFO] ..SUCCESS (4.4 s)
[INFO] Building: mini-jar-respect-includes/pom.xml
[INFO] run script verify.bsh
[INFO] ..SUCCESS (4.6 s)
[INFO] Building: attached-artifact-type/pom.xml
[INFO] ..SUCCESS (3.0 s)
[INFO] Building: services-resource-transformer/pom.xml
[INFO] run script verify.bsh
[INFO] ..SUCCESS (3.7 s)
[INFO] Building: reloc-enum-ref-from-anno/pom.xml
[INFO] ..SUCCESS (3.6 s)
[INFO] Building: finalNameBuild/pom.xml
[INFO] run script setup.bsh
[INFO] run script verify.bsh
[INFO] ..SUCCESS (3.8 s)
[INFO] Building: reloc-anno/pom.xml
[INFO] ..SUCCESS (3.6 s)
[INFO] Building: dep-reduced-pom-use-base-version/pom.xml
[INFO] run script verify.groovy
[INFO] ..SUCCESS (4.0 s)
[INFO] Building: shadePomDependency/pom.xml
[INFO] ..SUCCESS (4.5 s)
[INFO] Building: users-shader-impl/pom.xml
[INFO] run script verify.groovy
[INFO] ..SUCCESS (4.4 s)
[INFO] Building: duplicate-classes-with-reloc/pom.xml
[INFO] ..SUCCESS (2.9 s)
[INFO] Building: dep-reduced-pom/pom.xml
[INFO] run script verify.groovy
[INFO] ..SUCCESS (3.7 s)
[INFO] Building: reloc-abs-resource-path/pom.xml
[INFO] ..SUCCESS (6.5 s)
[INFO] Building: component-descriptor-relocation/pom.xml
[INFO] ..SUCCESS (4.8 s)
[INFO] Building: empty-relocation-shaded-pattern/pom.xml
[INFO] ..SUCCESS (3.6 s)
[INFO] Building: non-runtime-scope-excluded/pom.xml
[INFO] run script verify.bsh
[INFO] ..SUCCESS (3.9 s)
[INFO] Building: plugin-descriptor-relocation/pom.xml
[INFO] run script verify.groovy
[INFO] ..SUCCESS (8.2 s)
[INFO] Building: mini-jar/pom.xml
[INFO] run script verify.bsh
[INFO] ..SUCCESS (4.0 s)
[INFO] Building: finalNameShade/pom.xml
[INFO] run script setup.bsh
[INFO] run script verify.bsh
[INFO] ..SUCCESS (3.9 s)
[INFO] Building: artifact-includes-excludes/pom.xml
[INFO] run script verify.bsh
[INFO] ..SUCCESS (3.8 s)
[INFO] Building: xml-transformer-ignores-dtd/pom.xml
[INFO] run script verify.bsh
[INFO] ..SUCCESS (3.7 s)
[INFO] Building: reloc-class-from-string-pool/pom.xml
[INFO] ..SUCCESS (3.3 s)
[INFO] Building: dep-reduced-pom-with-local-parent/pom.xml
[INFO] ..SUCCESS (2.7 s)
[INFO] Building: mini-jar-package-info/pom.xml
[INFO] run script verify.bsh
[INFO] ..SUCCESS (4.4 s)
[INFO] Building: attach-after-lifecycle-fork/pom.xml
[INFO] run script setup.bsh
[INFO] run script verify.bsh
[INFO] ..SUCCESS (3.2 s)
[INFO] Building: manifest-transformed/pom.xml
[INFO] run script verify.bsh
[INFO] ..SUCCESS (4.1 s)
[INFO] Building: dep-reduced-pom-unique/pom.xml
[INFO] run script verify.groovy
[INFO] ..SUCCESS (3.9 s)
[INFO] Building: pom-packaging/pom.xml
[INFO] run script verify.bsh
[INFO] ..SUCCESS (2.3 s)
[INFO] Building: MSHADE-105/pom.xml
[INFO] run script verify.bsh
[INFO] ..SUCCESS (7.1 s)
[INFO] Building: rerun-with-reloc/pom.xml
[INFO] ..SUCCESS (4.5 s)
[INFO] Building: rerun-without-reloc/pom.xml
[INFO] ..SUCCESS (3.2 s)
[INFO] Building: implicit-inclusion-of-project-artifact/pom.xml
[INFO] run script verify.bsh
[INFO] ..SUCCESS (4.0 s)
[INFO] Building: mini-jar-malformed-dependencies/pom.xml
[INFO] ..SUCCESS (6.7 s)
[INFO] Building: empty-apache-notice-transform/pom.xml
[INFO] ..SUCCESS (4.1 s)
[INFO] Building: finalNameShade-attached/pom.xml
[INFO] run script setup.bsh
[INFO] run script verify.bsh
[INFO] ..SUCCESS (3.8 s)
[INFO] Building: mshade-123/pom.xml
[INFO] ..SUCCESS (5.6 s)
[INFO] Building: dep-reduced-pom-relocated-result/pom.xml
[INFO] ..SUCCESS (2.7 s)
[INFO] Building: empty-relocation-pattern/pom.xml
[INFO] ..SUCCESS (3.7 s)
[INFO] Building: finalNameBuild-attached/pom.xml
[INFO] run script setup.bsh
[INFO] run script verify.bsh
[INFO] ..SUCCESS (3.7 s)
[INFO] Building: manifest-retained/pom.xml
[INFO] run script verify.bsh
[INFO] ..SUCCESS (3.9 s)
[INFO] 
[INFO] --- maven-invoker-plugin:1.8:verify (integration-test) @ maven-shade-plugin ---
[INFO] -------------------------------------------------
[INFO] Build Summary:
[INFO]   Passed: 43, Failed: 0, Errors: 0, Skipped: 0
[INFO] -------------------------------------------------
[INFO] 
[INFO] --- maven-install-plugin:2.3.1:install (default-install) @ maven-shade-plugin ---
[INFO] Installing <https://builds.apache.org/job/maven-plugins-ITs-m3.0.3/ws/maven-shade-plugin/target/maven-shade-plugin-3.0-SNAPSHOT.jar>
to /home/hudson/.m2/repository/org/apache/maven/plugins/maven-shade-plugin/3.0-SNAPSHOT/maven-shade-plugin-3.0-SNAPSHOT.jar
[INFO] Installing <https://builds.apache.org/job/maven-plugins-ITs-m3.0.3/ws/maven-shade-plugin/pom.xml>
to /home/hudson/.m2/repository/org/apache/maven/plugins/maven-shade-plugin/3.0-SNAPSHOT/maven-shade-plugin-3.0-SNAPSHOT.pom
[INFO] Installing <https://builds.apache.org/job/maven-plugins-ITs-m3.0.3/ws/maven-shade-plugin/target/maven-shade-plugin-3.0-SNAPSHOT-tests.jar>
to /home/hudson/.m2/repository/org/apache/maven/plugins/maven-shade-plugin/3.0-SNAPSHOT/maven-shade-plugin-3.0-SNAPSHOT-tests.jar
[INFO]                                                                         
[INFO] ------------------------------------------------------------------------
[INFO] Building Maven Plugins Aggregator 1-SNAPSHOT
[INFO] ------------------------------------------------------------------------
[INFO] 
[INFO] --- maven-clean-plugin:2.4.1:clean (default-clean) @ maven-plugins-aggregator ---
[INFO] 
[INFO] --- maven-remote-resources-plugin:1.1:process (default) @ maven-plugins-aggregator
---
[INFO] Setting property: classpath.resource.loader.class => 'org.codehaus.plexus.velocity.ContextClassLoaderResourceLoader'.
[INFO] Setting property: velocimacro.messages.on => 'false'.
[INFO] Setting property: resource.loader => 'classpath'.
[INFO] Setting property: resource.manager.logwhenfound => 'false'.
[INFO] 
[INFO] --- maven-install-plugin:2.3.1:install (default-install) @ maven-plugins-aggregator
---
[INFO] Installing <https://builds.apache.org/job/maven-plugins-ITs-m3.0.3/ws/pom.xml>
to /home/hudson/.m2/repository/org/apache/maven/plugins/maven-plugins-aggregator/1-SNAPSHOT/maven-plugins-aggregator-1-SNAPSHOT.pom
[INFO] ------------------------------------------------------------------------
[INFO] Reactor Summary:
[INFO] 
[INFO] Maven Plugins ..................................... SUCCESS [23.729s]
[INFO] Maven ACR Plugin .................................. SUCCESS [42.469s]
[INFO] Maven Ant Plugin .................................. SUCCESS [1:24.413s]
[INFO] Maven AntRun Plugin ............................... SUCCESS [59.705s]
[INFO] Maven Eclipse Plugin .............................. SUCCESS [9:14.636s]
[INFO] Maven Assembly Plugin ............................. SUCCESS [12:02.852s]
[INFO] Maven Changelog Plugin ............................ SUCCESS [1:21.945s]
[INFO] Maven Changes Report Plugin ....................... SUCCESS [1:12.696s]
[INFO] Maven Checkstyle Plugin ........................... SUCCESS [1:54.929s]
[INFO] Maven Clean Plugin ................................ SUCCESS [22.989s]
[INFO] Maven Compiler Plugin ............................. FAILURE [2.039s]
[INFO] Maven Dependency Plugin ........................... SUCCESS [3:16.102s]
[INFO] Maven Deploy Plugin ............................... SUCCESS [1:11.001s]
[INFO] Maven DOAP Plugin ................................. SUCCESS [19.656s]
[INFO] Maven Documentation Checker Plugin ................ SUCCESS [4.876s]
[INFO] Maven EAR Plugin .................................. SUCCESS [3:48.703s]
[INFO] Maven EJB Plugin .................................. SUCCESS [27.761s]
[INFO] Maven GPG Plugin .................................. SUCCESS [9.714s]
[INFO] Maven Help Plugin ................................. SUCCESS [53.810s]
[INFO] Maven IDEA Plugin ................................. SUCCESS [8.173s]
[INFO] Maven Install Plugin .............................. SUCCESS [46.626s]
[INFO] Maven JAR Plugin .................................. SUCCESS [1:16.103s]
[INFO] Maven Jarsigner Plugin ............................ SUCCESS [27.767s]
[INFO] Maven Javadoc Plugin .............................. SUCCESS [2:55.340s]
[INFO] Maven Linkcheck Plugin ............................ SUCCESS [3.995s]
[INFO] Maven One Plugin .................................. SUCCESS [4.689s]
[INFO] Maven Patch Plugin ................................ SUCCESS [13.634s]
[INFO] Maven PDF Plugin .................................. SUCCESS [45.756s]
[INFO] Maven PMD Plugin .................................. FAILURE [1:33.899s]
[INFO] Maven RAR Plugin .................................. SUCCESS [10.805s]
[INFO] Maven Reactor Plugin .............................. SUCCESS [3.823s]
[INFO] Maven Repository Plugin ........................... SUCCESS [37.659s]
[INFO] Maven Resources Plugin ............................ SUCCESS [54.819s]
[INFO] Maven Site Plugin 3 ............................... SUCCESS [7:43.014s]
[INFO] Maven Source Plugin ............................... SUCCESS [50.210s]
[INFO] Maven Stage Plugin ................................ SUCCESS [2.873s]
[INFO] Maven Toolchains Plugin ........................... SUCCESS [1.889s]
[INFO] Maven Verifier Plugin ............................. SUCCESS [19.384s]
[INFO] Maven WAR Plugin .................................. SUCCESS [1:19.180s]
[INFO] Maven SCM Publish Plugin .......................... SUCCESS [2:22.732s]
[INFO] Maven Invoker Plugin .............................. SUCCESS [5:47.403s]
[INFO] Maven Project Info Reports Plugin ................. SUCCESS [3:37.953s]
[INFO] Maven Remote Resources Plugin ..................... SUCCESS [54.621s]
[INFO] Maven Shade Plugin ................................ SUCCESS [3:27.305s]
[INFO] Maven Plugins Aggregator .......................... SUCCESS [0.531s]
[INFO] ------------------------------------------------------------------------
[INFO] BUILD FAILURE
[INFO] ------------------------------------------------------------------------
[INFO] Total time: 1:16:26.174s
[INFO] Finished at: Wed Apr 03 02:24:36 UTC 2013
[INFO] Final Memory: 94M/304M
[INFO] ------------------------------------------------------------------------
[WARNING] The requested profile "apache.snapshots" could not be activated because it does
not exist.
[ERROR] Failed to execute goal on project maven-compiler-plugin: Could not resolve dependencies
for project org.apache.maven.plugins:maven-compiler-plugin:maven-plugin:3.3-SNAPSHOT: Could
not find artifact org.apache.maven.shared:maven-shared-incremental:jar:1.1 in central (http://repo1.maven.org/maven2)
-> [Help 1]
[ERROR] Failed to execute goal org.apache.maven.plugins:maven-invoker-plugin:1.7:verify (integration-test)
on project maven-pmd-plugin: 1 build failed. See console output above for details. -> [Help
2]
[ERROR] 
[ERROR] To see the full stack trace of the errors, re-run Maven with the -e switch.
[ERROR] Re-run Maven using the -X switch to enable full debug logging.
[ERROR] 
[ERROR] For more information about the errors and possible solutions, please read the following
articles:
[ERROR] [Help 1] http://cwiki.apache.org/confluence/display/MAVEN/DependencyResolutionException
[ERROR] [Help 2] http://cwiki.apache.org/confluence/display/MAVEN/MojoFailureException
[ERROR] 
[ERROR] After correcting the problems, you can resume the build with the command
[ERROR]   mvn <goals> -rf :maven-compiler-plugin
Build step 'Invoke top-level Maven targets' marked build as failure
Recording test results

Mime
View raw message