maven-notifications mailing list archives

Site index · List index
Message view « Date » · « Thread »
Top « Date » · « Thread »
From Apache Jenkins Server <jenk...@builds.apache.org>
Subject Build failed in Jenkins: maven-plugins-ITs-m3-windows #303
Date Tue, 23 Jul 2013 21:16:41 GMT
See <https://builds.apache.org/job/maven-plugins-ITs-m3-windows/303/changes>

Changes:

[dennisl] Use maven-javadoc-plugin:2.9.1 to avoid Javadoc vulnerability.

[dennisl] Prepare for retirement.

[dennisl] Fix ambiguous link.

[dennisl] Follow ASF branding rules.

[dennisl] [maven-release-plugin] prepare for next development iteration

[dennisl] [maven-release-plugin] prepare release maven-idea-plugin-2.2.1

[dennisl] Add "(RETIRED)" to the name in the POM. This will propagate to the title and breadcrumb
of every page in the generated site.

[dennisl] Use maven-javadoc-plugin:2.9.1 to avoid Javadoc vulnerability.

[dennisl] Use latest version of maven-changes-plugin and fix its configuration so that we
can fetch issues from JIRA.

------------------------------------------
[...truncated 11539 lines...]
[INFO] Installing F:\hudson\hudson-slave\workspace\maven-plugins-ITs-m3-windows\maven-site-plugin\dependency-reduced-pom.xml
to F:\hudson\hudson-slave\workspace\maven-plugins-ITs-m3-windows\maven-shade-plugin\target\local-repo\org\apache\maven\plugins\maven-site-plugin\3.4-SNAPSHOT\maven-site-plugin-3.4-SNAPSHOT.pom
[INFO] Installing F:\hudson\hudson-slave\workspace\maven-plugins-ITs-m3-windows\maven-source-plugin\pom.xml
to F:\hudson\hudson-slave\workspace\maven-plugins-ITs-m3-windows\maven-shade-plugin\target\local-repo\org\apache\maven\plugins\maven-source-plugin\2.3-SNAPSHOT\maven-source-plugin-2.3-SNAPSHOT.pom
[INFO] Installing F:\hudson\hudson-slave\workspace\maven-plugins-ITs-m3-windows\maven-source-plugin\target\maven-source-plugin-2.3-SNAPSHOT.jar
to F:\hudson\hudson-slave\workspace\maven-plugins-ITs-m3-windows\maven-shade-plugin\target\local-repo\org\apache\maven\plugins\maven-source-plugin\2.3-SNAPSHOT\maven-source-plugin-2.3-SNAPSHOT.jar
[INFO] Installing F:\hudson\hudson-slave\workspace\maven-plugins-ITs-m3-windows\maven-source-plugin\pom.xml
to F:\hudson\hudson-slave\workspace\maven-plugins-ITs-m3-windows\maven-shade-plugin\target\local-repo\org\apache\maven\plugins\maven-source-plugin\2.3-SNAPSHOT\maven-source-plugin-2.3-SNAPSHOT.pom
[INFO] Installing F:\hudson\hudson-slave\workspace\maven-plugins-ITs-m3-windows\maven-stage-plugin\pom.xml
to F:\hudson\hudson-slave\workspace\maven-plugins-ITs-m3-windows\maven-shade-plugin\target\local-repo\org\apache\maven\plugins\maven-stage-plugin\1.0-SNAPSHOT\maven-stage-plugin-1.0-SNAPSHOT.pom
[INFO] Installing F:\hudson\hudson-slave\workspace\maven-plugins-ITs-m3-windows\maven-stage-plugin\target\maven-stage-plugin-1.0-SNAPSHOT.jar
to F:\hudson\hudson-slave\workspace\maven-plugins-ITs-m3-windows\maven-shade-plugin\target\local-repo\org\apache\maven\plugins\maven-stage-plugin\1.0-SNAPSHOT\maven-stage-plugin-1.0-SNAPSHOT.jar
[INFO] Installing F:\hudson\hudson-slave\workspace\maven-plugins-ITs-m3-windows\maven-stage-plugin\pom.xml
to F:\hudson\hudson-slave\workspace\maven-plugins-ITs-m3-windows\maven-shade-plugin\target\local-repo\org\apache\maven\plugins\maven-stage-plugin\1.0-SNAPSHOT\maven-stage-plugin-1.0-SNAPSHOT.pom
[INFO] Installing F:\hudson\hudson-slave\workspace\maven-plugins-ITs-m3-windows\maven-toolchains-plugin\pom.xml
to F:\hudson\hudson-slave\workspace\maven-plugins-ITs-m3-windows\maven-shade-plugin\target\local-repo\org\apache\maven\plugins\maven-toolchains-plugin\1.1-SNAPSHOT\maven-toolchains-plugin-1.1-SNAPSHOT.pom
[INFO] Installing F:\hudson\hudson-slave\workspace\maven-plugins-ITs-m3-windows\maven-toolchains-plugin\target\maven-toolchains-plugin-1.1-SNAPSHOT.jar
to F:\hudson\hudson-slave\workspace\maven-plugins-ITs-m3-windows\maven-shade-plugin\target\local-repo\org\apache\maven\plugins\maven-toolchains-plugin\1.1-SNAPSHOT\maven-toolchains-plugin-1.1-SNAPSHOT.jar
[INFO] Installing F:\hudson\hudson-slave\workspace\maven-plugins-ITs-m3-windows\maven-toolchains-plugin\pom.xml
to F:\hudson\hudson-slave\workspace\maven-plugins-ITs-m3-windows\maven-shade-plugin\target\local-repo\org\apache\maven\plugins\maven-toolchains-plugin\1.1-SNAPSHOT\maven-toolchains-plugin-1.1-SNAPSHOT.pom
[INFO] Installing F:\hudson\hudson-slave\workspace\maven-plugins-ITs-m3-windows\maven-verifier-plugin\pom.xml
to F:\hudson\hudson-slave\workspace\maven-plugins-ITs-m3-windows\maven-shade-plugin\target\local-repo\org\apache\maven\plugins\maven-verifier-plugin\1.1-SNAPSHOT\maven-verifier-plugin-1.1-SNAPSHOT.pom
[INFO] Installing F:\hudson\hudson-slave\workspace\maven-plugins-ITs-m3-windows\maven-verifier-plugin\target\maven-verifier-plugin-1.1-SNAPSHOT.jar
to F:\hudson\hudson-slave\workspace\maven-plugins-ITs-m3-windows\maven-shade-plugin\target\local-repo\org\apache\maven\plugins\maven-verifier-plugin\1.1-SNAPSHOT\maven-verifier-plugin-1.1-SNAPSHOT.jar
[INFO] Installing F:\hudson\hudson-slave\workspace\maven-plugins-ITs-m3-windows\maven-verifier-plugin\pom.xml
to F:\hudson\hudson-slave\workspace\maven-plugins-ITs-m3-windows\maven-shade-plugin\target\local-repo\org\apache\maven\plugins\maven-verifier-plugin\1.1-SNAPSHOT\maven-verifier-plugin-1.1-SNAPSHOT.pom
[INFO] Installing F:\hudson\hudson-slave\workspace\maven-plugins-ITs-m3-windows\maven-war-plugin\pom.xml
to F:\hudson\hudson-slave\workspace\maven-plugins-ITs-m3-windows\maven-shade-plugin\target\local-repo\org\apache\maven\plugins\maven-war-plugin\2.5-SNAPSHOT\maven-war-plugin-2.5-SNAPSHOT.pom
[INFO] Installing F:\hudson\hudson-slave\workspace\maven-plugins-ITs-m3-windows\maven-war-plugin\target\maven-war-plugin-2.5-SNAPSHOT.jar
to F:\hudson\hudson-slave\workspace\maven-plugins-ITs-m3-windows\maven-shade-plugin\target\local-repo\org\apache\maven\plugins\maven-war-plugin\2.5-SNAPSHOT\maven-war-plugin-2.5-SNAPSHOT.jar
[INFO] Installing F:\hudson\hudson-slave\workspace\maven-plugins-ITs-m3-windows\maven-war-plugin\pom.xml
to F:\hudson\hudson-slave\workspace\maven-plugins-ITs-m3-windows\maven-shade-plugin\target\local-repo\org\apache\maven\plugins\maven-war-plugin\2.5-SNAPSHOT\maven-war-plugin-2.5-SNAPSHOT.pom
[INFO] Installing F:\hudson\hudson-slave\workspace\maven-plugins-ITs-m3-windows\maven-scm-publish-plugin\pom.xml
to F:\hudson\hudson-slave\workspace\maven-plugins-ITs-m3-windows\maven-shade-plugin\target\local-repo\org\apache\maven\plugins\maven-scm-publish-plugin\1.0-SNAPSHOT\maven-scm-publish-plugin-1.0-SNAPSHOT.pom
[INFO] Installing F:\hudson\hudson-slave\workspace\maven-plugins-ITs-m3-windows\maven-scm-publish-plugin\target\maven-scm-publish-plugin-1.0-SNAPSHOT.jar
to F:\hudson\hudson-slave\workspace\maven-plugins-ITs-m3-windows\maven-shade-plugin\target\local-repo\org\apache\maven\plugins\maven-scm-publish-plugin\1.0-SNAPSHOT\maven-scm-publish-plugin-1.0-SNAPSHOT.jar
[INFO] Installing F:\hudson\hudson-slave\workspace\maven-plugins-ITs-m3-windows\maven-scm-publish-plugin\pom.xml
to F:\hudson\hudson-slave\workspace\maven-plugins-ITs-m3-windows\maven-shade-plugin\target\local-repo\org\apache\maven\plugins\maven-scm-publish-plugin\1.0-SNAPSHOT\maven-scm-publish-plugin-1.0-SNAPSHOT.pom
[INFO] Installing F:\hudson\hudson-slave\workspace\maven-plugins-ITs-m3-windows\maven-invoker-plugin\pom.xml
to F:\hudson\hudson-slave\workspace\maven-plugins-ITs-m3-windows\maven-shade-plugin\target\local-repo\org\apache\maven\plugins\maven-invoker-plugin\1.9-SNAPSHOT\maven-invoker-plugin-1.9-SNAPSHOT.pom
[INFO] Installing F:\hudson\hudson-slave\workspace\maven-plugins-ITs-m3-windows\maven-invoker-plugin\target\maven-invoker-plugin-1.9-SNAPSHOT.jar
to F:\hudson\hudson-slave\workspace\maven-plugins-ITs-m3-windows\maven-shade-plugin\target\local-repo\org\apache\maven\plugins\maven-invoker-plugin\1.9-SNAPSHOT\maven-invoker-plugin-1.9-SNAPSHOT.jar
[INFO] Installing F:\hudson\hudson-slave\workspace\maven-plugins-ITs-m3-windows\maven-invoker-plugin\pom.xml
to F:\hudson\hudson-slave\workspace\maven-plugins-ITs-m3-windows\maven-shade-plugin\target\local-repo\org\apache\maven\plugins\maven-invoker-plugin\1.9-SNAPSHOT\maven-invoker-plugin-1.9-SNAPSHOT.pom
[INFO] Installing F:\hudson\hudson-slave\workspace\maven-plugins-ITs-m3-windows\maven-project-info-reports-plugin\pom.xml
to F:\hudson\hudson-slave\workspace\maven-plugins-ITs-m3-windows\maven-shade-plugin\target\local-repo\org\apache\maven\plugins\maven-project-info-reports-plugin\2.8-SNAPSHOT\maven-project-info-reports-plugin-2.8-SNAPSHOT.pom
[INFO] Installing F:\hudson\hudson-slave\workspace\maven-plugins-ITs-m3-windows\maven-project-info-reports-plugin\target\maven-project-info-reports-plugin-2.8-SNAPSHOT.jar
to F:\hudson\hudson-slave\workspace\maven-plugins-ITs-m3-windows\maven-shade-plugin\target\local-repo\org\apache\maven\plugins\maven-project-info-reports-plugin\2.8-SNAPSHOT\maven-project-info-reports-plugin-2.8-SNAPSHOT.jar
[INFO] Installing F:\hudson\hudson-slave\workspace\maven-plugins-ITs-m3-windows\maven-project-info-reports-plugin\pom.xml
to F:\hudson\hudson-slave\workspace\maven-plugins-ITs-m3-windows\maven-shade-plugin\target\local-repo\org\apache\maven\plugins\maven-project-info-reports-plugin\2.8-SNAPSHOT\maven-project-info-reports-plugin-2.8-SNAPSHOT.pom
[INFO] Installing F:\hudson\hudson-slave\workspace\maven-plugins-ITs-m3-windows\maven-remote-resources-plugin\pom.xml
to F:\hudson\hudson-slave\workspace\maven-plugins-ITs-m3-windows\maven-shade-plugin\target\local-repo\org\apache\maven\plugins\maven-remote-resources-plugin\1.5-SNAPSHOT\maven-remote-resources-plugin-1.5-SNAPSHOT.pom
[INFO] Installing F:\hudson\hudson-slave\workspace\maven-plugins-ITs-m3-windows\maven-remote-resources-plugin\target\maven-remote-resources-plugin-1.5-SNAPSHOT.jar
to F:\hudson\hudson-slave\workspace\maven-plugins-ITs-m3-windows\maven-shade-plugin\target\local-repo\org\apache\maven\plugins\maven-remote-resources-plugin\1.5-SNAPSHOT\maven-remote-resources-plugin-1.5-SNAPSHOT.jar
[INFO] Installing F:\hudson\hudson-slave\workspace\maven-plugins-ITs-m3-windows\maven-remote-resources-plugin\pom.xml
to F:\hudson\hudson-slave\workspace\maven-plugins-ITs-m3-windows\maven-shade-plugin\target\local-repo\org\apache\maven\plugins\maven-remote-resources-plugin\1.5-SNAPSHOT\maven-remote-resources-plugin-1.5-SNAPSHOT.pom
[INFO] Installing F:\hudson\hudson-slave\workspace\maven-plugins-ITs-m3-windows\maven-shade-plugin\pom.xml
to F:\hudson\hudson-slave\workspace\maven-plugins-ITs-m3-windows\maven-shade-plugin\target\local-repo\org\apache\maven\plugins\maven-shade-plugin\2.2-SNAPSHOT\maven-shade-plugin-2.2-SNAPSHOT.pom
[INFO] Installing F:\hudson\hudson-slave\workspace\maven-plugins-ITs-m3-windows\maven-shade-plugin\target\maven-shade-plugin-2.2-SNAPSHOT.jar
to F:\hudson\hudson-slave\workspace\maven-plugins-ITs-m3-windows\maven-shade-plugin\target\local-repo\org\apache\maven\plugins\maven-shade-plugin\2.2-SNAPSHOT\maven-shade-plugin-2.2-SNAPSHOT.jar
[INFO] Installing F:\hudson\hudson-slave\workspace\maven-plugins-ITs-m3-windows\maven-shade-plugin\target\maven-shade-plugin-2.2-SNAPSHOT-tests.jar
to F:\hudson\hudson-slave\workspace\maven-plugins-ITs-m3-windows\maven-shade-plugin\target\local-repo\org\apache\maven\plugins\maven-shade-plugin\2.2-SNAPSHOT\maven-shade-plugin-2.2-SNAPSHOT-tests.jar
[INFO] 
[INFO] --- maven-invoker-plugin:1.8:integration-test (integration-test) @ maven-shade-plugin
---
[INFO] Building: artifact-includes-excludes\pom.xml
[INFO] run script verify.bsh
[INFO] ..SUCCESS (8.3 s)
[INFO] Building: attach-after-lifecycle-fork\pom.xml
[INFO] run script setup.bsh
[INFO] run script verify.bsh
[INFO] ..SUCCESS (6.9 s)
[INFO] Building: attached-artifact-type\pom.xml
[INFO] ..SUCCESS (5.2 s)
[INFO] Building: component-descriptor-relocation\pom.xml
[INFO] ..SUCCESS (6.1 s)
[INFO] Building: dep-reduced-pom\pom.xml
[INFO] run script verify.groovy
[INFO] ..SUCCESS (5.2 s)
[INFO] Building: dep-reduced-pom-relocated-result\pom.xml
[INFO] ..SUCCESS (3.5 s)
[INFO] Building: dep-reduced-pom-unique\pom.xml
[INFO] run script verify.groovy
[INFO] ..SUCCESS (5.4 s)
[INFO] Building: dep-reduced-pom-use-base-version\pom.xml
[INFO] run script verify.groovy
[INFO] ..SUCCESS (5.2 s)
[INFO] Building: dep-reduced-pom-with-local-parent\pom.xml
[INFO] ..SUCCESS (3.4 s)
[INFO] Building: duplicate-classes-with-reloc\pom.xml
[INFO] ..SUCCESS (4.2 s)
[INFO] Building: duplicate-classes-without-reloc\pom.xml
[INFO] ..SUCCESS (3.6 s)
[INFO] Building: empty-apache-notice-transform\pom.xml
[INFO] ..SUCCESS (5.4 s)
[INFO] Building: empty-relocation-pattern\pom.xml
[INFO] ..SUCCESS (4.4 s)
[INFO] Building: empty-relocation-shaded-pattern\pom.xml
[INFO] ..SUCCESS (4.8 s)
[INFO] Building: filter-artifact-contents\pom.xml
[INFO] run script verify.bsh
[INFO] ..SUCCESS (4.4 s)
[INFO] Building: finalNameBuild\pom.xml
[INFO] run script setup.bsh
[INFO] run script verify.bsh
[INFO] ..SUCCESS (4.7 s)
[INFO] Building: finalNameBuild-attached\pom.xml
[INFO] run script setup.bsh
[INFO] run script verify.bsh
[INFO] ..SUCCESS (4.6 s)
[INFO] Building: finalNameShade\pom.xml
[INFO] run script setup.bsh
[INFO] run script verify.bsh
[INFO] ..SUCCESS (4.6 s)
[INFO] Building: finalNameShade-attached\pom.xml
[INFO] run script setup.bsh
[INFO] run script verify.bsh
[INFO] ..SUCCESS (4.8 s)
[INFO] Building: implicit-inclusion-of-project-artifact\pom.xml
[INFO] run script verify.bsh
[INFO] ..SUCCESS (5.2 s)
[INFO] Building: manifest-retained\pom.xml
[INFO] run script verify.bsh
[INFO] ..SUCCESS (6.6 s)
[INFO] Building: manifest-transformed\pom.xml
[INFO] run script verify.bsh
[INFO] ..SUCCESS (5.6 s)
[INFO] Building: mini-jar\pom.xml
[INFO] run script verify.bsh
[INFO] ..SUCCESS (5.6 s)
[INFO] Building: mini-jar-malformed-dependencies\pom.xml
[INFO] ..SUCCESS (9.0 s)
[INFO] Building: mini-jar-package-info\pom.xml
[INFO] run script verify.bsh
[INFO] ..SUCCESS (7.2 s)
[INFO] Building: mini-jar-respect-includes\pom.xml
[INFO] run script verify.bsh
[INFO] ..SUCCESS (5.5 s)
[INFO] Building: MSHADE-105\pom.xml
[INFO] run script verify.bsh
[INFO] ..SUCCESS (12.4 s)
[INFO] Building: MSHADE-114\pom.xml
[INFO] ..SUCCESS (5.1 s)
[INFO] Building: mshade-123\pom.xml
[INFO] ..SUCCESS (13.2 s)
[INFO] Building: MSHADE-133\pom.xml
[INFO] run script verify.groovy
[INFO] ..SUCCESS (4.9 s)
[INFO] Building: non-runtime-scope-excluded\pom.xml
[INFO] run script verify.bsh
[INFO] ..SUCCESS (5.5 s)
[INFO] Building: plugin-descriptor-relocation\pom.xml
[INFO] run script verify.groovy
[INFO] ..SUCCESS (10.8 s)
[INFO] Building: pom-packaging\pom.xml
[INFO] run script verify.bsh
[INFO] ..SUCCESS (3.2 s)
[INFO] Building: project-with-reactors-included\pom.xml
[INFO] run script verify.bsh
[INFO] ..SUCCESS (7.7 s)
[INFO] Building: reloc-abs-resource-path\pom.xml
[INFO] ..SUCCESS (10.0 s)
[INFO] Building: reloc-anno\pom.xml
[INFO] ..SUCCESS (4.8 s)
[INFO] Building: reloc-class-from-string-pool\pom.xml
[INFO] ..SUCCESS (4.3 s)
[INFO] Building: reloc-enum-ref-from-anno\pom.xml
[INFO] ..SUCCESS (4.6 s)
[INFO] Building: reloc-includes-excludes\pom.xml
[INFO] run script verify.bsh
[INFO] ..SUCCESS (5.2 s)
[INFO] Building: rerun-with-reloc\pom.xml
[INFO] ..SUCCESS (5.8 s)
[INFO] Building: rerun-without-reloc\pom.xml
[INFO] ..SUCCESS (4.1 s)
[INFO] Building: services-resource-transformer\pom.xml
[INFO] run script verify.bsh
[INFO] ..SUCCESS (5.0 s)
[INFO] Building: shadePomDependency\pom.xml
[INFO] ..SUCCESS (5.2 s)
[INFO] Building: users-shader-impl\pom.xml
[INFO] run script verify.groovy
[INFO] ..SUCCESS (5.4 s)
[INFO] Building: xml-transformer-ignores-dtd\pom.xml
[INFO] run script verify.bsh
[INFO] ..SUCCESS (5.0 s)
[INFO] 
[INFO] --- maven-invoker-plugin:1.8:verify (integration-test) @ maven-shade-plugin ---
[INFO] -------------------------------------------------
[INFO] Build Summary:
[INFO]   Passed: 45, Failed: 0, Errors: 0, Skipped: 0
[INFO] -------------------------------------------------
[INFO] 
[INFO] --- maven-install-plugin:2.3.1:install (default-install) @ maven-shade-plugin ---
[INFO] Installing F:\hudson\hudson-slave\workspace\maven-plugins-ITs-m3-windows\maven-shade-plugin\target\maven-shade-plugin-2.2-SNAPSHOT.jar
to C:\Users\hudson\.m2\repository\org\apache\maven\plugins\maven-shade-plugin\2.2-SNAPSHOT\maven-shade-plugin-2.2-SNAPSHOT.jar
[INFO] Installing F:\hudson\hudson-slave\workspace\maven-plugins-ITs-m3-windows\maven-shade-plugin\pom.xml
to C:\Users\hudson\.m2\repository\org\apache\maven\plugins\maven-shade-plugin\2.2-SNAPSHOT\maven-shade-plugin-2.2-SNAPSHOT.pom
[INFO] Installing F:\hudson\hudson-slave\workspace\maven-plugins-ITs-m3-windows\maven-shade-plugin\target\maven-shade-plugin-2.2-SNAPSHOT-tests.jar
to C:\Users\hudson\.m2\repository\org\apache\maven\plugins\maven-shade-plugin\2.2-SNAPSHOT\maven-shade-plugin-2.2-SNAPSHOT-tests.jar
[INFO]                                                                         
[INFO] ------------------------------------------------------------------------
[INFO] Building Maven Plugins Aggregator 1-SNAPSHOT
[INFO] ------------------------------------------------------------------------
[INFO] 
[INFO] --- maven-clean-plugin:2.4.1:clean (default-clean) @ maven-plugins-aggregator ---
[INFO] Deleting <https://builds.apache.org/job/maven-plugins-ITs-m3-windows/ws/target>
[INFO] 
[INFO] --- maven-remote-resources-plugin:1.1:process (default) @ maven-plugins-aggregator
---
[INFO] Setting property: classpath.resource.loader.class => 'org.codehaus.plexus.velocity.ContextClassLoaderResourceLoader'.
[INFO] Setting property: velocimacro.messages.on => 'false'.
[INFO] Setting property: resource.loader => 'classpath'.
[INFO] Setting property: resource.manager.logwhenfound => 'false'.
[INFO] 
[INFO] --- maven-install-plugin:2.3.1:install (default-install) @ maven-plugins-aggregator
---
[INFO] Installing <https://builds.apache.org/job/maven-plugins-ITs-m3-windows/ws/pom.xml>
to C:\Users\hudson\.m2\repository\org\apache\maven\plugins\maven-plugins-aggregator\1-SNAPSHOT\maven-plugins-aggregator-1-SNAPSHOT.pom
[INFO] ------------------------------------------------------------------------
[INFO] Reactor Summary:
[INFO] 
[INFO] Maven Plugins ..................................... SUCCESS [38.507s]
[INFO] Apache Maven ACR Plugin ........................... SUCCESS [3:08.014s]
[INFO] Apache Maven Ant Plugin ........................... SUCCESS [4:26.261s]
[INFO] Apache Maven AntRun Plugin ........................ SUCCESS [1:18.755s]
[INFO] Apache Maven Eclipse Plugin ....................... SUCCESS [10:31.005s]
[INFO] Apache Maven Assembly Plugin ...................... SUCCESS [14:07.814s]
[INFO] Apache Maven Changelog Plugin ..................... FAILURE [25.736s]
[INFO] Apache Maven Changes Plugin ....................... SUCCESS [1:40.431s]
[INFO] Apache Maven Checkstyle Plugin .................... SUCCESS [2:42.896s]
[INFO] Apache Maven Clean Plugin ......................... SUCCESS [25.197s]
[INFO] Apache Maven Compiler Plugin ...................... SUCCESS [1:55.850s]
[INFO] Apache Maven Dependency Plugin .................... SUCCESS [3:46.717s]
[INFO] Apache Maven Deploy Plugin ........................ SUCCESS [1:42.432s]
[INFO] Apache Maven DOAP Plugin .......................... SUCCESS [25.896s]
[INFO] Apache Maven Documentation Checker Plugin ......... SUCCESS [6.824s]
[INFO] Apache Maven EAR Plugin ........................... SUCCESS [5:16.823s]
[INFO] Apache Maven EJB Plugin ........................... SUCCESS [37.821s]
[INFO] Apache Maven GPG Plugin ........................... SUCCESS [1.917s]
[INFO] Apache Maven Help Plugin .......................... SUCCESS [1:06.738s]
[INFO] Apache Maven IDEA Plugin (RETIRED) ................ SUCCESS [9.544s]
[INFO] Apache Maven Install Plugin ....................... SUCCESS [1:13.906s]
[INFO] Apache Maven JAR Plugin ........................... SUCCESS [1:43.089s]
[INFO] Apache Maven Jarsigner Plugin ..................... SUCCESS [35.724s]
[INFO] Apache Maven Javadoc Plugin ....................... SUCCESS [4:12.385s]
[INFO] Apache Maven Linkcheck Plugin ..................... SUCCESS [3.276s]
[INFO] Apache Maven One Plugin (RETIRED) ................. SUCCESS [2.418s]
[INFO] Apache Maven Patch Plugin ......................... SUCCESS [6.670s]
[INFO] Apache Maven PDF Plugin ........................... SUCCESS [46.129s]
[INFO] Apache Maven PMD Plugin ........................... SUCCESS [2:25.855s]
[INFO] Apache Maven RAR Plugin ........................... SUCCESS [17.000s]
[INFO] Apache Maven Reactor Plugin ....................... SUCCESS [3.262s]
[INFO] Apache Maven Repository Plugin .................... SUCCESS [1:03.044s]
[INFO] Apache Maven Resources Plugin ..................... SUCCESS [1:11.040s]
[INFO] Apache Maven Site Plugin 3 ........................ SUCCESS [9:58.877s]
[INFO] Apache Maven Source Plugin ........................ SUCCESS [1:07.402s]
[INFO] Apache Maven Stage Plugin ......................... SUCCESS [2.755s]
[INFO] Apache Maven Toolchains Plugin .................... SUCCESS [2.599s]
[INFO] Apache Maven Verifier Plugin ...................... SUCCESS [31.319s]
[INFO] Apache Maven WAR Plugin ........................... SUCCESS [1:46.421s]
[INFO] Apache Maven SCM Publish Plugin ................... SUCCESS [1:24.511s]
[INFO] Apache Maven Invoker Plugin ....................... SUCCESS [6:42.108s]
[INFO] Apache Maven Project Info Reports Plugin .......... SUCCESS [2:52.074s]
[INFO] Apache Maven Remote Resources Plugin .............. SUCCESS [1:28.045s]
[INFO] Apache Maven Shade Plugin ......................... SUCCESS [5:09.784s]
[INFO] Maven Plugins Aggregator .......................... SUCCESS [0.678s]
[INFO] ------------------------------------------------------------------------
[INFO] BUILD FAILURE
[INFO] ------------------------------------------------------------------------
[INFO] Total time: 1:39:29.083s
[INFO] Finished at: Tue Jul 23 22:13:34 BST 2013
[INFO] Final Memory: 138M/382M
[INFO] ------------------------------------------------------------------------
[WARNING] The requested profile "apache.snapshots" could not be activated because it does
not exist.
[ERROR] Failed to execute goal org.apache.maven.plugins:maven-invoker-plugin:1.7:verify (integration-test)
on project maven-changelog-plugin: 5 builds failed. See console output above for details.
-> [Help 1]
[ERROR] 
[ERROR] To see the full stack trace of the errors, re-run Maven with the -e switch.
[ERROR] Re-run Maven using the -X switch to enable full debug logging.
[ERROR] 
[ERROR] For more information about the errors and possible solutions, please read the following
articles:
[ERROR] [Help 1] http://cwiki.apache.org/confluence/display/MAVEN/MojoFailureException
[ERROR] 
[ERROR] After correcting the problems, you can resume the build with the command
[ERROR]   mvn <goals> -rf :maven-changelog-plugin
Build step 'Invoke top-level Maven targets' marked build as failure
Recording test results

Mime
View raw message