maven-notifications mailing list archives

Site index · List index
Message view « Date » · « Thread »
Top « Date » · « Thread »
From Apache Jenkins Server <jenk...@builds.apache.org>
Subject Build failed in Jenkins: maven-plugins-windows #206
Date Fri, 26 Jul 2013 21:42:28 GMT
See <https://builds.apache.org/job/maven-plugins-windows/206/changes>

Changes:

[dennisl] Retire maven-idea-plugin.

[dennisl] Retire maven-idea-plugin.

[dennisl] [MONE-27] Upgrade to maven-model-converter 2.3

------------------------------------------
[...truncated 8423 lines...]
[INFO] Excluding org.codehaus.plexus:plexus-utils:jar:3.0.5 from the shaded jar.
[INFO] Replacing original artifact with shaded artifact.
[INFO] Replacing F:\hudson\hudson-slave\workspace\maven-plugins-windows\maven-javadoc-plugin\target\maven-javadoc-plugin-2.9.2-SNAPSHOT.jar
with F:\hudson\hudson-slave\workspace\maven-plugins-windows\maven-javadoc-plugin\target\maven-javadoc-plugin-2.9.2-SNAPSHOT-shaded.jar
Jul 26, 2013 10:42:05 PM org.apache.maven.cli.event.ExecutionEventLogger mojoStarted
INFO: 
Jul 26, 2013 10:42:05 PM org.apache.maven.cli.event.ExecutionEventLogger mojoStarted
INFO: --- maven-install-plugin:2.3.1:install (default-install) @ maven-javadoc-plugin ---
[INFO] Installing F:\hudson\hudson-slave\workspace\maven-plugins-windows\maven-javadoc-plugin\target\maven-javadoc-plugin-2.9.2-SNAPSHOT.jar
to f:\hudson\hudson-slave\maven-repositories\0\org\apache\maven\plugins\maven-javadoc-plugin\2.9.2-SNAPSHOT\maven-javadoc-plugin-2.9.2-SNAPSHOT.jar
[INFO] Installing F:\hudson\hudson-slave\workspace\maven-plugins-windows\maven-javadoc-plugin\pom.xml
to f:\hudson\hudson-slave\maven-repositories\0\org\apache\maven\plugins\maven-javadoc-plugin\2.9.2-SNAPSHOT\maven-javadoc-plugin-2.9.2-SNAPSHOT.pom
Jul 26, 2013 10:42:05 PM org.apache.maven.cli.event.ExecutionEventLogger logReactorSummary
INFO: ------------------------------------------------------------------------
Jul 26, 2013 10:42:05 PM org.apache.maven.cli.event.ExecutionEventLogger logReactorSummary
INFO: Reactor Summary:
Jul 26, 2013 10:42:05 PM org.apache.maven.cli.event.ExecutionEventLogger logReactorSummary
INFO: 
Jul 26, 2013 10:42:05 PM org.apache.maven.cli.event.ExecutionEventLogger logReactorSummary
INFO: Apache Maven Plugins .............................. SUCCESS [13.822s]
Jul 26, 2013 10:42:05 PM org.apache.maven.cli.event.ExecutionEventLogger logReactorSummary
INFO: Apache Maven ACR Plugin ........................... SUCCESS [17.608s]
Jul 26, 2013 10:42:05 PM org.apache.maven.cli.event.ExecutionEventLogger logReactorSummary
INFO: Apache Maven Ant Plugin ........................... SUCCESS [32.684s]
Jul 26, 2013 10:42:05 PM org.apache.maven.cli.event.ExecutionEventLogger logReactorSummary
INFO: Apache Maven AntRun Plugin ........................ SUCCESS [5.232s]
Jul 26, 2013 10:42:05 PM org.apache.maven.cli.event.ExecutionEventLogger logReactorSummary
INFO: Apache Maven Eclipse Plugin ....................... SUCCESS [1:36.602s]
Jul 26, 2013 10:42:05 PM org.apache.maven.cli.event.ExecutionEventLogger logReactorSummary
INFO: Apache Maven Assembly Plugin ...................... SUCCESS [1:12.291s]
Jul 26, 2013 10:42:05 PM org.apache.maven.cli.event.ExecutionEventLogger logReactorSummary
INFO: Apache Maven Changelog Plugin ..................... SUCCESS [20.617s]
Jul 26, 2013 10:42:05 PM org.apache.maven.cli.event.ExecutionEventLogger logReactorSummary
INFO: Apache Maven Changes Plugin ....................... SUCCESS [1:08.018s]
Jul 26, 2013 10:42:05 PM org.apache.maven.cli.event.ExecutionEventLogger logReactorSummary
INFO: Apache Maven Checkstyle Plugin .................... SUCCESS [43.858s]
Jul 26, 2013 10:42:05 PM org.apache.maven.cli.event.ExecutionEventLogger logReactorSummary
INFO: Apache Maven Clean Plugin ......................... SUCCESS [6.172s]
Jul 26, 2013 10:42:05 PM org.apache.maven.cli.event.ExecutionEventLogger logReactorSummary
INFO: Apache Maven Compiler Plugin ...................... SUCCESS [15.717s]
Jul 26, 2013 10:42:05 PM org.apache.maven.cli.event.ExecutionEventLogger logReactorSummary
INFO: Apache Maven Dependency Plugin .................... SUCCESS [2:05.248s]
Jul 26, 2013 10:42:05 PM org.apache.maven.cli.event.ExecutionEventLogger logReactorSummary
INFO: Apache Maven Deploy Plugin ........................ SUCCESS [56.734s]
Jul 26, 2013 10:42:05 PM org.apache.maven.cli.event.ExecutionEventLogger logReactorSummary
INFO: Apache Maven DOAP Plugin .......................... SUCCESS [1:00.247s]
Jul 26, 2013 10:42:05 PM org.apache.maven.cli.event.ExecutionEventLogger logReactorSummary
INFO: Apache Maven Documentation Checker Plugin ......... SUCCESS [3.270s]
Jul 26, 2013 10:42:05 PM org.apache.maven.cli.event.ExecutionEventLogger logReactorSummary
INFO: Apache Maven EAR Plugin ........................... SUCCESS [14.833s]
Jul 26, 2013 10:42:05 PM org.apache.maven.cli.event.ExecutionEventLogger logReactorSummary
INFO: Apache Maven EJB Plugin ........................... SUCCESS [7.213s]
Jul 26, 2013 10:42:05 PM org.apache.maven.cli.event.ExecutionEventLogger logReactorSummary
INFO: Apache Maven GPG Plugin ........................... SUCCESS [1.379s]
Jul 26, 2013 10:42:05 PM org.apache.maven.cli.event.ExecutionEventLogger logReactorSummary
INFO: Apache Maven Help Plugin .......................... SUCCESS [7.977s]
Jul 26, 2013 10:42:05 PM org.apache.maven.cli.event.ExecutionEventLogger logReactorSummary
INFO: Apache Maven Install Plugin ....................... SUCCESS [8.262s]
Jul 26, 2013 10:42:05 PM org.apache.maven.cli.event.ExecutionEventLogger logReactorSummary
INFO: Apache Maven JAR Plugin ........................... SUCCESS [5.114s]
Jul 26, 2013 10:42:05 PM org.apache.maven.cli.event.ExecutionEventLogger logReactorSummary
INFO: Apache Maven Jarsigner Plugin ..................... SUCCESS [1.888s]
Jul 26, 2013 10:42:05 PM org.apache.maven.cli.event.ExecutionEventLogger logReactorSummary
INFO: Apache Maven Javadoc Plugin ....................... SUCCESS [5:37.869s]
Jul 26, 2013 10:42:05 PM org.apache.maven.cli.event.ExecutionEventLogger logReactorSummary
INFO: Apache Maven Linkcheck Plugin ..................... SUCCESS [11.150s]
Jul 26, 2013 10:42:05 PM org.apache.maven.cli.event.ExecutionEventLogger logReactorSummary
INFO: Apache Maven One Plugin (RETIRED) ................. FAILURE [0.527s]
Jul 26, 2013 10:42:05 PM org.apache.maven.cli.event.ExecutionEventLogger logReactorSummary
INFO: Apache Maven Patch Plugin ......................... SUCCESS [0.601s]
Jul 26, 2013 10:42:05 PM org.apache.maven.cli.event.ExecutionEventLogger logReactorSummary
INFO: Apache Maven PDF Plugin ........................... SUCCESS [41.697s]
Jul 26, 2013 10:42:05 PM org.apache.maven.cli.event.ExecutionEventLogger logReactorSummary
INFO: Apache Maven PMD Plugin ........................... SUCCESS [1:00.510s]
Jul 26, 2013 10:42:05 PM org.apache.maven.cli.event.ExecutionEventLogger logReactorSummary
INFO: Apache Maven RAR Plugin ........................... SUCCESS [4.999s]
Jul 26, 2013 10:42:05 PM org.apache.maven.cli.event.ExecutionEventLogger logReactorSummary
INFO: Apache Maven Reactor Plugin ....................... SUCCESS [25.270s]
Jul 26, 2013 10:42:05 PM org.apache.maven.cli.event.ExecutionEventLogger logReactorSummary
INFO: Apache Maven Repository Plugin .................... SUCCESS [27.281s]
Jul 26, 2013 10:42:05 PM org.apache.maven.cli.event.ExecutionEventLogger logReactorSummary
INFO: Apache Maven Resources Plugin ..................... SUCCESS [26.180s]
Jul 26, 2013 10:42:05 PM org.apache.maven.cli.event.ExecutionEventLogger logReactorSummary
INFO: Apache Maven Site Plugin 3 ........................ SUCCESS [49.009s]
Jul 26, 2013 10:42:05 PM org.apache.maven.cli.event.ExecutionEventLogger logReactorSummary
INFO: Apache Maven Source Plugin ........................ SUCCESS [24.219s]
Jul 26, 2013 10:42:05 PM org.apache.maven.cli.event.ExecutionEventLogger logReactorSummary
INFO: Apache Maven Stage Plugin ......................... SUCCESS [2.397s]
Jul 26, 2013 10:42:05 PM org.apache.maven.cli.event.ExecutionEventLogger logReactorSummary
INFO: Apache Maven Toolchains Plugin .................... SUCCESS [18.279s]
Jul 26, 2013 10:42:05 PM org.apache.maven.cli.event.ExecutionEventLogger logReactorSummary
INFO: Apache Maven Verifier Plugin ...................... SUCCESS [1.889s]
Jul 26, 2013 10:42:05 PM org.apache.maven.cli.event.ExecutionEventLogger logReactorSummary
INFO: Apache Maven WAR Plugin ........................... SUCCESS [1:27.940s]
Jul 26, 2013 10:42:05 PM org.apache.maven.cli.event.ExecutionEventLogger logReactorSummary
INFO: Apache Maven SCM Publish Plugin ................... SUCCESS [25.530s]
Jul 26, 2013 10:42:05 PM org.apache.maven.cli.event.ExecutionEventLogger logReactorSummary
INFO: Apache Maven Invoker Plugin ....................... SUCCESS [58.629s]
Jul 26, 2013 10:42:05 PM org.apache.maven.cli.event.ExecutionEventLogger logReactorSummary
INFO: Apache Maven Project Info Reports Plugin .......... SUCCESS [1:11.412s]
Jul 26, 2013 10:42:05 PM org.apache.maven.cli.event.ExecutionEventLogger logReactorSummary
INFO: Apache Maven Remote Resources Plugin .............. SUCCESS [10.948s]
Jul 26, 2013 10:42:05 PM org.apache.maven.cli.event.ExecutionEventLogger logReactorSummary
INFO: Apache Maven Shade Plugin ......................... SUCCESS [55.274s]
Jul 26, 2013 10:42:05 PM org.apache.maven.cli.event.ExecutionEventLogger logReactorSummary
INFO: Maven Plugins Aggregator .......................... SUCCESS [2.187s]
Jul 26, 2013 10:42:05 PM org.apache.maven.cli.event.ExecutionEventLogger logResult
INFO: ------------------------------------------------------------------------
Jul 26, 2013 10:42:05 PM org.apache.maven.cli.event.ExecutionEventLogger logResult
INFO: BUILD FAILURE
Jul 26, 2013 10:42:05 PM org.apache.maven.cli.event.ExecutionEventLogger logStats
INFO: ------------------------------------------------------------------------
Jul 26, 2013 10:42:05 PM org.apache.maven.cli.event.ExecutionEventLogger logStats
INFO: Total time: 9:28.530s (Wall Clock)
Jul 26, 2013 10:42:05 PM org.apache.maven.cli.event.ExecutionEventLogger logStats
INFO: Finished at: Fri Jul 26 22:42:05 BST 2013
Jul 26, 2013 10:42:05 PM org.apache.maven.cli.event.ExecutionEventLogger logStats
INFO: Final Memory: 76M/279M
Jul 26, 2013 10:42:05 PM org.apache.maven.cli.event.ExecutionEventLogger sessionEnded
INFO: ------------------------------------------------------------------------
[JENKINS] Archiving F:\hudson\hudson-slave\workspace\maven-plugins-windows\maven-javadoc-plugin\pom.xml
to /home/hudson/hudson/jobs/maven-plugins-windows/modules/org.apache.maven.plugins$maven-javadoc-plugin/builds/2013-07-26_21-32-32/archive/org.apache.maven.plugins/maven-javadoc-plugin/2.9.2-SNAPSHOT/maven-javadoc-plugin-2.9.2-SNAPSHOT.pom
[JENKINS] Archiving F:\hudson\hudson-slave\workspace\maven-plugins-windows\maven-javadoc-plugin\target\maven-javadoc-plugin-2.9.2-SNAPSHOT.jar
to /home/hudson/hudson/jobs/maven-plugins-windows/modules/org.apache.maven.plugins$maven-javadoc-plugin/builds/2013-07-26_21-32-32/archive/org.apache.maven.plugins/maven-javadoc-plugin/2.9.2-SNAPSHOT/maven-javadoc-plugin-2.9.2-SNAPSHOT.jar
[JENKINS] Archiving F:\hudson\hudson-slave\workspace\maven-plugins-windows\maven-linkcheck-plugin\pom.xml
to /home/hudson/hudson/jobs/maven-plugins-windows/modules/org.apache.maven.plugins$maven-linkcheck-plugin/builds/2013-07-26_21-32-32/archive/org.apache.maven.plugins/maven-linkcheck-plugin/1.2-SNAPSHOT/maven-linkcheck-plugin-1.2-SNAPSHOT.pom
[JENKINS] Archiving F:\hudson\hudson-slave\workspace\maven-plugins-windows\maven-linkcheck-plugin\target\maven-linkcheck-plugin-1.2-SNAPSHOT.jar
to /home/hudson/hudson/jobs/maven-plugins-windows/modules/org.apache.maven.plugins$maven-linkcheck-plugin/builds/2013-07-26_21-32-32/archive/org.apache.maven.plugins/maven-linkcheck-plugin/1.2-SNAPSHOT/maven-linkcheck-plugin-1.2-SNAPSHOT.jar
[JENKINS] Archiving F:\hudson\hudson-slave\workspace\maven-plugins-windows\maven-resources-plugin\pom.xml
to /home/hudson/hudson/jobs/maven-plugins-windows/modules/org.apache.maven.plugins$maven-resources-plugin/builds/2013-07-26_21-32-32/archive/org.apache.maven.plugins/maven-resources-plugin/2.7-SNAPSHOT/maven-resources-plugin-2.7-SNAPSHOT.pom
[JENKINS] Archiving F:\hudson\hudson-slave\workspace\maven-plugins-windows\maven-resources-plugin\target\maven-resources-plugin-2.7-SNAPSHOT.jar
to /home/hudson/hudson/jobs/maven-plugins-windows/modules/org.apache.maven.plugins$maven-resources-plugin/builds/2013-07-26_21-32-32/archive/org.apache.maven.plugins/maven-resources-plugin/2.7-SNAPSHOT/maven-resources-plugin-2.7-SNAPSHOT.jar
[JENKINS] Archiving F:\hudson\hudson-slave\workspace\maven-plugins-windows\maven-remote-resources-plugin\pom.xml
to /home/hudson/hudson/jobs/maven-plugins-windows/modules/org.apache.maven.plugins$maven-remote-resources-plugin/builds/2013-07-26_21-32-32/archive/org.apache.maven.plugins/maven-remote-resources-plugin/1.5-SNAPSHOT/maven-remote-resources-plugin-1.5-SNAPSHOT.pom
[JENKINS] Archiving F:\hudson\hudson-slave\workspace\maven-plugins-windows\maven-remote-resources-plugin\target\maven-remote-resources-plugin-1.5-SNAPSHOT.jar
to /home/hudson/hudson/jobs/maven-plugins-windows/modules/org.apache.maven.plugins$maven-remote-resources-plugin/builds/2013-07-26_21-32-32/archive/org.apache.maven.plugins/maven-remote-resources-plugin/1.5-SNAPSHOT/maven-remote-resources-plugin-1.5-SNAPSHOT.jar
[JENKINS] Archiving F:\hudson\hudson-slave\workspace\maven-plugins-windows\maven-patch-plugin\pom.xml
to /home/hudson/hudson/jobs/maven-plugins-windows/modules/org.apache.maven.plugins$maven-patch-plugin/builds/2013-07-26_21-32-32/archive/org.apache.maven.plugins/maven-patch-plugin/1.2-SNAPSHOT/maven-patch-plugin-1.2-SNAPSHOT.pom
[JENKINS] Archiving F:\hudson\hudson-slave\workspace\maven-plugins-windows\maven-patch-plugin\target\maven-patch-plugin-1.2-SNAPSHOT.jar
to /home/hudson/hudson/jobs/maven-plugins-windows/modules/org.apache.maven.plugins$maven-patch-plugin/builds/2013-07-26_21-32-32/archive/org.apache.maven.plugins/maven-patch-plugin/1.2-SNAPSHOT/maven-patch-plugin-1.2-SNAPSHOT.jar
[JENKINS] Archiving F:\hudson\hudson-slave\workspace\maven-plugins-windows\maven-doap-plugin\pom.xml
to /home/hudson/hudson/jobs/maven-plugins-windows/modules/org.apache.maven.plugins$maven-doap-plugin/builds/2013-07-26_21-32-32/archive/org.apache.maven.plugins/maven-doap-plugin/1.2-SNAPSHOT/maven-doap-plugin-1.2-SNAPSHOT.pom
[JENKINS] Archiving F:\hudson\hudson-slave\workspace\maven-plugins-windows\maven-doap-plugin\target\maven-doap-plugin-1.2-SNAPSHOT.jar
to /home/hudson/hudson/jobs/maven-plugins-windows/modules/org.apache.maven.plugins$maven-doap-plugin/builds/2013-07-26_21-32-32/archive/org.apache.maven.plugins/maven-doap-plugin/1.2-SNAPSHOT/maven-doap-plugin-1.2-SNAPSHOT.jar
[JENKINS] Archiving F:\hudson\hudson-slave\workspace\maven-plugins-windows\maven-verifier-plugin\pom.xml
to /home/hudson/hudson/jobs/maven-plugins-windows/modules/org.apache.maven.plugins$maven-verifier-plugin/builds/2013-07-26_21-32-32/archive/org.apache.maven.plugins/maven-verifier-plugin/1.1-SNAPSHOT/maven-verifier-plugin-1.1-SNAPSHOT.pom
[JENKINS] Archiving F:\hudson\hudson-slave\workspace\maven-plugins-windows\maven-verifier-plugin\target\maven-verifier-plugin-1.1-SNAPSHOT.jar
to /home/hudson/hudson/jobs/maven-plugins-windows/modules/org.apache.maven.plugins$maven-verifier-plugin/builds/2013-07-26_21-32-32/archive/org.apache.maven.plugins/maven-verifier-plugin/1.1-SNAPSHOT/maven-verifier-plugin-1.1-SNAPSHOT.jar
[JENKINS] Archiving F:\hudson\hudson-slave\workspace\maven-plugins-windows\maven-one-plugin\pom.xml
to /home/hudson/hudson/jobs/maven-plugins-windows/modules/org.apache.maven.plugins$maven-one-plugin/builds/2013-07-26_21-32-32/archive/org.apache.maven.plugins/maven-one-plugin/1.3-SNAPSHOT/maven-one-plugin-1.3-SNAPSHOT.pom
[JENKINS] Archiving F:\hudson\hudson-slave\workspace\maven-plugins-windows\maven-repository-plugin\pom.xml
to /home/hudson/hudson/jobs/maven-plugins-windows/modules/org.apache.maven.plugins$maven-repository-plugin/builds/2013-07-26_21-32-32/archive/org.apache.maven.plugins/maven-repository-plugin/2.3.2-SNAPSHOT/maven-repository-plugin-2.3.2-SNAPSHOT.pom
[JENKINS] Archiving F:\hudson\hudson-slave\workspace\maven-plugins-windows\maven-repository-plugin\target\maven-repository-plugin-2.3.2-SNAPSHOT.jar
to /home/hudson/hudson/jobs/maven-plugins-windows/modules/org.apache.maven.plugins$maven-repository-plugin/builds/2013-07-26_21-32-32/archive/org.apache.maven.plugins/maven-repository-plugin/2.3.2-SNAPSHOT/maven-repository-plugin-2.3.2-SNAPSHOT.jar
[JENKINS] Archiving F:\hudson\hudson-slave\workspace\maven-plugins-windows\maven-reactor-plugin\pom.xml
to /home/hudson/hudson/jobs/maven-plugins-windows/modules/org.apache.maven.plugins$maven-reactor-plugin/builds/2013-07-26_21-32-32/archive/org.apache.maven.plugins/maven-reactor-plugin/1.1-SNAPSHOT/maven-reactor-plugin-1.1-SNAPSHOT.pom
[JENKINS] Archiving F:\hudson\hudson-slave\workspace\maven-plugins-windows\maven-reactor-plugin\target\maven-reactor-plugin-1.1-SNAPSHOT.jar
to /home/hudson/hudson/jobs/maven-plugins-windows/modules/org.apache.maven.plugins$maven-reactor-plugin/builds/2013-07-26_21-32-32/archive/org.apache.maven.plugins/maven-reactor-plugin/1.1-SNAPSHOT/maven-reactor-plugin-1.1-SNAPSHOT.jar
[JENKINS] Archiving F:\hudson\hudson-slave\workspace\maven-plugins-windows\maven-antrun-plugin\pom.xml
to /home/hudson/hudson/jobs/maven-plugins-windows/modules/org.apache.maven.plugins$maven-antrun-plugin/builds/2013-07-26_21-32-32/archive/org.apache.maven.plugins/maven-antrun-plugin/1.8-SNAPSHOT/maven-antrun-plugin-1.8-SNAPSHOT.pom
[JENKINS] Archiving F:\hudson\hudson-slave\workspace\maven-plugins-windows\maven-antrun-plugin\target\maven-antrun-plugin-1.8-SNAPSHOT.jar
to /home/hudson/hudson/jobs/maven-plugins-windows/modules/org.apache.maven.plugins$maven-antrun-plugin/builds/2013-07-26_21-32-32/archive/org.apache.maven.plugins/maven-antrun-plugin/1.8-SNAPSHOT/maven-antrun-plugin-1.8-SNAPSHOT.jar
[JENKINS] Archiving F:\hudson\hudson-slave\workspace\maven-plugins-windows\maven-ear-plugin\pom.xml
to /home/hudson/hudson/jobs/maven-plugins-windows/modules/org.apache.maven.plugins$maven-ear-plugin/builds/2013-07-26_21-32-32/archive/org.apache.maven.plugins/maven-ear-plugin/2.9-SNAPSHOT/maven-ear-plugin-2.9-SNAPSHOT.pom
[JENKINS] Archiving F:\hudson\hudson-slave\workspace\maven-plugins-windows\maven-ear-plugin\target\maven-ear-plugin-2.9-SNAPSHOT.jar
to /home/hudson/hudson/jobs/maven-plugins-windows/modules/org.apache.maven.plugins$maven-ear-plugin/builds/2013-07-26_21-32-32/archive/org.apache.maven.plugins/maven-ear-plugin/2.9-SNAPSHOT/maven-ear-plugin-2.9-SNAPSHOT.jar
[JENKINS] Archiving F:\hudson\hudson-slave\workspace\maven-plugins-windows\maven-assembly-plugin\pom.xml
to /home/hudson/hudson/jobs/maven-plugins-windows/modules/org.apache.maven.plugins$maven-assembly-plugin/builds/2013-07-26_21-32-32/archive/org.apache.maven.plugins/maven-assembly-plugin/2.5-SNAPSHOT/maven-assembly-plugin-2.5-SNAPSHOT.pom
[JENKINS] Archiving F:\hudson\hudson-slave\workspace\maven-plugins-windows\maven-assembly-plugin\target\maven-assembly-plugin-2.5-SNAPSHOT.jar
to /home/hudson/hudson/jobs/maven-plugins-windows/modules/org.apache.maven.plugins$maven-assembly-plugin/builds/2013-07-26_21-32-32/archive/org.apache.maven.plugins/maven-assembly-plugin/2.5-SNAPSHOT/maven-assembly-plugin-2.5-SNAPSHOT.jar
[JENKINS] Archiving F:\hudson\hudson-slave\workspace\maven-plugins-windows\maven-scm-publish-plugin\pom.xml
to /home/hudson/hudson/jobs/maven-plugins-windows/modules/org.apache.maven.plugins$maven-scm-publish-plugin/builds/2013-07-26_21-32-32/archive/org.apache.maven.plugins/maven-scm-publish-plugin/1.0-SNAPSHOT/maven-scm-publish-plugin-1.0-SNAPSHOT.pom
[JENKINS] Archiving F:\hudson\hudson-slave\workspace\maven-plugins-windows\maven-scm-publish-plugin\target\maven-scm-publish-plugin-1.0-SNAPSHOT.jar
to /home/hudson/hudson/jobs/maven-plugins-windows/modules/org.apache.maven.plugins$maven-scm-publish-plugin/builds/2013-07-26_21-32-32/archive/org.apache.maven.plugins/maven-scm-publish-plugin/1.0-SNAPSHOT/maven-scm-publish-plugin-1.0-SNAPSHOT.jar
[JENKINS] Archiving F:\hudson\hudson-slave\workspace\maven-plugins-windows\maven-war-plugin\pom.xml
to /home/hudson/hudson/jobs/maven-plugins-windows/modules/org.apache.maven.plugins$maven-war-plugin/builds/2013-07-26_21-32-32/archive/org.apache.maven.plugins/maven-war-plugin/2.5-SNAPSHOT/maven-war-plugin-2.5-SNAPSHOT.pom
[JENKINS] Archiving F:\hudson\hudson-slave\workspace\maven-plugins-windows\maven-war-plugin\target\maven-war-plugin-2.5-SNAPSHOT.jar
to /home/hudson/hudson/jobs/maven-plugins-windows/modules/org.apache.maven.plugins$maven-war-plugin/builds/2013-07-26_21-32-32/archive/org.apache.maven.plugins/maven-war-plugin/2.5-SNAPSHOT/maven-war-plugin-2.5-SNAPSHOT.jar
[JENKINS] Archiving F:\hudson\hudson-slave\workspace\maven-plugins-windows\maven-eclipse-plugin\pom.xml
to /home/hudson/hudson/jobs/maven-plugins-windows/modules/org.apache.maven.plugins$maven-eclipse-plugin/builds/2013-07-26_21-32-32/archive/org.apache.maven.plugins/maven-eclipse-plugin/2.10-SNAPSHOT/maven-eclipse-plugin-2.10-SNAPSHOT.pom
[JENKINS] Archiving F:\hudson\hudson-slave\workspace\maven-plugins-windows\maven-eclipse-plugin\target\maven-eclipse-plugin-2.10-SNAPSHOT.jar
to /home/hudson/hudson/jobs/maven-plugins-windows/modules/org.apache.maven.plugins$maven-eclipse-plugin/builds/2013-07-26_21-32-32/archive/org.apache.maven.plugins/maven-eclipse-plugin/2.10-SNAPSHOT/maven-eclipse-plugin-2.10-SNAPSHOT.jar
[JENKINS] Archiving F:\hudson\hudson-slave\workspace\maven-plugins-windows\maven-docck-plugin\pom.xml
to /home/hudson/hudson/jobs/maven-plugins-windows/modules/org.apache.maven.plugins$maven-docck-plugin/builds/2013-07-26_21-32-32/archive/org.apache.maven.plugins/maven-docck-plugin/1.1-SNAPSHOT/maven-docck-plugin-1.1-SNAPSHOT.pom
[JENKINS] Archiving F:\hudson\hudson-slave\workspace\maven-plugins-windows\maven-docck-plugin\target\maven-docck-plugin-1.1-SNAPSHOT.jar
to /home/hudson/hudson/jobs/maven-plugins-windows/modules/org.apache.maven.plugins$maven-docck-plugin/builds/2013-07-26_21-32-32/archive/org.apache.maven.plugins/maven-docck-plugin/1.1-SNAPSHOT/maven-docck-plugin-1.1-SNAPSHOT.jar
[JENKINS] Archiving F:\hudson\hudson-slave\workspace\maven-plugins-windows\maven-acr-plugin\pom.xml
to /home/hudson/hudson/jobs/maven-plugins-windows/modules/org.apache.maven.plugins$maven-acr-plugin/builds/2013-07-26_21-32-32/archive/org.apache.maven.plugins/maven-acr-plugin/1.0.1-SNAPSHOT/maven-acr-plugin-1.0.1-SNAPSHOT.pom
[JENKINS] Archiving F:\hudson\hudson-slave\workspace\maven-plugins-windows\maven-acr-plugin\target\maven-acr-plugin-1.0.1-SNAPSHOT.jar
to /home/hudson/hudson/jobs/maven-plugins-windows/modules/org.apache.maven.plugins$maven-acr-plugin/builds/2013-07-26_21-32-32/archive/org.apache.maven.plugins/maven-acr-plugin/1.0.1-SNAPSHOT/maven-acr-plugin-1.0.1-SNAPSHOT.jar
[JENKINS] Archiving F:\hudson\hudson-slave\workspace\maven-plugins-windows\maven-ejb-plugin\pom.xml
to /home/hudson/hudson/jobs/maven-plugins-windows/modules/org.apache.maven.plugins$maven-ejb-plugin/builds/2013-07-26_21-32-32/archive/org.apache.maven.plugins/maven-ejb-plugin/2.4-SNAPSHOT/maven-ejb-plugin-2.4-SNAPSHOT.pom
[JENKINS] Archiving F:\hudson\hudson-slave\workspace\maven-plugins-windows\maven-ejb-plugin\target\maven-ejb-plugin-2.4-SNAPSHOT.jar
to /home/hudson/hudson/jobs/maven-plugins-windows/modules/org.apache.maven.plugins$maven-ejb-plugin/builds/2013-07-26_21-32-32/archive/org.apache.maven.plugins/maven-ejb-plugin/2.4-SNAPSHOT/maven-ejb-plugin-2.4-SNAPSHOT.jar
[JENKINS] Archiving F:\hudson\hudson-slave\workspace\maven-plugins-windows\maven-gpg-plugin\pom.xml
to /home/hudson/hudson/jobs/maven-plugins-windows/modules/org.apache.maven.plugins$maven-gpg-plugin/builds/2013-07-26_21-32-32/archive/org.apache.maven.plugins/maven-gpg-plugin/1.5-SNAPSHOT/maven-gpg-plugin-1.5-SNAPSHOT.pom
[JENKINS] Archiving F:\hudson\hudson-slave\workspace\maven-plugins-windows\maven-gpg-plugin\target\maven-gpg-plugin-1.5-SNAPSHOT.jar
to /home/hudson/hudson/jobs/maven-plugins-windows/modules/org.apache.maven.plugins$maven-gpg-plugin/builds/2013-07-26_21-32-32/archive/org.apache.maven.plugins/maven-gpg-plugin/1.5-SNAPSHOT/maven-gpg-plugin-1.5-SNAPSHOT.jar
[JENKINS] Archiving F:\hudson\hudson-slave\workspace\maven-plugins-windows\maven-pdf-plugin\pom.xml
to /home/hudson/hudson/jobs/maven-plugins-windows/modules/org.apache.maven.plugins$maven-pdf-plugin/builds/2013-07-26_21-32-32/archive/org.apache.maven.plugins/maven-pdf-plugin/1.3-SNAPSHOT/maven-pdf-plugin-1.3-SNAPSHOT.pom
[JENKINS] Archiving F:\hudson\hudson-slave\workspace\maven-plugins-windows\maven-pdf-plugin\target\maven-pdf-plugin-1.3-SNAPSHOT.jar
to /home/hudson/hudson/jobs/maven-plugins-windows/modules/org.apache.maven.plugins$maven-pdf-plugin/builds/2013-07-26_21-32-32/archive/org.apache.maven.plugins/maven-pdf-plugin/1.3-SNAPSHOT/maven-pdf-plugin-1.3-SNAPSHOT.jar
[JENKINS] Archiving F:\hudson\hudson-slave\workspace\maven-plugins-windows\maven-jarsigner-plugin\pom.xml
to /home/hudson/hudson/jobs/maven-plugins-windows/modules/org.apache.maven.plugins$maven-jarsigner-plugin/builds/2013-07-26_21-32-32/archive/org.apache.maven.plugins/maven-jarsigner-plugin/1.3-SNAPSHOT/maven-jarsigner-plugin-1.3-SNAPSHOT.pom
[JENKINS] Archiving F:\hudson\hudson-slave\workspace\maven-plugins-windows\maven-jarsigner-plugin\target\maven-jarsigner-plugin-1.3-SNAPSHOT.jar
to /home/hudson/hudson/jobs/maven-plugins-windows/modules/org.apache.maven.plugins$maven-jarsigner-plugin/builds/2013-07-26_21-32-32/archive/org.apache.maven.plugins/maven-jarsigner-plugin/1.3-SNAPSHOT/maven-jarsigner-plugin-1.3-SNAPSHOT.jar
[JENKINS] Archiving F:\hudson\hudson-slave\workspace\maven-plugins-windows\maven-deploy-plugin\pom.xml
to /home/hudson/hudson/jobs/maven-plugins-windows/modules/org.apache.maven.plugins$maven-deploy-plugin/builds/2013-07-26_21-32-32/archive/org.apache.maven.plugins/maven-deploy-plugin/2.8-SNAPSHOT/maven-deploy-plugin-2.8-SNAPSHOT.pom
[JENKINS] Archiving F:\hudson\hudson-slave\workspace\maven-plugins-windows\maven-deploy-plugin\target\maven-deploy-plugin-2.8-SNAPSHOT.jar
to /home/hudson/hudson/jobs/maven-plugins-windows/modules/org.apache.maven.plugins$maven-deploy-plugin/builds/2013-07-26_21-32-32/archive/org.apache.maven.plugins/maven-deploy-plugin/2.8-SNAPSHOT/maven-deploy-plugin-2.8-SNAPSHOT.jar
[JENKINS] Archiving F:\hudson\hudson-slave\workspace\maven-plugins-windows\maven-project-info-reports-plugin\pom.xml
to /home/hudson/hudson/jobs/maven-plugins-windows/modules/org.apache.maven.plugins$maven-project-info-reports-plugin/builds/2013-07-26_21-32-32/archive/org.apache.maven.plugins/maven-project-info-reports-plugin/2.8-SNAPSHOT/maven-project-info-reports-plugin-2.8-SNAPSHOT.pom
[JENKINS] Archiving F:\hudson\hudson-slave\workspace\maven-plugins-windows\maven-project-info-reports-plugin\target\maven-project-info-reports-plugin-2.8-SNAPSHOT.jar
to /home/hudson/hudson/jobs/maven-plugins-windows/modules/org.apache.maven.plugins$maven-project-info-reports-plugin/builds/2013-07-26_21-32-32/archive/org.apache.maven.plugins/maven-project-info-reports-plugin/2.8-SNAPSHOT/maven-project-info-reports-plugin-2.8-SNAPSHOT.jar
[JENKINS] Archiving F:\hudson\hudson-slave\workspace\maven-plugins-windows\maven-invoker-plugin\pom.xml
to /home/hudson/hudson/jobs/maven-plugins-windows/modules/org.apache.maven.plugins$maven-invoker-plugin/builds/2013-07-26_21-32-32/archive/org.apache.maven.plugins/maven-invoker-plugin/1.9-SNAPSHOT/maven-invoker-plugin-1.9-SNAPSHOT.pom
[JENKINS] Archiving F:\hudson\hudson-slave\workspace\maven-plugins-windows\maven-invoker-plugin\target\maven-invoker-plugin-1.9-SNAPSHOT.jar
to /home/hudson/hudson/jobs/maven-plugins-windows/modules/org.apache.maven.plugins$maven-invoker-plugin/builds/2013-07-26_21-32-32/archive/org.apache.maven.plugins/maven-invoker-plugin/1.9-SNAPSHOT/maven-invoker-plugin-1.9-SNAPSHOT.jar
[JENKINS] Archiving F:\hudson\hudson-slave\workspace\maven-plugins-windows\maven-site-plugin\dependency-reduced-pom.xml
to /home/hudson/hudson/jobs/maven-plugins-windows/modules/org.apache.maven.plugins$maven-site-plugin/builds/2013-07-26_21-32-32/archive/org.apache.maven.plugins/maven-site-plugin/3.4-SNAPSHOT/maven-site-plugin-3.4-SNAPSHOT.pom
[JENKINS] Archiving F:\hudson\hudson-slave\workspace\maven-plugins-windows\maven-site-plugin\target\maven-site-plugin-3.4-SNAPSHOT.jar
to /home/hudson/hudson/jobs/maven-plugins-windows/modules/org.apache.maven.plugins$maven-site-plugin/builds/2013-07-26_21-32-32/archive/org.apache.maven.plugins/maven-site-plugin/3.4-SNAPSHOT/maven-site-plugin-3.4-SNAPSHOT.jar
[JENKINS] Archiving F:\hudson\hudson-slave\workspace\maven-plugins-windows\maven-stage-plugin\pom.xml
to /home/hudson/hudson/jobs/maven-plugins-windows/modules/org.apache.maven.plugins$maven-stage-plugin/builds/2013-07-26_21-32-32/archive/org.apache.maven.plugins/maven-stage-plugin/1.0-SNAPSHOT/maven-stage-plugin-1.0-SNAPSHOT.pom
[JENKINS] Archiving F:\hudson\hudson-slave\workspace\maven-plugins-windows\maven-stage-plugin\target\maven-stage-plugin-1.0-SNAPSHOT.jar
to /home/hudson/hudson/jobs/maven-plugins-windows/modules/org.apache.maven.plugins$maven-stage-plugin/builds/2013-07-26_21-32-32/archive/org.apache.maven.plugins/maven-stage-plugin/1.0-SNAPSHOT/maven-stage-plugin-1.0-SNAPSHOT.jar
[JENKINS] Archiving F:\hudson\hudson-slave\workspace\maven-plugins-windows\maven-toolchains-plugin\pom.xml
to /home/hudson/hudson/jobs/maven-plugins-windows/modules/org.apache.maven.plugins$maven-toolchains-plugin/builds/2013-07-26_21-32-32/archive/org.apache.maven.plugins/maven-toolchains-plugin/1.1-SNAPSHOT/maven-toolchains-plugin-1.1-SNAPSHOT.pom
[JENKINS] Archiving F:\hudson\hudson-slave\workspace\maven-plugins-windows\maven-toolchains-plugin\target\maven-toolchains-plugin-1.1-SNAPSHOT.jar
to /home/hudson/hudson/jobs/maven-plugins-windows/modules/org.apache.maven.plugins$maven-toolchains-plugin/builds/2013-07-26_21-32-32/archive/org.apache.maven.plugins/maven-toolchains-plugin/1.1-SNAPSHOT/maven-toolchains-plugin-1.1-SNAPSHOT.jar
[JENKINS] Archiving F:\hudson\hudson-slave\workspace\maven-plugins-windows\maven-checkstyle-plugin\pom.xml
to /home/hudson/hudson/jobs/maven-plugins-windows/modules/org.apache.maven.plugins$maven-checkstyle-plugin/builds/2013-07-26_21-32-32/archive/org.apache.maven.plugins/maven-checkstyle-plugin/2.11-SNAPSHOT/maven-checkstyle-plugin-2.11-SNAPSHOT.pom
[JENKINS] Archiving F:\hudson\hudson-slave\workspace\maven-plugins-windows\maven-checkstyle-plugin\target\maven-checkstyle-plugin-2.11-SNAPSHOT.jar
to /home/hudson/hudson/jobs/maven-plugins-windows/modules/org.apache.maven.plugins$maven-checkstyle-plugin/builds/2013-07-26_21-32-32/archive/org.apache.maven.plugins/maven-checkstyle-plugin/2.11-SNAPSHOT/maven-checkstyle-plugin-2.11-SNAPSHOT.jar
[JENKINS] Archiving F:\hudson\hudson-slave\workspace\maven-plugins-windows\maven-jar-plugin\pom.xml
to /home/hudson/hudson/jobs/maven-plugins-windows/modules/org.apache.maven.plugins$maven-jar-plugin/builds/2013-07-26_21-32-32/archive/org.apache.maven.plugins/maven-jar-plugin/2.5-SNAPSHOT/maven-jar-plugin-2.5-SNAPSHOT.pom
[JENKINS] Archiving F:\hudson\hudson-slave\workspace\maven-plugins-windows\maven-jar-plugin\target\maven-jar-plugin-2.5-SNAPSHOT.jar
to /home/hudson/hudson/jobs/maven-plugins-windows/modules/org.apache.maven.plugins$maven-jar-plugin/builds/2013-07-26_21-32-32/archive/org.apache.maven.plugins/maven-jar-plugin/2.5-SNAPSHOT/maven-jar-plugin-2.5-SNAPSHOT.jar
[JENKINS] Archiving F:\hudson\hudson-slave\workspace\maven-plugins-windows\maven-dependency-plugin\pom.xml
to /home/hudson/hudson/jobs/maven-plugins-windows/modules/org.apache.maven.plugins$maven-dependency-plugin/builds/2013-07-26_21-32-32/archive/org.apache.maven.plugins/maven-dependency-plugin/2.9-SNAPSHOT/maven-dependency-plugin-2.9-SNAPSHOT.pom
[JENKINS] Archiving F:\hudson\hudson-slave\workspace\maven-plugins-windows\maven-dependency-plugin\target\maven-dependency-plugin-2.9-SNAPSHOT.jar
to /home/hudson/hudson/jobs/maven-plugins-windows/modules/org.apache.maven.plugins$maven-dependency-plugin/builds/2013-07-26_21-32-32/archive/org.apache.maven.plugins/maven-dependency-plugin/2.9-SNAPSHOT/maven-dependency-plugin-2.9-SNAPSHOT.jar
[JENKINS] Archiving F:\hudson\hudson-slave\workspace\maven-plugins-windows\maven-ant-plugin\pom.xml
to /home/hudson/hudson/jobs/maven-plugins-windows/modules/org.apache.maven.plugins$maven-ant-plugin/builds/2013-07-26_21-32-32/archive/org.apache.maven.plugins/maven-ant-plugin/2.4-SNAPSHOT/maven-ant-plugin-2.4-SNAPSHOT.pom
[JENKINS] Archiving F:\hudson\hudson-slave\workspace\maven-plugins-windows\maven-ant-plugin\target\maven-ant-plugin-2.4-SNAPSHOT.jar
to /home/hudson/hudson/jobs/maven-plugins-windows/modules/org.apache.maven.plugins$maven-ant-plugin/builds/2013-07-26_21-32-32/archive/org.apache.maven.plugins/maven-ant-plugin/2.4-SNAPSHOT/maven-ant-plugin-2.4-SNAPSHOT.jar
[JENKINS] Archiving F:\hudson\hudson-slave\workspace\maven-plugins-windows\maven-install-plugin\pom.xml
to /home/hudson/hudson/jobs/maven-plugins-windows/modules/org.apache.maven.plugins$maven-install-plugin/builds/2013-07-26_21-32-32/archive/org.apache.maven.plugins/maven-install-plugin/2.5-SNAPSHOT/maven-install-plugin-2.5-SNAPSHOT.pom
[JENKINS] Archiving F:\hudson\hudson-slave\workspace\maven-plugins-windows\maven-install-plugin\target\maven-install-plugin-2.5-SNAPSHOT.jar
to /home/hudson/hudson/jobs/maven-plugins-windows/modules/org.apache.maven.plugins$maven-install-plugin/builds/2013-07-26_21-32-32/archive/org.apache.maven.plugins/maven-install-plugin/2.5-SNAPSHOT/maven-install-plugin-2.5-SNAPSHOT.jar
[JENKINS] Archiving F:\hudson\hudson-slave\workspace\maven-plugins-windows\maven-source-plugin\pom.xml
to /home/hudson/hudson/jobs/maven-plugins-windows/modules/org.apache.maven.plugins$maven-source-plugin/builds/2013-07-26_21-32-32/archive/org.apache.maven.plugins/maven-source-plugin/2.3-SNAPSHOT/maven-source-plugin-2.3-SNAPSHOT.pom
[JENKINS] Archiving F:\hudson\hudson-slave\workspace\maven-plugins-windows\maven-source-plugin\target\maven-source-plugin-2.3-SNAPSHOT.jar
to /home/hudson/hudson/jobs/maven-plugins-windows/modules/org.apache.maven.plugins$maven-source-plugin/builds/2013-07-26_21-32-32/archive/org.apache.maven.plugins/maven-source-plugin/2.3-SNAPSHOT/maven-source-plugin-2.3-SNAPSHOT.jar
[JENKINS] Archiving F:\hudson\hudson-slave\workspace\maven-plugins-windows\maven-compiler-plugin\pom.xml
to /home/hudson/hudson/jobs/maven-plugins-windows/modules/org.apache.maven.plugins$maven-compiler-plugin/builds/2013-07-26_21-32-32/archive/org.apache.maven.plugins/maven-compiler-plugin/3.2-SNAPSHOT/maven-compiler-plugin-3.2-SNAPSHOT.pom
[JENKINS] Archiving F:\hudson\hudson-slave\workspace\maven-plugins-windows\maven-compiler-plugin\target\maven-compiler-plugin-3.2-SNAPSHOT.jar
to /home/hudson/hudson/jobs/maven-plugins-windows/modules/org.apache.maven.plugins$maven-compiler-plugin/builds/2013-07-26_21-32-32/archive/org.apache.maven.plugins/maven-compiler-plugin/3.2-SNAPSHOT/maven-compiler-plugin-3.2-SNAPSHOT.jar
[JENKINS] Archiving F:\hudson\hudson-slave\workspace\maven-plugins-windows\maven-changelog-plugin\pom.xml
to /home/hudson/hudson/jobs/maven-plugins-windows/modules/org.apache.maven.plugins$maven-changelog-plugin/builds/2013-07-26_21-32-32/archive/org.apache.maven.plugins/maven-changelog-plugin/2.3-SNAPSHOT/maven-changelog-plugin-2.3-SNAPSHOT.pom
[JENKINS] Archiving F:\hudson\hudson-slave\workspace\maven-plugins-windows\maven-changelog-plugin\target\maven-changelog-plugin-2.3-SNAPSHOT.jar
to /home/hudson/hudson/jobs/maven-plugins-windows/modules/org.apache.maven.plugins$maven-changelog-plugin/builds/2013-07-26_21-32-32/archive/org.apache.maven.plugins/maven-changelog-plugin/2.3-SNAPSHOT/maven-changelog-plugin-2.3-SNAPSHOT.jar
[JENKINS] Archiving F:\hudson\hudson-slave\workspace\maven-plugins-windows\maven-clean-plugin\pom.xml
to /home/hudson/hudson/jobs/maven-plugins-windows/modules/org.apache.maven.plugins$maven-clean-plugin/builds/2013-07-26_21-32-32/archive/org.apache.maven.plugins/maven-clean-plugin/2.6-SNAPSHOT/maven-clean-plugin-2.6-SNAPSHOT.pom
[JENKINS] Archiving F:\hudson\hudson-slave\workspace\maven-plugins-windows\maven-clean-plugin\target\maven-clean-plugin-2.6-SNAPSHOT.jar
to /home/hudson/hudson/jobs/maven-plugins-windows/modules/org.apache.maven.plugins$maven-clean-plugin/builds/2013-07-26_21-32-32/archive/org.apache.maven.plugins/maven-clean-plugin/2.6-SNAPSHOT/maven-clean-plugin-2.6-SNAPSHOT.jar
[JENKINS] Archiving F:\hudson\hudson-slave\workspace\maven-plugins-windows\maven-pmd-plugin\pom.xml
to /home/hudson/hudson/jobs/maven-plugins-windows/modules/org.apache.maven.plugins$maven-pmd-plugin/builds/2013-07-26_21-32-32/archive/org.apache.maven.plugins/maven-pmd-plugin/3.1-SNAPSHOT/maven-pmd-plugin-3.1-SNAPSHOT.pom
[JENKINS] Archiving F:\hudson\hudson-slave\workspace\maven-plugins-windows\maven-pmd-plugin\target\maven-pmd-plugin-3.1-SNAPSHOT.jar
to /home/hudson/hudson/jobs/maven-plugins-windows/modules/org.apache.maven.plugins$maven-pmd-plugin/builds/2013-07-26_21-32-32/archive/org.apache.maven.plugins/maven-pmd-plugin/3.1-SNAPSHOT/maven-pmd-plugin-3.1-SNAPSHOT.jar
[JENKINS] Archiving F:\hudson\hudson-slave\workspace\maven-plugins-windows\maven-shade-plugin\pom.xml
to /home/hudson/hudson/jobs/maven-plugins-windows/modules/org.apache.maven.plugins$maven-shade-plugin/builds/2013-07-26_21-32-32/archive/org.apache.maven.plugins/maven-shade-plugin/2.2-SNAPSHOT/maven-shade-plugin-2.2-SNAPSHOT.pom
[JENKINS] Archiving F:\hudson\hudson-slave\workspace\maven-plugins-windows\maven-shade-plugin\target\maven-shade-plugin-2.2-SNAPSHOT.jar
to /home/hudson/hudson/jobs/maven-plugins-windows/modules/org.apache.maven.plugins$maven-shade-plugin/builds/2013-07-26_21-32-32/archive/org.apache.maven.plugins/maven-shade-plugin/2.2-SNAPSHOT/maven-shade-plugin-2.2-SNAPSHOT.jar
[JENKINS] Archiving F:\hudson\hudson-slave\workspace\maven-plugins-windows\maven-rar-plugin\pom.xml
to /home/hudson/hudson/jobs/maven-plugins-windows/modules/org.apache.maven.plugins$maven-rar-plugin/builds/2013-07-26_21-32-32/archive/org.apache.maven.plugins/maven-rar-plugin/2.4-SNAPSHOT/maven-rar-plugin-2.4-SNAPSHOT.pom
[JENKINS] Archiving F:\hudson\hudson-slave\workspace\maven-plugins-windows\maven-rar-plugin\target\maven-rar-plugin-2.4-SNAPSHOT.jar
to /home/hudson/hudson/jobs/maven-plugins-windows/modules/org.apache.maven.plugins$maven-rar-plugin/builds/2013-07-26_21-32-32/archive/org.apache.maven.plugins/maven-rar-plugin/2.4-SNAPSHOT/maven-rar-plugin-2.4-SNAPSHOT.jar
[JENKINS] Archiving F:\hudson\hudson-slave\workspace\maven-plugins-windows\maven-changes-plugin\pom.xml
to /home/hudson/hudson/jobs/maven-plugins-windows/modules/org.apache.maven.plugins$maven-changes-plugin/builds/2013-07-26_21-32-32/archive/org.apache.maven.plugins/maven-changes-plugin/2.10-SNAPSHOT/maven-changes-plugin-2.10-SNAPSHOT.pom
[JENKINS] Archiving F:\hudson\hudson-slave\workspace\maven-plugins-windows\maven-changes-plugin\target\maven-changes-plugin-2.10-SNAPSHOT.jar
to /home/hudson/hudson/jobs/maven-plugins-windows/modules/org.apache.maven.plugins$maven-changes-plugin/builds/2013-07-26_21-32-32/archive/org.apache.maven.plugins/maven-changes-plugin/2.10-SNAPSHOT/maven-changes-plugin-2.10-SNAPSHOT.jar
[JENKINS] Archiving <https://builds.apache.org/job/maven-plugins-windows/ws/pom.xml>
to /home/hudson/hudson/jobs/maven-plugins-windows/modules/org.apache.maven.plugins$maven-plugins-aggregator/builds/2013-07-26_21-32-32/archive/org.apache.maven.plugins/maven-plugins-aggregator/1-SNAPSHOT/maven-plugins-aggregator-1-SNAPSHOT.pom
[JENKINS] Archiving F:\hudson\hudson-slave\workspace\maven-plugins-windows\maven-plugins\pom.xml
to /home/hudson/hudson/jobs/maven-plugins-windows/modules/org.apache.maven.plugins$maven-plugins/builds/2013-07-26_21-32-32/archive/org.apache.maven.plugins/maven-plugins/25-SNAPSHOT/maven-plugins-25-SNAPSHOT.pom
[JENKINS] Archiving F:\hudson\hudson-slave\workspace\maven-plugins-windows\maven-plugins\target\maven-plugins-25-SNAPSHOT-site.xml
to /home/hudson/hudson/jobs/maven-plugins-windows/modules/org.apache.maven.plugins$maven-plugins/builds/2013-07-26_21-32-32/archive/org.apache.maven.plugins/maven-plugins/25-SNAPSHOT/maven-plugins-25-SNAPSHOT-site.xml
[JENKINS] Archiving F:\hudson\hudson-slave\workspace\maven-plugins-windows\maven-help-plugin\pom.xml
to /home/hudson/hudson/jobs/maven-plugins-windows/modules/org.apache.maven.plugins$maven-help-plugin/builds/2013-07-26_21-32-32/archive/org.apache.maven.plugins/maven-help-plugin/2.2.1-SNAPSHOT/maven-help-plugin-2.2.1-SNAPSHOT.pom
[JENKINS] Archiving F:\hudson\hudson-slave\workspace\maven-plugins-windows\maven-help-plugin\target\maven-help-plugin-2.2.1-SNAPSHOT.jar
to /home/hudson/hudson/jobs/maven-plugins-windows/modules/org.apache.maven.plugins$maven-help-plugin/builds/2013-07-26_21-32-32/archive/org.apache.maven.plugins/maven-help-plugin/2.2.1-SNAPSHOT/maven-help-plugin-2.2.1-SNAPSHOT.jar
Waiting for Jenkins to finish collecting data
mavenExecutionResult exceptions not empty
message : Failed to execute goal on project maven-one-plugin: Could not resolve dependencies
for project org.apache.maven.plugins:maven-one-plugin:maven-plugin:1.3-SNAPSHOT: Could not
find artifact org.apache.maven.shared:maven-model-converter:jar:2.3 in central (http://repo1.maven.org/maven2)
cause : Could not resolve dependencies for project org.apache.maven.plugins:maven-one-plugin:maven-plugin:1.3-SNAPSHOT:
Could not find artifact org.apache.maven.shared:maven-model-converter:jar:2.3 in central (http://repo1.maven.org/maven2)
Stack trace : 
org.apache.maven.lifecycle.LifecycleExecutionException: Failed to execute goal on project
maven-one-plugin: Could not resolve dependencies for project org.apache.maven.plugins:maven-one-plugin:maven-plugin:1.3-SNAPSHOT:
Could not find artifact org.apache.maven.shared:maven-model-converter:jar:2.3 in central (http://repo1.maven.org/maven2)
	at org.apache.maven.lifecycle.internal.LifecycleDependencyResolver.getDependencies(LifecycleDependencyResolver.java:190)
	at org.apache.maven.lifecycle.internal.LifecycleDependencyResolver.resolveProjectDependencies(LifecycleDependencyResolver.java:104)
	at org.apache.maven.lifecycle.internal.MojoExecutor.ensureDependenciesAreResolved(MojoExecutor.java:258)
	at org.apache.maven.lifecycle.internal.MojoExecutor.execute(MojoExecutor.java:201)
	at org.apache.maven.lifecycle.internal.MojoExecutor.execute(MojoExecutor.java:153)
	at org.apache.maven.lifecycle.internal.MojoExecutor.execute(MojoExecutor.java:145)
	at org.apache.maven.lifecycle.internal.LifecycleModuleBuilder.buildProject(LifecycleModuleBuilder.java:84)
	at org.apache.maven.lifecycle.internal.LifecycleThreadedBuilder$1.call(LifecycleThreadedBuilder.java:167)
	at org.apache.maven.lifecycle.internal.LifecycleThreadedBuilder$1.call(LifecycleThreadedBuilder.java:164)
	at java.util.concurrent.FutureTask$Sync.innerRun(FutureTask.java:303)
	at java.util.concurrent.FutureTask.run(FutureTask.java:138)
	at java.util.concurrent.Executors$RunnableAdapter.call(Executors.java:441)
	at java.util.concurrent.FutureTask$Sync.innerRun(FutureTask.java:303)
	at java.util.concurrent.FutureTask.run(FutureTask.java:138)
	at java.util.concurrent.ThreadPoolExecutor$Worker.runTask(ThreadPoolExecutor.java:886)
	at java.util.concurrent.ThreadPoolExecutor$Worker.run(ThreadPoolExecutor.java:908)
	at java.lang.Thread.run(Thread.java:662)
Caused by: org.apache.maven.project.DependencyResolutionException: Could not resolve dependencies
for project org.apache.maven.plugins:maven-one-plugin:maven-plugin:1.3-SNAPSHOT: Could not
find artifact org.apache.maven.shared:maven-model-converter:jar:2.3 in central (http://repo1.maven.org/maven2)
	at org.apache.maven.project.DefaultProjectDependenciesResolver.resolve(DefaultProjectDependenciesResolver.java:156)
	at org.apache.maven.lifecycle.internal.LifecycleDependencyResolver.getDependencies(LifecycleDependencyResolver.java:165)
	... 16 more
Caused by: org.sonatype.aether.resolution.ArtifactResolutionException: Could not find artifact
org.apache.maven.shared:maven-model-converter:jar:2.3 in central (http://repo1.maven.org/maven2)
	at org.sonatype.aether.impl.internal.DefaultArtifactResolver.resolveArtifacts(DefaultArtifactResolver.java:526)
	at org.sonatype.aether.impl.internal.DefaultRepositorySystem.resolveArtifacts(DefaultRepositorySystem.java:304)
	at org.sonatype.aether.impl.internal.DefaultRepositorySystem.resolveDependencies(DefaultRepositorySystem.java:334)
	at org.apache.maven.project.DefaultProjectDependenciesResolver.resolve(DefaultProjectDependenciesResolver.java:150)
	... 17 more
Caused by: org.sonatype.aether.transfer.ArtifactNotFoundException: Could not find artifact
org.apache.maven.shared:maven-model-converter:jar:2.3 in central (http://repo1.maven.org/maven2)
	at org.sonatype.aether.connector.wagon.WagonRepositoryConnector$4.wrap(WagonRepositoryConnector.java:945)
	at org.sonatype.aether.connector.wagon.WagonRepositoryConnector$4.wrap(WagonRepositoryConnector.java:940)
	at org.sonatype.aether.connector.wagon.WagonRepositoryConnector$GetTask.flush(WagonRepositoryConnector.java:696)
	at org.sonatype.aether.connector.wagon.WagonRepositoryConnector$GetTask.flush(WagonRepositoryConnector.java:690)
	at org.sonatype.aether.connector.wagon.WagonRepositoryConnector.get(WagonRepositoryConnector.java:435)
	at org.sonatype.aether.impl.internal.DefaultArtifactResolver.resolveArtifacts(DefaultArtifactResolver.java:438)
	... 20 more
Maven failed with error.
Sending e-mails to: notifications@maven.apache.org
Sending e-mails to: notifications@maven.apache.org
channel stopped
[WARNINGS] Skipping publisher since build result is FAILURE

Mime
View raw message