maven-notifications mailing list archives

Site index · List index
Message view « Date » · « Thread »
Top « Date » · « Thread »
From Apache Jenkins Server <jenk...@builds.apache.org>
Subject Build failed in Jenkins: maven-skins » Maven Application Skin #173
Date Thu, 01 Aug 2013 19:18:55 GMT
See <https://builds.apache.org/job/maven-skins/org.apache.maven.skins$maven-application-skin/173/>

------------------------------------------
Aug 1, 2013 7:02:00 PM org.apache.maven.cli.event.ExecutionEventLogger projectStarted
INFO:                                                                         
Aug 1, 2013 7:02:00 PM org.apache.maven.cli.event.ExecutionEventLogger projectStarted
INFO: ------------------------------------------------------------------------
Aug 1, 2013 7:02:00 PM org.apache.maven.cli.event.ExecutionEventLogger projectStarted
INFO: Building Maven Application Skin 1.1-SNAPSHOT
Aug 1, 2013 7:02:00 PM org.apache.maven.cli.event.ExecutionEventLogger projectStarted
INFO: ------------------------------------------------------------------------
Aug 1, 2013 7:02:01 PM org.apache.maven.cli.event.ExecutionEventLogger mojoStarted
INFO: 
Aug 1, 2013 7:02:01 PM org.apache.maven.cli.event.ExecutionEventLogger mojoStarted
INFO: --- maven-clean-plugin:2.5:clean (default-clean) @ maven-application-skin ---
[INFO] Deleting <https://builds.apache.org/job/maven-skins/org.apache.maven.skins$maven-application-skin/ws/target>
Aug 1, 2013 7:02:17 PM org.apache.maven.cli.event.ExecutionEventLogger mojoStarted
INFO: 
Aug 1, 2013 7:02:17 PM org.apache.maven.cli.event.ExecutionEventLogger mojoStarted
INFO: --- maven-remote-resources-plugin:1.4:process (default) @ maven-application-skin ---
Aug 1, 2013 7:02:18 PM org.apache.maven.cli.event.ExecutionEventLogger mojoStarted
INFO: 
Aug 1, 2013 7:02:18 PM org.apache.maven.cli.event.ExecutionEventLogger mojoStarted
INFO: --- maven-resources-plugin:2.6:resources (default-resources) @ maven-application-skin
---
[INFO] Using 'UTF-8' encoding to copy filtered resources.
[INFO] Copying 15 resources
[INFO] Copying 3 resources
Aug 1, 2013 7:02:19 PM org.apache.maven.cli.event.ExecutionEventLogger mojoStarted
INFO: 
Aug 1, 2013 7:02:19 PM org.apache.maven.cli.event.ExecutionEventLogger mojoStarted
INFO: --- maven-compiler-plugin:3.0:compile (default-compile) @ maven-application-skin ---
[INFO] No sources to compile
Aug 1, 2013 7:02:37 PM org.apache.maven.cli.event.ExecutionEventLogger mojoStarted
INFO: 
Aug 1, 2013 7:02:37 PM org.apache.maven.cli.event.ExecutionEventLogger mojoStarted
INFO: --- maven-resources-plugin:2.6:testResources (default-testResources) @ maven-application-skin
---
[INFO] Using 'UTF-8' encoding to copy filtered resources.
[INFO] skip non existing resourceDirectory <https://builds.apache.org/job/maven-skins/org.apache.maven.skins$maven-application-skin/ws/src/test/resources>
[INFO] Copying 3 resources
Aug 1, 2013 7:02:38 PM org.apache.maven.cli.event.ExecutionEventLogger mojoStarted
INFO: 
Aug 1, 2013 7:02:38 PM org.apache.maven.cli.event.ExecutionEventLogger mojoStarted
INFO: --- maven-compiler-plugin:3.0:testCompile (default-testCompile) @ maven-application-skin
---
[INFO] No sources to compile
Aug 1, 2013 7:02:42 PM org.apache.maven.cli.event.ExecutionEventLogger mojoStarted
INFO: 
Aug 1, 2013 7:02:42 PM org.apache.maven.cli.event.ExecutionEventLogger mojoStarted
INFO: --- maven-surefire-plugin:2.12.4:test (default-test) @ maven-application-skin ---
[JENKINS] Recording test results
Aug 1, 2013 7:02:50 PM org.apache.maven.cli.event.ExecutionEventLogger mojoStarted
INFO: 
Aug 1, 2013 7:02:50 PM org.apache.maven.cli.event.ExecutionEventLogger mojoStarted
INFO: --- maven-jar-plugin:2.4:jar (default-jar) @ maven-application-skin ---
[INFO] Building jar: <https://builds.apache.org/job/maven-skins/org.apache.maven.skins$maven-application-skin/ws/target/maven-application-skin-1.1-SNAPSHOT.jar>
Aug 1, 2013 7:02:57 PM org.apache.maven.cli.event.ExecutionEventLogger mojoStarted
INFO: 
Aug 1, 2013 7:02:57 PM org.apache.maven.cli.event.ExecutionEventLogger mojoStarted
INFO: --- maven-site-plugin:3.2:attach-descriptor (attach-descriptor) @ maven-application-skin
---
Aug 1, 2013 7:02:58 PM org.apache.maven.cli.event.ExecutionEventLogger mojoStarted
INFO: 
Aug 1, 2013 7:02:58 PM org.apache.maven.cli.event.ExecutionEventLogger mojoStarted
INFO: --- maven-invoker-plugin:1.7:install (integration-test) @ maven-application-skin ---
[INFO] Installing /export/home/hudson/hudson-slave/workspace/maven-skins/maven-skins/pom.xml
to <https://builds.apache.org/job/maven-skins/org.apache.maven.skins$maven-application-skin/ws/target/local-repo/org/apache/maven/skins/maven-skins/8-SNAPSHOT/maven-skins-8-SNAPSHOT.pom>
[INFO] Installing <https://builds.apache.org/job/maven-skins/org.apache.maven.skins$maven-application-skin/ws/pom.xml>
to <https://builds.apache.org/job/maven-skins/org.apache.maven.skins$maven-application-skin/ws/target/local-repo/org/apache/maven/skins/maven-application-skin/1.1-SNAPSHOT/maven-application-skin-1.1-SNAPSHOT.pom>
[INFO] Installing <https://builds.apache.org/job/maven-skins/org.apache.maven.skins$maven-application-skin/ws/target/maven-application-skin-1.1-SNAPSHOT.jar>
to <https://builds.apache.org/job/maven-skins/org.apache.maven.skins$maven-application-skin/ws/target/local-repo/org/apache/maven/skins/maven-application-skin/1.1-SNAPSHOT/maven-application-skin-1.1-SNAPSHOT.jar>
Aug 1, 2013 7:03:13 PM org.apache.maven.cli.event.ExecutionEventLogger mojoStarted
INFO: 
Aug 1, 2013 7:03:13 PM org.apache.maven.cli.event.ExecutionEventLogger mojoStarted
INFO: --- maven-invoker-plugin:1.7:integration-test (integration-test) @ maven-application-skin
---
[INFO] Building: sample/pom.xml
[INFO] ..FAILED (132.6 s)
[INFO]   The build exited with code 1. See <https://builds.apache.org/job/maven-skins/org.apache.maven.skins$maven-application-skin/ws/target/it/sample/build.log>
for details.
[JENKINS] Recording test results
Aug 1, 2013 7:06:24 PM org.apache.maven.cli.event.ExecutionEventLogger mojoStarted
INFO: 
Aug 1, 2013 7:06:24 PM org.apache.maven.cli.event.ExecutionEventLogger mojoStarted
INFO: --- maven-invoker-plugin:1.7:verify (integration-test) @ maven-application-skin ---
[INFO] -------------------------------------------------
[INFO] Build Summary:
[INFO]   Passed: 0, Failed: 1, Errors: 0, Skipped: 0
[INFO] -------------------------------------------------
[ERROR] The following builds failed:
[ERROR] *  sample/pom.xml
[INFO] -------------------------------------------------

Mime
View raw message