maven-notifications mailing list archives

Site index · List index
Message view « Date » · « Thread »
Top « Date » · « Thread »
From Apache Jenkins Server <jenk...@builds.apache.org>
Subject Build failed in Jenkins: maven-plugins-ITs-m3.0.3 #398
Date Sat, 19 Oct 2013 16:26:26 GMT
See <https://builds.apache.org/job/maven-plugins-ITs-m3.0.3/398/changes>

Changes:

[hboutemy] not yet fixed in Maven 3.1.1

[hboutemy] not yet fixed in Maven 3.1.1

[hboutemy] o removed javadoc-options-javadoc-resources.xml in root directory added by inadvertance
o fixed unit-test configurations to avoid creation of this file in the root directory

------------------------------------------
[...truncated 10660 lines...]
[INFO] Installing <https://builds.apache.org/job/maven-plugins-ITs-m3.0.3/ws/maven-doap-plugin/pom.xml>
to <https://builds.apache.org/job/maven-plugins-ITs-m3.0.3/ws/maven-shade-plugin/target/local-repo/org/apache/maven/plugins/maven-doap-plugin/1.2-SNAPSHOT/maven-doap-plugin-1.2-SNAPSHOT.pom>
[INFO] Installing <https://builds.apache.org/job/maven-plugins-ITs-m3.0.3/ws/maven-docck-plugin/pom.xml>
to <https://builds.apache.org/job/maven-plugins-ITs-m3.0.3/ws/maven-shade-plugin/target/local-repo/org/apache/maven/plugins/maven-docck-plugin/1.1-SNAPSHOT/maven-docck-plugin-1.1-SNAPSHOT.pom>
[INFO] Installing <https://builds.apache.org/job/maven-plugins-ITs-m3.0.3/ws/maven-docck-plugin/target/maven-docck-plugin-1.1-SNAPSHOT.jar>
to <https://builds.apache.org/job/maven-plugins-ITs-m3.0.3/ws/maven-shade-plugin/target/local-repo/org/apache/maven/plugins/maven-docck-plugin/1.1-SNAPSHOT/maven-docck-plugin-1.1-SNAPSHOT.jar>
[INFO] Installing <https://builds.apache.org/job/maven-plugins-ITs-m3.0.3/ws/maven-docck-plugin/pom.xml>
to <https://builds.apache.org/job/maven-plugins-ITs-m3.0.3/ws/maven-shade-plugin/target/local-repo/org/apache/maven/plugins/maven-docck-plugin/1.1-SNAPSHOT/maven-docck-plugin-1.1-SNAPSHOT.pom>
[INFO] Installing <https://builds.apache.org/job/maven-plugins-ITs-m3.0.3/ws/maven-ear-plugin/pom.xml>
to <https://builds.apache.org/job/maven-plugins-ITs-m3.0.3/ws/maven-shade-plugin/target/local-repo/org/apache/maven/plugins/maven-ear-plugin/2.9-SNAPSHOT/maven-ear-plugin-2.9-SNAPSHOT.pom>
[INFO] Installing <https://builds.apache.org/job/maven-plugins-ITs-m3.0.3/ws/maven-ear-plugin/target/maven-ear-plugin-2.9-SNAPSHOT.jar>
to <https://builds.apache.org/job/maven-plugins-ITs-m3.0.3/ws/maven-shade-plugin/target/local-repo/org/apache/maven/plugins/maven-ear-plugin/2.9-SNAPSHOT/maven-ear-plugin-2.9-SNAPSHOT.jar>
[INFO] Installing <https://builds.apache.org/job/maven-plugins-ITs-m3.0.3/ws/maven-ear-plugin/pom.xml>
to <https://builds.apache.org/job/maven-plugins-ITs-m3.0.3/ws/maven-shade-plugin/target/local-repo/org/apache/maven/plugins/maven-ear-plugin/2.9-SNAPSHOT/maven-ear-plugin-2.9-SNAPSHOT.pom>
[INFO] Installing <https://builds.apache.org/job/maven-plugins-ITs-m3.0.3/ws/maven-ejb-plugin/pom.xml>
to <https://builds.apache.org/job/maven-plugins-ITs-m3.0.3/ws/maven-shade-plugin/target/local-repo/org/apache/maven/plugins/maven-ejb-plugin/2.4-SNAPSHOT/maven-ejb-plugin-2.4-SNAPSHOT.pom>
[INFO] Installing <https://builds.apache.org/job/maven-plugins-ITs-m3.0.3/ws/maven-ejb-plugin/target/maven-ejb-plugin-2.4-SNAPSHOT.jar>
to <https://builds.apache.org/job/maven-plugins-ITs-m3.0.3/ws/maven-shade-plugin/target/local-repo/org/apache/maven/plugins/maven-ejb-plugin/2.4-SNAPSHOT/maven-ejb-plugin-2.4-SNAPSHOT.jar>
[INFO] Installing <https://builds.apache.org/job/maven-plugins-ITs-m3.0.3/ws/maven-ejb-plugin/pom.xml>
to <https://builds.apache.org/job/maven-plugins-ITs-m3.0.3/ws/maven-shade-plugin/target/local-repo/org/apache/maven/plugins/maven-ejb-plugin/2.4-SNAPSHOT/maven-ejb-plugin-2.4-SNAPSHOT.pom>
[INFO] Installing <https://builds.apache.org/job/maven-plugins-ITs-m3.0.3/ws/maven-help-plugin/pom.xml>
to <https://builds.apache.org/job/maven-plugins-ITs-m3.0.3/ws/maven-shade-plugin/target/local-repo/org/apache/maven/plugins/maven-help-plugin/2.2.1-SNAPSHOT/maven-help-plugin-2.2.1-SNAPSHOT.pom>
[INFO] Installing <https://builds.apache.org/job/maven-plugins-ITs-m3.0.3/ws/maven-help-plugin/target/maven-help-plugin-2.2.1-SNAPSHOT.jar>
to <https://builds.apache.org/job/maven-plugins-ITs-m3.0.3/ws/maven-shade-plugin/target/local-repo/org/apache/maven/plugins/maven-help-plugin/2.2.1-SNAPSHOT/maven-help-plugin-2.2.1-SNAPSHOT.jar>
[INFO] Installing <https://builds.apache.org/job/maven-plugins-ITs-m3.0.3/ws/maven-help-plugin/pom.xml>
to <https://builds.apache.org/job/maven-plugins-ITs-m3.0.3/ws/maven-shade-plugin/target/local-repo/org/apache/maven/plugins/maven-help-plugin/2.2.1-SNAPSHOT/maven-help-plugin-2.2.1-SNAPSHOT.pom>
[INFO] Installing <https://builds.apache.org/job/maven-plugins-ITs-m3.0.3/ws/maven-install-plugin/pom.xml>
to <https://builds.apache.org/job/maven-plugins-ITs-m3.0.3/ws/maven-shade-plugin/target/local-repo/org/apache/maven/plugins/maven-install-plugin/2.6-SNAPSHOT/maven-install-plugin-2.6-SNAPSHOT.pom>
[INFO] Installing <https://builds.apache.org/job/maven-plugins-ITs-m3.0.3/ws/maven-install-plugin/target/maven-install-plugin-2.6-SNAPSHOT.jar>
to <https://builds.apache.org/job/maven-plugins-ITs-m3.0.3/ws/maven-shade-plugin/target/local-repo/org/apache/maven/plugins/maven-install-plugin/2.6-SNAPSHOT/maven-install-plugin-2.6-SNAPSHOT.jar>
[INFO] Installing <https://builds.apache.org/job/maven-plugins-ITs-m3.0.3/ws/maven-install-plugin/pom.xml>
to <https://builds.apache.org/job/maven-plugins-ITs-m3.0.3/ws/maven-shade-plugin/target/local-repo/org/apache/maven/plugins/maven-install-plugin/2.6-SNAPSHOT/maven-install-plugin-2.6-SNAPSHOT.pom>
[INFO] Installing <https://builds.apache.org/job/maven-plugins-ITs-m3.0.3/ws/maven-jar-plugin/pom.xml>
to <https://builds.apache.org/job/maven-plugins-ITs-m3.0.3/ws/maven-shade-plugin/target/local-repo/org/apache/maven/plugins/maven-jar-plugin/2.5-SNAPSHOT/maven-jar-plugin-2.5-SNAPSHOT.pom>
[INFO] Installing <https://builds.apache.org/job/maven-plugins-ITs-m3.0.3/ws/maven-jar-plugin/target/maven-jar-plugin-2.5-SNAPSHOT.jar>
to <https://builds.apache.org/job/maven-plugins-ITs-m3.0.3/ws/maven-shade-plugin/target/local-repo/org/apache/maven/plugins/maven-jar-plugin/2.5-SNAPSHOT/maven-jar-plugin-2.5-SNAPSHOT.jar>
[INFO] Installing <https://builds.apache.org/job/maven-plugins-ITs-m3.0.3/ws/maven-jar-plugin/pom.xml>
to <https://builds.apache.org/job/maven-plugins-ITs-m3.0.3/ws/maven-shade-plugin/target/local-repo/org/apache/maven/plugins/maven-jar-plugin/2.5-SNAPSHOT/maven-jar-plugin-2.5-SNAPSHOT.pom>
[INFO] Installing <https://builds.apache.org/job/maven-plugins-ITs-m3.0.3/ws/maven-jarsigner-plugin/pom.xml>
to <https://builds.apache.org/job/maven-plugins-ITs-m3.0.3/ws/maven-shade-plugin/target/local-repo/org/apache/maven/plugins/maven-jarsigner-plugin/1.3-SNAPSHOT/maven-jarsigner-plugin-1.3-SNAPSHOT.pom>
[INFO] Installing <https://builds.apache.org/job/maven-plugins-ITs-m3.0.3/ws/maven-jarsigner-plugin/target/maven-jarsigner-plugin-1.3-SNAPSHOT.jar>
to <https://builds.apache.org/job/maven-plugins-ITs-m3.0.3/ws/maven-shade-plugin/target/local-repo/org/apache/maven/plugins/maven-jarsigner-plugin/1.3-SNAPSHOT/maven-jarsigner-plugin-1.3-SNAPSHOT.jar>
[INFO] Installing <https://builds.apache.org/job/maven-plugins-ITs-m3.0.3/ws/maven-jarsigner-plugin/pom.xml>
to <https://builds.apache.org/job/maven-plugins-ITs-m3.0.3/ws/maven-shade-plugin/target/local-repo/org/apache/maven/plugins/maven-jarsigner-plugin/1.3-SNAPSHOT/maven-jarsigner-plugin-1.3-SNAPSHOT.pom>
[INFO] Installing <https://builds.apache.org/job/maven-plugins-ITs-m3.0.3/ws/maven-javadoc-plugin/pom.xml>
to <https://builds.apache.org/job/maven-plugins-ITs-m3.0.3/ws/maven-shade-plugin/target/local-repo/org/apache/maven/plugins/maven-javadoc-plugin/2.9.2-SNAPSHOT/maven-javadoc-plugin-2.9.2-SNAPSHOT.pom>
[INFO] Installing <https://builds.apache.org/job/maven-plugins-ITs-m3.0.3/ws/maven-javadoc-plugin/target/maven-javadoc-plugin-2.9.2-SNAPSHOT.jar>
to <https://builds.apache.org/job/maven-plugins-ITs-m3.0.3/ws/maven-shade-plugin/target/local-repo/org/apache/maven/plugins/maven-javadoc-plugin/2.9.2-SNAPSHOT/maven-javadoc-plugin-2.9.2-SNAPSHOT.jar>
[INFO] Installing <https://builds.apache.org/job/maven-plugins-ITs-m3.0.3/ws/maven-javadoc-plugin/pom.xml>
to <https://builds.apache.org/job/maven-plugins-ITs-m3.0.3/ws/maven-shade-plugin/target/local-repo/org/apache/maven/plugins/maven-javadoc-plugin/2.9.2-SNAPSHOT/maven-javadoc-plugin-2.9.2-SNAPSHOT.pom>
[INFO] Installing <https://builds.apache.org/job/maven-plugins-ITs-m3.0.3/ws/maven-linkcheck-plugin/pom.xml>
to <https://builds.apache.org/job/maven-plugins-ITs-m3.0.3/ws/maven-shade-plugin/target/local-repo/org/apache/maven/plugins/maven-linkcheck-plugin/1.2-SNAPSHOT/maven-linkcheck-plugin-1.2-SNAPSHOT.pom>
[INFO] Installing <https://builds.apache.org/job/maven-plugins-ITs-m3.0.3/ws/maven-linkcheck-plugin/target/maven-linkcheck-plugin-1.2-SNAPSHOT.jar>
to <https://builds.apache.org/job/maven-plugins-ITs-m3.0.3/ws/maven-shade-plugin/target/local-repo/org/apache/maven/plugins/maven-linkcheck-plugin/1.2-SNAPSHOT/maven-linkcheck-plugin-1.2-SNAPSHOT.jar>
[INFO] Installing <https://builds.apache.org/job/maven-plugins-ITs-m3.0.3/ws/maven-linkcheck-plugin/pom.xml>
to <https://builds.apache.org/job/maven-plugins-ITs-m3.0.3/ws/maven-shade-plugin/target/local-repo/org/apache/maven/plugins/maven-linkcheck-plugin/1.2-SNAPSHOT/maven-linkcheck-plugin-1.2-SNAPSHOT.pom>
[INFO] Installing <https://builds.apache.org/job/maven-plugins-ITs-m3.0.3/ws/maven-patch-plugin/pom.xml>
to <https://builds.apache.org/job/maven-plugins-ITs-m3.0.3/ws/maven-shade-plugin/target/local-repo/org/apache/maven/plugins/maven-patch-plugin/1.2-SNAPSHOT/maven-patch-plugin-1.2-SNAPSHOT.pom>
[INFO] Installing <https://builds.apache.org/job/maven-plugins-ITs-m3.0.3/ws/maven-patch-plugin/target/maven-patch-plugin-1.2-SNAPSHOT.jar>
to <https://builds.apache.org/job/maven-plugins-ITs-m3.0.3/ws/maven-shade-plugin/target/local-repo/org/apache/maven/plugins/maven-patch-plugin/1.2-SNAPSHOT/maven-patch-plugin-1.2-SNAPSHOT.jar>
[INFO] Installing <https://builds.apache.org/job/maven-plugins-ITs-m3.0.3/ws/maven-patch-plugin/pom.xml>
to <https://builds.apache.org/job/maven-plugins-ITs-m3.0.3/ws/maven-shade-plugin/target/local-repo/org/apache/maven/plugins/maven-patch-plugin/1.2-SNAPSHOT/maven-patch-plugin-1.2-SNAPSHOT.pom>
[INFO] Installing <https://builds.apache.org/job/maven-plugins-ITs-m3.0.3/ws/maven-pdf-plugin/pom.xml>
to <https://builds.apache.org/job/maven-plugins-ITs-m3.0.3/ws/maven-shade-plugin/target/local-repo/org/apache/maven/plugins/maven-pdf-plugin/1.3-SNAPSHOT/maven-pdf-plugin-1.3-SNAPSHOT.pom>
[INFO] Installing <https://builds.apache.org/job/maven-plugins-ITs-m3.0.3/ws/maven-pdf-plugin/target/maven-pdf-plugin-1.3-SNAPSHOT.jar>
to <https://builds.apache.org/job/maven-plugins-ITs-m3.0.3/ws/maven-shade-plugin/target/local-repo/org/apache/maven/plugins/maven-pdf-plugin/1.3-SNAPSHOT/maven-pdf-plugin-1.3-SNAPSHOT.jar>
[INFO] Installing <https://builds.apache.org/job/maven-plugins-ITs-m3.0.3/ws/maven-pdf-plugin/pom.xml>
to <https://builds.apache.org/job/maven-plugins-ITs-m3.0.3/ws/maven-shade-plugin/target/local-repo/org/apache/maven/plugins/maven-pdf-plugin/1.3-SNAPSHOT/maven-pdf-plugin-1.3-SNAPSHOT.pom>
[INFO] Installing <https://builds.apache.org/job/maven-plugins-ITs-m3.0.3/ws/maven-pmd-plugin/pom.xml>
to <https://builds.apache.org/job/maven-plugins-ITs-m3.0.3/ws/maven-shade-plugin/target/local-repo/org/apache/maven/plugins/maven-pmd-plugin/3.1-SNAPSHOT/maven-pmd-plugin-3.1-SNAPSHOT.pom>
[INFO] Installing <https://builds.apache.org/job/maven-plugins-ITs-m3.0.3/ws/maven-pmd-plugin/target/maven-pmd-plugin-3.1-SNAPSHOT.jar>
to <https://builds.apache.org/job/maven-plugins-ITs-m3.0.3/ws/maven-shade-plugin/target/local-repo/org/apache/maven/plugins/maven-pmd-plugin/3.1-SNAPSHOT/maven-pmd-plugin-3.1-SNAPSHOT.jar>
[INFO] Installing <https://builds.apache.org/job/maven-plugins-ITs-m3.0.3/ws/maven-pmd-plugin/pom.xml>
to <https://builds.apache.org/job/maven-plugins-ITs-m3.0.3/ws/maven-shade-plugin/target/local-repo/org/apache/maven/plugins/maven-pmd-plugin/3.1-SNAPSHOT/maven-pmd-plugin-3.1-SNAPSHOT.pom>
[INFO] Installing <https://builds.apache.org/job/maven-plugins-ITs-m3.0.3/ws/maven-rar-plugin/pom.xml>
to <https://builds.apache.org/job/maven-plugins-ITs-m3.0.3/ws/maven-shade-plugin/target/local-repo/org/apache/maven/plugins/maven-rar-plugin/2.4-SNAPSHOT/maven-rar-plugin-2.4-SNAPSHOT.pom>
[INFO] Installing <https://builds.apache.org/job/maven-plugins-ITs-m3.0.3/ws/maven-rar-plugin/target/maven-rar-plugin-2.4-SNAPSHOT.jar>
to <https://builds.apache.org/job/maven-plugins-ITs-m3.0.3/ws/maven-shade-plugin/target/local-repo/org/apache/maven/plugins/maven-rar-plugin/2.4-SNAPSHOT/maven-rar-plugin-2.4-SNAPSHOT.jar>
[INFO] Installing <https://builds.apache.org/job/maven-plugins-ITs-m3.0.3/ws/maven-rar-plugin/pom.xml>
to <https://builds.apache.org/job/maven-plugins-ITs-m3.0.3/ws/maven-shade-plugin/target/local-repo/org/apache/maven/plugins/maven-rar-plugin/2.4-SNAPSHOT/maven-rar-plugin-2.4-SNAPSHOT.pom>
[INFO] Installing <https://builds.apache.org/job/maven-plugins-ITs-m3.0.3/ws/maven-reactor-plugin/pom.xml>
to <https://builds.apache.org/job/maven-plugins-ITs-m3.0.3/ws/maven-shade-plugin/target/local-repo/org/apache/maven/plugins/maven-reactor-plugin/1.1-SNAPSHOT/maven-reactor-plugin-1.1-SNAPSHOT.pom>
[INFO] Installing <https://builds.apache.org/job/maven-plugins-ITs-m3.0.3/ws/maven-reactor-plugin/target/maven-reactor-plugin-1.1-SNAPSHOT.jar>
to <https://builds.apache.org/job/maven-plugins-ITs-m3.0.3/ws/maven-shade-plugin/target/local-repo/org/apache/maven/plugins/maven-reactor-plugin/1.1-SNAPSHOT/maven-reactor-plugin-1.1-SNAPSHOT.jar>
[INFO] Installing <https://builds.apache.org/job/maven-plugins-ITs-m3.0.3/ws/maven-reactor-plugin/pom.xml>
to <https://builds.apache.org/job/maven-plugins-ITs-m3.0.3/ws/maven-shade-plugin/target/local-repo/org/apache/maven/plugins/maven-reactor-plugin/1.1-SNAPSHOT/maven-reactor-plugin-1.1-SNAPSHOT.pom>
[INFO] Installing <https://builds.apache.org/job/maven-plugins-ITs-m3.0.3/ws/maven-repository-plugin/pom.xml>
to <https://builds.apache.org/job/maven-plugins-ITs-m3.0.3/ws/maven-shade-plugin/target/local-repo/org/apache/maven/plugins/maven-repository-plugin/2.3.2-SNAPSHOT/maven-repository-plugin-2.3.2-SNAPSHOT.pom>
[INFO] Installing <https://builds.apache.org/job/maven-plugins-ITs-m3.0.3/ws/maven-repository-plugin/target/maven-repository-plugin-2.3.2-SNAPSHOT.jar>
to <https://builds.apache.org/job/maven-plugins-ITs-m3.0.3/ws/maven-shade-plugin/target/local-repo/org/apache/maven/plugins/maven-repository-plugin/2.3.2-SNAPSHOT/maven-repository-plugin-2.3.2-SNAPSHOT.jar>
[INFO] Installing <https://builds.apache.org/job/maven-plugins-ITs-m3.0.3/ws/maven-repository-plugin/pom.xml>
to <https://builds.apache.org/job/maven-plugins-ITs-m3.0.3/ws/maven-shade-plugin/target/local-repo/org/apache/maven/plugins/maven-repository-plugin/2.3.2-SNAPSHOT/maven-repository-plugin-2.3.2-SNAPSHOT.pom>
[INFO] Installing <https://builds.apache.org/job/maven-plugins-ITs-m3.0.3/ws/maven-resources-plugin/pom.xml>
to <https://builds.apache.org/job/maven-plugins-ITs-m3.0.3/ws/maven-shade-plugin/target/local-repo/org/apache/maven/plugins/maven-resources-plugin/2.7-SNAPSHOT/maven-resources-plugin-2.7-SNAPSHOT.pom>
[INFO] Installing <https://builds.apache.org/job/maven-plugins-ITs-m3.0.3/ws/maven-resources-plugin/target/maven-resources-plugin-2.7-SNAPSHOT.jar>
to <https://builds.apache.org/job/maven-plugins-ITs-m3.0.3/ws/maven-shade-plugin/target/local-repo/org/apache/maven/plugins/maven-resources-plugin/2.7-SNAPSHOT/maven-resources-plugin-2.7-SNAPSHOT.jar>
[INFO] Installing <https://builds.apache.org/job/maven-plugins-ITs-m3.0.3/ws/maven-resources-plugin/pom.xml>
to <https://builds.apache.org/job/maven-plugins-ITs-m3.0.3/ws/maven-shade-plugin/target/local-repo/org/apache/maven/plugins/maven-resources-plugin/2.7-SNAPSHOT/maven-resources-plugin-2.7-SNAPSHOT.pom>
[INFO] Installing <https://builds.apache.org/job/maven-plugins-ITs-m3.0.3/ws/maven-resources-plugin/target/maven-resources-plugin-2.7-SNAPSHOT-tests.jar>
to <https://builds.apache.org/job/maven-plugins-ITs-m3.0.3/ws/maven-shade-plugin/target/local-repo/org/apache/maven/plugins/maven-resources-plugin/2.7-SNAPSHOT/maven-resources-plugin-2.7-SNAPSHOT-tests.jar>
[INFO] Installing <https://builds.apache.org/job/maven-plugins-ITs-m3.0.3/ws/maven-site-plugin/dependency-reduced-pom.xml>
to <https://builds.apache.org/job/maven-plugins-ITs-m3.0.3/ws/maven-shade-plugin/target/local-repo/org/apache/maven/plugins/maven-site-plugin/3.4-SNAPSHOT/maven-site-plugin-3.4-SNAPSHOT.pom>
[INFO] Installing <https://builds.apache.org/job/maven-plugins-ITs-m3.0.3/ws/maven-site-plugin/target/maven-site-plugin-3.4-SNAPSHOT.jar>
to <https://builds.apache.org/job/maven-plugins-ITs-m3.0.3/ws/maven-shade-plugin/target/local-repo/org/apache/maven/plugins/maven-site-plugin/3.4-SNAPSHOT/maven-site-plugin-3.4-SNAPSHOT.jar>
[INFO] Installing <https://builds.apache.org/job/maven-plugins-ITs-m3.0.3/ws/maven-site-plugin/dependency-reduced-pom.xml>
to <https://builds.apache.org/job/maven-plugins-ITs-m3.0.3/ws/maven-shade-plugin/target/local-repo/org/apache/maven/plugins/maven-site-plugin/3.4-SNAPSHOT/maven-site-plugin-3.4-SNAPSHOT.pom>
[INFO] Installing <https://builds.apache.org/job/maven-plugins-ITs-m3.0.3/ws/maven-source-plugin/pom.xml>
to <https://builds.apache.org/job/maven-plugins-ITs-m3.0.3/ws/maven-shade-plugin/target/local-repo/org/apache/maven/plugins/maven-source-plugin/2.3-SNAPSHOT/maven-source-plugin-2.3-SNAPSHOT.pom>
[INFO] Installing <https://builds.apache.org/job/maven-plugins-ITs-m3.0.3/ws/maven-source-plugin/target/maven-source-plugin-2.3-SNAPSHOT.jar>
to <https://builds.apache.org/job/maven-plugins-ITs-m3.0.3/ws/maven-shade-plugin/target/local-repo/org/apache/maven/plugins/maven-source-plugin/2.3-SNAPSHOT/maven-source-plugin-2.3-SNAPSHOT.jar>
[INFO] Installing <https://builds.apache.org/job/maven-plugins-ITs-m3.0.3/ws/maven-source-plugin/pom.xml>
to <https://builds.apache.org/job/maven-plugins-ITs-m3.0.3/ws/maven-shade-plugin/target/local-repo/org/apache/maven/plugins/maven-source-plugin/2.3-SNAPSHOT/maven-source-plugin-2.3-SNAPSHOT.pom>
[INFO] Installing <https://builds.apache.org/job/maven-plugins-ITs-m3.0.3/ws/maven-stage-plugin/pom.xml>
to <https://builds.apache.org/job/maven-plugins-ITs-m3.0.3/ws/maven-shade-plugin/target/local-repo/org/apache/maven/plugins/maven-stage-plugin/1.0-SNAPSHOT/maven-stage-plugin-1.0-SNAPSHOT.pom>
[INFO] Installing <https://builds.apache.org/job/maven-plugins-ITs-m3.0.3/ws/maven-stage-plugin/target/maven-stage-plugin-1.0-SNAPSHOT.jar>
to <https://builds.apache.org/job/maven-plugins-ITs-m3.0.3/ws/maven-shade-plugin/target/local-repo/org/apache/maven/plugins/maven-stage-plugin/1.0-SNAPSHOT/maven-stage-plugin-1.0-SNAPSHOT.jar>
[INFO] Installing <https://builds.apache.org/job/maven-plugins-ITs-m3.0.3/ws/maven-stage-plugin/pom.xml>
to <https://builds.apache.org/job/maven-plugins-ITs-m3.0.3/ws/maven-shade-plugin/target/local-repo/org/apache/maven/plugins/maven-stage-plugin/1.0-SNAPSHOT/maven-stage-plugin-1.0-SNAPSHOT.pom>
[INFO] Installing <https://builds.apache.org/job/maven-plugins-ITs-m3.0.3/ws/maven-toolchains-plugin/pom.xml>
to <https://builds.apache.org/job/maven-plugins-ITs-m3.0.3/ws/maven-shade-plugin/target/local-repo/org/apache/maven/plugins/maven-toolchains-plugin/1.1-SNAPSHOT/maven-toolchains-plugin-1.1-SNAPSHOT.pom>
[INFO] Installing <https://builds.apache.org/job/maven-plugins-ITs-m3.0.3/ws/maven-toolchains-plugin/target/maven-toolchains-plugin-1.1-SNAPSHOT.jar>
to <https://builds.apache.org/job/maven-plugins-ITs-m3.0.3/ws/maven-shade-plugin/target/local-repo/org/apache/maven/plugins/maven-toolchains-plugin/1.1-SNAPSHOT/maven-toolchains-plugin-1.1-SNAPSHOT.jar>
[INFO] Installing <https://builds.apache.org/job/maven-plugins-ITs-m3.0.3/ws/maven-toolchains-plugin/pom.xml>
to <https://builds.apache.org/job/maven-plugins-ITs-m3.0.3/ws/maven-shade-plugin/target/local-repo/org/apache/maven/plugins/maven-toolchains-plugin/1.1-SNAPSHOT/maven-toolchains-plugin-1.1-SNAPSHOT.pom>
[INFO] Installing <https://builds.apache.org/job/maven-plugins-ITs-m3.0.3/ws/maven-verifier-plugin/pom.xml>
to <https://builds.apache.org/job/maven-plugins-ITs-m3.0.3/ws/maven-shade-plugin/target/local-repo/org/apache/maven/plugins/maven-verifier-plugin/1.1-SNAPSHOT/maven-verifier-plugin-1.1-SNAPSHOT.pom>
[INFO] Installing <https://builds.apache.org/job/maven-plugins-ITs-m3.0.3/ws/maven-verifier-plugin/target/maven-verifier-plugin-1.1-SNAPSHOT.jar>
to <https://builds.apache.org/job/maven-plugins-ITs-m3.0.3/ws/maven-shade-plugin/target/local-repo/org/apache/maven/plugins/maven-verifier-plugin/1.1-SNAPSHOT/maven-verifier-plugin-1.1-SNAPSHOT.jar>
[INFO] Installing <https://builds.apache.org/job/maven-plugins-ITs-m3.0.3/ws/maven-verifier-plugin/pom.xml>
to <https://builds.apache.org/job/maven-plugins-ITs-m3.0.3/ws/maven-shade-plugin/target/local-repo/org/apache/maven/plugins/maven-verifier-plugin/1.1-SNAPSHOT/maven-verifier-plugin-1.1-SNAPSHOT.pom>
[INFO] Installing <https://builds.apache.org/job/maven-plugins-ITs-m3.0.3/ws/maven-war-plugin/pom.xml>
to <https://builds.apache.org/job/maven-plugins-ITs-m3.0.3/ws/maven-shade-plugin/target/local-repo/org/apache/maven/plugins/maven-war-plugin/2.5-SNAPSHOT/maven-war-plugin-2.5-SNAPSHOT.pom>
[INFO] Installing <https://builds.apache.org/job/maven-plugins-ITs-m3.0.3/ws/maven-war-plugin/target/maven-war-plugin-2.5-SNAPSHOT.jar>
to <https://builds.apache.org/job/maven-plugins-ITs-m3.0.3/ws/maven-shade-plugin/target/local-repo/org/apache/maven/plugins/maven-war-plugin/2.5-SNAPSHOT/maven-war-plugin-2.5-SNAPSHOT.jar>
[INFO] Installing <https://builds.apache.org/job/maven-plugins-ITs-m3.0.3/ws/maven-war-plugin/pom.xml>
to <https://builds.apache.org/job/maven-plugins-ITs-m3.0.3/ws/maven-shade-plugin/target/local-repo/org/apache/maven/plugins/maven-war-plugin/2.5-SNAPSHOT/maven-war-plugin-2.5-SNAPSHOT.pom>
[INFO] Installing <https://builds.apache.org/job/maven-plugins-ITs-m3.0.3/ws/maven-scm-publish-plugin/pom.xml>
to <https://builds.apache.org/job/maven-plugins-ITs-m3.0.3/ws/maven-shade-plugin/target/local-repo/org/apache/maven/plugins/maven-scm-publish-plugin/1.0-SNAPSHOT/maven-scm-publish-plugin-1.0-SNAPSHOT.pom>
[INFO] Installing <https://builds.apache.org/job/maven-plugins-ITs-m3.0.3/ws/maven-scm-publish-plugin/target/maven-scm-publish-plugin-1.0-SNAPSHOT.jar>
to <https://builds.apache.org/job/maven-plugins-ITs-m3.0.3/ws/maven-shade-plugin/target/local-repo/org/apache/maven/plugins/maven-scm-publish-plugin/1.0-SNAPSHOT/maven-scm-publish-plugin-1.0-SNAPSHOT.jar>
[INFO] Installing <https://builds.apache.org/job/maven-plugins-ITs-m3.0.3/ws/maven-scm-publish-plugin/pom.xml>
to <https://builds.apache.org/job/maven-plugins-ITs-m3.0.3/ws/maven-shade-plugin/target/local-repo/org/apache/maven/plugins/maven-scm-publish-plugin/1.0-SNAPSHOT/maven-scm-publish-plugin-1.0-SNAPSHOT.pom>
[INFO] Installing <https://builds.apache.org/job/maven-plugins-ITs-m3.0.3/ws/maven-invoker-plugin/pom.xml>
to <https://builds.apache.org/job/maven-plugins-ITs-m3.0.3/ws/maven-shade-plugin/target/local-repo/org/apache/maven/plugins/maven-invoker-plugin/1.9-SNAPSHOT/maven-invoker-plugin-1.9-SNAPSHOT.pom>
[INFO] Installing <https://builds.apache.org/job/maven-plugins-ITs-m3.0.3/ws/maven-invoker-plugin/target/maven-invoker-plugin-1.9-SNAPSHOT.jar>
to <https://builds.apache.org/job/maven-plugins-ITs-m3.0.3/ws/maven-shade-plugin/target/local-repo/org/apache/maven/plugins/maven-invoker-plugin/1.9-SNAPSHOT/maven-invoker-plugin-1.9-SNAPSHOT.jar>
[INFO] Installing <https://builds.apache.org/job/maven-plugins-ITs-m3.0.3/ws/maven-invoker-plugin/pom.xml>
to <https://builds.apache.org/job/maven-plugins-ITs-m3.0.3/ws/maven-shade-plugin/target/local-repo/org/apache/maven/plugins/maven-invoker-plugin/1.9-SNAPSHOT/maven-invoker-plugin-1.9-SNAPSHOT.pom>
[INFO] Installing <https://builds.apache.org/job/maven-plugins-ITs-m3.0.3/ws/maven-project-info-reports-plugin/pom.xml>
to <https://builds.apache.org/job/maven-plugins-ITs-m3.0.3/ws/maven-shade-plugin/target/local-repo/org/apache/maven/plugins/maven-project-info-reports-plugin/2.8-SNAPSHOT/maven-project-info-reports-plugin-2.8-SNAPSHOT.pom>
[INFO]                                                                         
[INFO] ------------------------------------------------------------------------
[INFO] Building Apache Maven GPG Plugin 1.5-SNAPSHOT
[INFO] ------------------------------------------------------------------------
[INFO] 
[INFO] --- maven-clean-plugin:2.5:clean (default-clean) @ maven-gpg-plugin ---
[INFO] Deleting <https://builds.apache.org/job/maven-plugins-ITs-m3.0.3/ws/maven-gpg-plugin/target>
[INFO] 
[INFO] --- maven-enforcer-plugin:1.0.1:enforce (ensure-no-container-api) @ maven-gpg-plugin
---
[INFO] 
[INFO] --- maven-plugin-plugin:3.2:helpmojo (generated-helpmojo) @ maven-gpg-plugin ---
[INFO] Using 'UTF-8' encoding to read mojo metadata.
[INFO] Applying mojo extractor for language: java
[INFO] Mojo extractor for language: java found 0 mojo descriptors.
[INFO] Applying mojo extractor for language: bsh
[INFO] Mojo extractor for language: bsh found 0 mojo descriptors.
[INFO] Applying mojo extractor for language: java-annotations
[INFO] Mojo extractor for language: java-annotations found 0 mojo descriptors.
[INFO] 
[INFO] --- maven-plugin-plugin:3.2:descriptor (default-descriptor) @ maven-gpg-plugin ---
[INFO] Using 'UTF-8' encoding to read mojo metadata.
[INFO] Applying mojo extractor for language: java
[INFO] Mojo extractor for language: java found 0 mojo descriptors.
[INFO] Applying mojo extractor for language: bsh
[INFO] Mojo extractor for language: bsh found 0 mojo descriptors.
[INFO] Applying mojo extractor for language: java-annotations
[INFO] Mojo extractor for language: java-annotations found 0 mojo descriptors.
[INFO] 
[INFO] --- maven-remote-resources-plugin:1.4:process (default) @ maven-gpg-plugin ---
[INFO] 
[INFO] --- maven-resources-plugin:2.6:resources (default-resources) @ maven-gpg-plugin ---
[INFO] Using 'UTF-8' encoding to copy filtered resources.
[INFO] skip non existing resourceDirectory <https://builds.apache.org/job/maven-plugins-ITs-m3.0.3/ws/maven-gpg-plugin/src/main/resources>
[INFO] Copying 3 resources
[INFO] 
[INFO] --- maven-compiler-plugin:3.0:compile (default-compile) @ maven-gpg-plugin ---
[INFO] Changes detected - recompiling the module!
[INFO] Compiling 9 source files to <https://builds.apache.org/job/maven-plugins-ITs-m3.0.3/ws/maven-gpg-plugin/target/classes>
[INFO] 
[INFO] --- maven-plugin-plugin:3.2:descriptor (generate-descriptor) @ maven-gpg-plugin ---
[INFO] Using 'UTF-8' encoding to read mojo metadata.
[INFO] Applying mojo extractor for language: java
[INFO] Mojo extractor for language: java found 0 mojo descriptors.
[INFO] Applying mojo extractor for language: bsh
[INFO] Mojo extractor for language: bsh found 0 mojo descriptors.
[INFO] Applying mojo extractor for language: java-annotations
[INFO] Mojo extractor for language: java-annotations found 3 mojo descriptors.
[INFO] 
[INFO] --- maven-resources-plugin:2.6:testResources (default-testResources) @ maven-gpg-plugin
---
[INFO] Using 'UTF-8' encoding to copy filtered resources.
[INFO] Copying 8 resources
[INFO] Copying 3 resources
[INFO] 
[INFO] --- maven-compiler-plugin:3.0:testCompile (default-testCompile) @ maven-gpg-plugin
---
[INFO] No sources to compile
[INFO] 
[INFO] --- maven-surefire-plugin:2.12.4:test (default-test) @ maven-gpg-plugin ---
[INFO] 
[INFO] --- maven-jar-plugin:2.4:jar (default-jar) @ maven-gpg-plugin ---
[INFO] Building jar: <https://builds.apache.org/job/maven-plugins-ITs-m3.0.3/ws/maven-gpg-plugin/target/maven-gpg-plugin-1.5-SNAPSHOT.jar>
[INFO] 
[INFO] --- maven-plugin-plugin:3.2:addPluginArtifactMetadata (default-addPluginArtifactMetadata)
@ maven-gpg-plugin ---
[INFO] 
[INFO] --- maven-invoker-plugin:1.7:install (integration-test) @ maven-gpg-plugin ---
[INFO] Installing <https://builds.apache.org/job/maven-plugins-ITs-m3.0.3/ws/maven-gpg-plugin/pom.xml>
to <https://builds.apache.org/job/maven-plugins-ITs-m3.0.3/ws/maven-gpg-plugin/target/local-repo/org/apache/maven/plugins/maven-gpg-plugin/1.5-SNAPSHOT/maven-gpg-plugin-1.5-SNAPSHOT.pom>
[INFO] Installing <https://builds.apache.org/job/maven-plugins-ITs-m3.0.3/ws/maven-gpg-plugin/target/maven-gpg-plugin-1.5-SNAPSHOT.jar>
to <https://builds.apache.org/job/maven-plugins-ITs-m3.0.3/ws/maven-gpg-plugin/target/local-repo/org/apache/maven/plugins/maven-gpg-plugin/1.5-SNAPSHOT/maven-gpg-plugin-1.5-SNAPSHOT.jar>
[INFO] 
[INFO] --- maven-invoker-plugin:1.7:integration-test (integration-test) @ maven-gpg-plugin
---
[INFO] Building: sign-release/pom.xml
[INFO] run script verify.bsh
[INFO] ..SUCCESS (3.2 s)
[INFO] Building: no-main-artifact/pom.xml
[INFO] run script verify.bsh
[INFO] ..SUCCESS (2.5 s)
[INFO] Building: alternative-secret-keyring/pom.xml
[INFO] run script verify.bsh
[INFO] ..SUCCESS (2.4 s)
[INFO] 
[INFO] --- maven-invoker-plugin:1.7:verify (integration-test) @ maven-gpg-plugin ---
[INFO] -------------------------------------------------
[INFO] Build Summary:
[INFO]   Passed: 3, Failed: 0, Errors: 0, Skipped: 0
[INFO] -------------------------------------------------
[INFO] 
[INFO] --- maven-install-plugin:2.3.1:install (default-install) @ maven-gpg-plugin ---
[INFO] Installing <https://builds.apache.org/job/maven-plugins-ITs-m3.0.3/ws/maven-gpg-plugin/target/maven-gpg-plugin-1.5-SNAPSHOT.jar>
to /home/jenkins/.m2/repository/org/apache/maven/plugins/maven-gpg-plugin/1.5-SNAPSHOT/maven-gpg-plugin-1.5-SNAPSHOT.jar
[INFO] Installing <https://builds.apache.org/job/maven-plugins-ITs-m3.0.3/ws/maven-gpg-plugin/pom.xml>
to /home/jenkins/.m2/repository/org/apache/maven/plugins/maven-gpg-plugin/1.5-SNAPSHOT/maven-gpg-plugin-1.5-SNAPSHOT.pom
[INFO]                                                                         
[INFO] ------------------------------------------------------------------------
[INFO] Building Apache Maven Plugins Aggregator 1-SNAPSHOT
[INFO] ------------------------------------------------------------------------
[INFO] 
[INFO] --- maven-clean-plugin:2.4.1:clean (default-clean) @ maven-plugins-aggregator ---
[INFO] Deleting <https://builds.apache.org/job/maven-plugins-ITs-m3.0.3/ws/target>
[INFO] 
[INFO] --- maven-remote-resources-plugin:1.1:process (default) @ maven-plugins-aggregator
---
[INFO] Setting property: classpath.resource.loader.class => 'org.codehaus.plexus.velocity.ContextClassLoaderResourceLoader'.
[INFO] Setting property: velocimacro.messages.on => 'false'.
[INFO] Setting property: resource.loader => 'classpath'.
[INFO] Setting property: resource.manager.logwhenfound => 'false'.
[INFO] 
[INFO] --- maven-install-plugin:2.3.1:install (default-install) @ maven-plugins-aggregator
---
[INFO] Installing <https://builds.apache.org/job/maven-plugins-ITs-m3.0.3/ws/pom.xml>
to /home/jenkins/.m2/repository/org/apache/maven/plugins/maven-plugins-aggregator/1-SNAPSHOT/maven-plugins-aggregator-1-SNAPSHOT.pom
[INFO] ------------------------------------------------------------------------
[INFO] Reactor Summary:
[INFO] 
[INFO] Apache Maven Plugins .............................. SUCCESS [8.528s]
[INFO] Apache Maven ACR Plugin ........................... SUCCESS [28.712s]
[INFO] Apache Maven Ant Plugin ........................... SUCCESS [1:12.521s]
[INFO] Apache Maven AntRun Plugin ........................ SUCCESS [55.773s]
[INFO] Apache Maven Eclipse Plugin ....................... SUCCESS [6:45.571s]
[INFO] Apache Maven Assembly Plugin ...................... SUCCESS [11:05.543s]
[INFO] Apache Maven Changelog Plugin ..................... SUCCESS [51.785s]
[INFO] Apache Maven Changes Plugin ....................... SUCCESS [1:17.301s]
[INFO] Apache Maven Checkstyle Plugin .................... SUCCESS [2:01.403s]
[INFO] Apache Maven Clean Plugin ......................... SUCCESS [21.394s]
[INFO] Apache Maven Compiler Plugin ...................... SUCCESS [1:28.121s]
[INFO] Apache Maven Dependency Plugin .................... SUCCESS [3:17.678s]
[INFO] Apache Maven Deploy Plugin ........................ SUCCESS [1:15.156s]
[INFO] Apache Maven DOAP Plugin .......................... SUCCESS [25.698s]
[INFO] Apache Maven Documentation Checker Plugin ......... SUCCESS [6.579s]
[INFO] Apache Maven EAR Plugin ........................... SUCCESS [3:55.945s]
[INFO] Apache Maven EJB Plugin ........................... SUCCESS [29.777s]
[INFO] Apache Maven Help Plugin .......................... SUCCESS [44.375s]
[INFO] Apache Maven Install Plugin ....................... SUCCESS [59.016s]
[INFO] Apache Maven JAR Plugin ........................... SUCCESS [1:14.273s]
[INFO] Apache Maven Jarsigner Plugin ..................... SUCCESS [24.542s]
[INFO] Apache Maven Javadoc Plugin ....................... SUCCESS [3:11.627s]
[INFO] Apache Maven Linkcheck Plugin ..................... SUCCESS [3.305s]
[INFO] Apache Maven Patch Plugin ......................... SUCCESS [15.397s]
[INFO] Apache Maven PDF Plugin ........................... SUCCESS [1:22.177s]
[INFO] Apache Maven PMD Plugin ........................... SUCCESS [1:49.947s]
[INFO] Apache Maven RAR Plugin ........................... SUCCESS [12.476s]
[INFO] Apache Maven Reactor Plugin ....................... SUCCESS [3.181s]
[INFO] Apache Maven Repository Plugin .................... SUCCESS [35.471s]
[INFO] Apache Maven Resources Plugin ..................... SUCCESS [56.136s]
[INFO] Apache Maven Site Plugin 3 ........................ SUCCESS [7:18.460s]
[INFO] Apache Maven Source Plugin ........................ SUCCESS [50.557s]
[INFO] Apache Maven Stage Plugin ......................... SUCCESS [3.433s]
[INFO] Apache Maven Toolchains Plugin .................... SUCCESS [1.682s]
[INFO] Apache Maven Verifier Plugin ...................... SUCCESS [16.653s]
[INFO] Apache Maven WAR Plugin ........................... SUCCESS [1:24.584s]
[INFO] Apache Maven SCM Publish Plugin ................... SUCCESS [54.471s]
[INFO] Apache Maven Invoker Plugin ....................... SUCCESS [4:51.829s]
[INFO] Apache Maven Project Info Reports Plugin .......... FAILURE [17.643s]
[INFO] Apache Maven Remote Resources Plugin .............. SUCCESS [55.387s]
[INFO] Apache Maven Shade Plugin ......................... FAILURE [15.973s]
[INFO] Apache Maven GPG Plugin ........................... SUCCESS [10.578s]
[INFO] Apache Maven Plugins Aggregator ................... SUCCESS [0.513s]
[INFO] ------------------------------------------------------------------------
[INFO] BUILD FAILURE
[INFO] ------------------------------------------------------------------------
[INFO] Total time: 1:05:23.058s
[INFO] Finished at: Sat Oct 19 16:25:17 UTC 2013
[INFO] Final Memory: 85M/339M
[INFO] ------------------------------------------------------------------------
[WARNING] The requested profile "apache.snapshots" could not be activated because it does
not exist.
[ERROR] Failed to execute goal org.apache.maven.plugins:maven-surefire-plugin:2.12.4:test
(default-test) on project maven-project-info-reports-plugin: There are test failures.
[ERROR] 
[ERROR] Please refer to <https://builds.apache.org/job/maven-plugins-ITs-m3.0.3/ws/maven-project-info-reports-plugin/target/surefire-reports>
for the individual test results.
[ERROR] -> [Help 1]
[ERROR] Failed to execute goal org.apache.maven.plugins:maven-invoker-plugin:1.8:install (integration-test)
on project maven-shade-plugin: Failed to install project dependencies: MavenProject: org.apache.maven.plugins:maven-shade-plugin:2.2-SNAPSHOT
@ <https://builds.apache.org/job/maven-plugins-ITs-m3.0.3/ws/maven-shade-plugin/pom.xml>:
Failed to install project artifacts: MavenProject: org.apache.maven.plugins:maven-project-info-reports-plugin:2.8-SNAPSHOT
@ <https://builds.apache.org/job/maven-plugins-ITs-m3.0.3/ws/maven-project-info-reports-plugin/pom.xml>:
Failed to install artifact: org.apache.maven.plugins:maven-project-info-reports-plugin:maven-plugin:2.8-SNAPSHOT:
Artifact is not fully assembled: <https://builds.apache.org/job/maven-plugins-ITs-m3.0.3/ws/maven-project-info-reports-plugin/target/classes>
-> [Help 2]
[ERROR] 
[ERROR] To see the full stack trace of the errors, re-run Maven with the -e switch.
[ERROR] Re-run Maven using the -X switch to enable full debug logging.
[ERROR] 
[ERROR] For more information about the errors and possible solutions, please read the following
articles:
[ERROR] [Help 1] http://cwiki.apache.org/confluence/display/MAVEN/MojoFailureException
[ERROR] [Help 2] http://cwiki.apache.org/confluence/display/MAVEN/MojoExecutionException
[ERROR] 
[ERROR] After correcting the problems, you can resume the build with the command
[ERROR]   mvn <goals> -rf :maven-project-info-reports-plugin
Build step 'Invoke top-level Maven targets' marked build as failure
Recording test results

Mime
View raw message