maven-notifications mailing list archives

Site index · List index
Message view « Date » · « Thread »
Top « Date » · « Thread »
From Apache Jenkins Server <jenk...@builds.apache.org>
Subject Build failed in Jenkins: doxia » JDK 1.6 (latest),Ubuntu #142
Date Mon, 21 Oct 2013 21:52:43 GMT
See <https://builds.apache.org/job/doxia/jdk=JDK%201.6%20(latest),label=Ubuntu/142/changes>

Changes:

[hboutemy] [DOXIA-499][DOXIASITETOOLS-84] moved o.a.m.doxia.sink.render.RenderingContext from
Doxia core to Doxia Site Renderer

------------------------------------------
[...truncated 1115 lines...]
[INFO] outputDirectory: <https://builds.apache.org/job/doxia/jdk=JDK%201.6%20(latest),label=Ubuntu/ws/doxia-core/target/generated-sources/modello>
[INFO] Working on model: src/main/mdo/document.mdo
[INFO] Generating current version: 1.0.1
[INFO] [modello:xpp3-writer {execution: descriptor}]
[INFO] outputDirectory: <https://builds.apache.org/job/doxia/jdk=JDK%201.6%20(latest),label=Ubuntu/ws/doxia-core/target/generated-sources/modello>
[INFO] Working on model: src/main/mdo/document.mdo
[INFO] Generating current version: 1.0.1
[INFO] [modello:xsd {execution: descriptor}]
[INFO] outputDirectory: <https://builds.apache.org/job/doxia/jdk=JDK%201.6%20(latest),label=Ubuntu/ws/doxia-core/target/generated-site/xsd>
[INFO] Working on model: src/main/mdo/document.mdo
[INFO] Generating current version: 1.0.1
[INFO] [remote-resources:process {execution: default}]
[INFO] [resources:resources {execution: default-resources}]
[INFO] Using 'UTF-8' encoding to copy filtered resources.
[INFO] Copying 1 resource
[INFO] Copying 3 resources
[INFO] [compiler:compile {execution: default-compile}]
[INFO] Changes detected - recompiling the module!
[INFO] Compiling 63 source files to <https://builds.apache.org/job/doxia/jdk=JDK%201.6%20(latest),label=Ubuntu/ws/doxia-core/target/classes>
[WARNING] Note: Some input files use or override a deprecated API.
[WARNING] Note: Recompile with -Xlint:deprecation for details.
[WARNING] Note: <https://builds.apache.org/job/doxia/jdk=JDK%201.6%20(latest),label=Ubuntu/ws/doxia-core/target/generated-sources/modello/org/apache/maven/doxia/document/io/xpp3/DocumentXpp3Reader.java>
uses unchecked or unsafe operations.
[WARNING] Note: Recompile with -Xlint:unchecked for details.
[INFO] [plexus-component-metadata:generate-metadata {execution: default}]
[INFO] Discovered 8 component descriptors(s)
[INFO] [resources:testResources {execution: default-testResources}]
[INFO] Using 'UTF-8' encoding to copy filtered resources.
[INFO] Copying 2 resources
[INFO] Copying 3 resources
[INFO] [compiler:testCompile {execution: default-testCompile}]
[INFO] Changes detected - recompiling the module!
[INFO] Compiling 30 source files to <https://builds.apache.org/job/doxia/jdk=JDK%201.6%20(latest),label=Ubuntu/ws/doxia-core/target/test-classes>
[WARNING] Note: Some input files use or override a deprecated API.
[WARNING] Note: Recompile with -Xlint:deprecation for details.
[INFO] [surefire:test {execution: default-test}]
[INFO] Surefire report directory: <https://builds.apache.org/job/doxia/jdk=JDK%201.6%20(latest),label=Ubuntu/ws/doxia-core/target/surefire-reports>

-------------------------------------------------------
 T E S T S
-------------------------------------------------------
Running org.apache.maven.doxia.macro.snippet.SnippetMacroTest
Tests run: 2, Failures: 0, Errors: 0, Skipped: 0, Time elapsed: 1.891 sec
Running org.apache.maven.doxia.macro.EchoMacroTest
Tests run: 2, Failures: 0, Errors: 0, Skipped: 0, Time elapsed: 0.001 sec
Running org.apache.maven.doxia.macro.SwfMacroTest
Tests run: 2, Failures: 0, Errors: 0, Skipped: 0, Time elapsed: 0 sec
Running org.apache.maven.doxia.macro.toc.TocMacroTest
[warn] Unrecognized xml tag: <div> at [1:5]
[warn] Unrecognized xml tag: <div> at [1:5]
[warn] Unrecognized xml tag: <div> at [1:5]
Tests run: 2, Failures: 0, Errors: 0, Skipped: 0, Time elapsed: 0.03 sec
Running org.apache.maven.doxia.macro.manager.MacroManagerTest
Tests run: 1, Failures: 0, Errors: 0, Skipped: 0, Time elapsed: 0.025 sec
Running org.apache.maven.doxia.util.DoxiaUtilsTest
Tests run: 6, Failures: 0, Errors: 0, Skipped: 0, Time elapsed: 0.099 sec
Running org.apache.maven.doxia.util.ByLineReaderSourceTest
Tests run: 1, Failures: 0, Errors: 0, Skipped: 0, Time elapsed: 0 sec
Running org.apache.maven.doxia.util.HtmlToolsTest
Tests run: 6, Failures: 0, Errors: 0, Skipped: 0, Time elapsed: 0.072 sec
Running org.apache.maven.doxia.sink.AbstractXmlSinkTest
Tests run: 4, Failures: 0, Errors: 0, Skipped: 0, Time elapsed: 0.003 sec
Running org.apache.maven.doxia.sink.SinkUtilsTest
Tests run: 2, Failures: 0, Errors: 0, Skipped: 0, Time elapsed: 0.001 sec
Running org.apache.maven.doxia.sink.RandomAccessSinkTest
Tests run: 2, Failures: 0, Errors: 0, Skipped: 0, Time elapsed: 0.005 sec
Running org.apache.maven.doxia.sink.SinkAdapterTest
Tests run: 51, Failures: 0, Errors: 0, Skipped: 0, Time elapsed: 0.018 sec
Running org.apache.maven.doxia.sink.SinkEventAttributeSetTest
Tests run: 17, Failures: 0, Errors: 0, Skipped: 0, Time elapsed: 0.005 sec
Running org.apache.maven.doxia.sink.XhtmlBaseSinkTest
[warn] [XHTML Sink] No type information for unknown event: 'unknown', ignoring!
Tests run: 34, Failures: 0, Errors: 0, Skipped: 0, Time elapsed: 0.016 sec
Running org.apache.maven.doxia.document.DocumentModelTest
Tests run: 1, Failures: 0, Errors: 0, Skipped: 0, Time elapsed: 0.051 sec
Running org.apache.maven.doxia.index.IndexEntryTest
Tests run: 1, Failures: 0, Errors: 0, Skipped: 0, Time elapsed: 0 sec
Running org.apache.maven.doxia.parser.XhtmlBaseParserTest
Tests run: 23, Failures: 0, Errors: 0, Skipped: 0, Time elapsed: 0.224 sec

Results :

Tests run: 157, Failures: 0, Errors: 0, Skipped: 0

[INFO] [jar:jar {execution: default-jar}]
[INFO] Building jar: <https://builds.apache.org/job/doxia/jdk=JDK%201.6%20(latest),label=Ubuntu/ws/doxia-core/target/doxia-core-1.5-SNAPSHOT.jar>
[INFO] [jar:test-jar {execution: default}]
[INFO] Building jar: <https://builds.apache.org/job/doxia/jdk=JDK%201.6%20(latest),label=Ubuntu/ws/doxia-core/target/doxia-core-1.5-SNAPSHOT-tests.jar>
[INFO] Preparing clirr:check
[WARNING] Removing: check from forked lifecycle, to prevent recursive invocation.
[INFO] [modello:java {execution: descriptor}]
[INFO] outputDirectory: <https://builds.apache.org/job/doxia/jdk=JDK%201.6%20(latest),label=Ubuntu/ws/doxia-core/target/generated-sources/modello>
[INFO] Working on model: src/main/mdo/document.mdo
[INFO] Generating current version: 1.0.1
[INFO] [modello:xpp3-reader {execution: descriptor}]
[INFO] outputDirectory: <https://builds.apache.org/job/doxia/jdk=JDK%201.6%20(latest),label=Ubuntu/ws/doxia-core/target/generated-sources/modello>
[INFO] Working on model: src/main/mdo/document.mdo
[INFO] Generating current version: 1.0.1
[INFO] [modello:xpp3-writer {execution: descriptor}]
[INFO] outputDirectory: <https://builds.apache.org/job/doxia/jdk=JDK%201.6%20(latest),label=Ubuntu/ws/doxia-core/target/generated-sources/modello>
[INFO] Working on model: src/main/mdo/document.mdo
[INFO] Generating current version: 1.0.1
[INFO] [modello:xsd {execution: descriptor}]
[INFO] outputDirectory: <https://builds.apache.org/job/doxia/jdk=JDK%201.6%20(latest),label=Ubuntu/ws/doxia-core/target/generated-site/xsd>
[INFO] Working on model: src/main/mdo/document.mdo
[INFO] Generating current version: 1.0.1
[INFO] [remote-resources:process {execution: default}]
[INFO] [resources:resources {execution: default-resources}]
[INFO] Using 'UTF-8' encoding to copy filtered resources.
[INFO] Copying 1 resource
[INFO] Copying 3 resources
[INFO] Copying 3 resources
[INFO] [compiler:compile {execution: default-compile}]
[INFO] Changes detected - recompiling the module!
[INFO] Compiling 63 source files to <https://builds.apache.org/job/doxia/jdk=JDK%201.6%20(latest),label=Ubuntu/ws/doxia-core/target/classes>
[WARNING] Note: Some input files use or override a deprecated API.
[WARNING] Note: Recompile with -Xlint:deprecation for details.
[WARNING] Note: <https://builds.apache.org/job/doxia/jdk=JDK%201.6%20(latest),label=Ubuntu/ws/doxia-core/target/generated-sources/modello/org/apache/maven/doxia/document/io/xpp3/DocumentXpp3Reader.java>
uses unchecked or unsafe operations.
[WARNING] Note: Recompile with -Xlint:unchecked for details.
[INFO] [clirr:check {execution: default}]
[INFO] artifact org.apache.maven.doxia:doxia-core: checking for updates from central
[INFO] Comparing to version: 1.4
[ERROR] org.apache.maven.doxia.sink.render.RenderingContext: Class org.apache.maven.doxia.sink.render.RenderingContext
removed
[INFO] ------------------------------------------------------------------------
[INFO] SKIPPING Doxia :: Modules
[INFO]    task-segment: [clean, install]
[INFO] This project has been banned from further executions due to previous failures.
[INFO] ------------------------------------------------------------------------
[INFO] ------------------------------------------------------------------------
[INFO] SKIPPING Doxia :: APT Module
[INFO]    task-segment: [clean, install]
[INFO] This project has been banned from further executions due to previous failures.
[INFO] ------------------------------------------------------------------------
[INFO] ------------------------------------------------------------------------
[INFO] SKIPPING Doxia :: Confluence Module
[INFO]    task-segment: [clean, install]
[INFO] This project has been banned from further executions due to previous failures.
[INFO] ------------------------------------------------------------------------
[INFO] ------------------------------------------------------------------------
[INFO] SKIPPING Doxia :: Simplified DocBook Module
[INFO]    task-segment: [clean, install]
[INFO] This project has been banned from further executions due to previous failures.
[INFO] ------------------------------------------------------------------------
[INFO] ------------------------------------------------------------------------
[INFO] SKIPPING Doxia :: FML Module
[INFO]    task-segment: [clean, install]
[INFO] This project has been banned from further executions due to previous failures.
[INFO] ------------------------------------------------------------------------
[INFO] ------------------------------------------------------------------------
[INFO] SKIPPING Doxia :: FO Module
[INFO]    task-segment: [clean, install]
[INFO] This project has been banned from further executions due to previous failures.
[INFO] ------------------------------------------------------------------------
[INFO] ------------------------------------------------------------------------
[INFO] SKIPPING Doxia :: iText Module
[INFO]    task-segment: [clean, install]
[INFO] This project has been banned from further executions due to previous failures.
[INFO] ------------------------------------------------------------------------
[INFO] ------------------------------------------------------------------------
[INFO] SKIPPING Doxia :: Latex Module
[INFO]    task-segment: [clean, install]
[INFO] This project has been banned from further executions due to previous failures.
[INFO] ------------------------------------------------------------------------
[INFO] ------------------------------------------------------------------------
[INFO] SKIPPING Doxia :: RTF Module
[INFO]    task-segment: [clean, install]
[INFO] This project has been banned from further executions due to previous failures.
[INFO] ------------------------------------------------------------------------
[INFO] ------------------------------------------------------------------------
[INFO] SKIPPING Doxia :: TWiki Module
[INFO]    task-segment: [clean, install]
[INFO] This project has been banned from further executions due to previous failures.
[INFO] ------------------------------------------------------------------------
[INFO] ------------------------------------------------------------------------
[INFO] SKIPPING Doxia :: XDoc Module
[INFO]    task-segment: [clean, install]
[INFO] This project has been banned from further executions due to previous failures.
[INFO] ------------------------------------------------------------------------
[INFO] ------------------------------------------------------------------------
[INFO] SKIPPING Doxia :: XHTML Module
[INFO]    task-segment: [clean, install]
[INFO] This project has been banned from further executions due to previous failures.
[INFO] ------------------------------------------------------------------------
[INFO] ------------------------------------------------------------------------
[INFO] SKIPPING Doxia :: Markdown Module
[INFO]    task-segment: [clean, install]
[INFO] This project has been banned from further executions due to previous failures.
[INFO] ------------------------------------------------------------------------
[INFO] 
[INFO] 
[INFO] ------------------------------------------------------------------------
[INFO] Reactor Summary:
[INFO] ------------------------------------------------------------------------
[INFO] Doxia ................................................. SUCCESS [9.977s]
[INFO] Doxia :: Logging API .................................. SUCCESS [5.160s]
[INFO] Doxia :: Sink API ..................................... SUCCESS [0.416s]
[INFO] Doxia :: Test Documents ............................... SUCCESS [0.661s]
[INFO] Doxia :: Core ......................................... FAILED [8.140s]
[INFO] Doxia :: Modules ...................................... SKIPPED (dependency build failed
or was skipped)
[INFO] Doxia :: APT Module ................................... SKIPPED (dependency build failed
or was skipped)
[INFO] Doxia :: Confluence Module ............................ SKIPPED (dependency build failed
or was skipped)
[INFO] Doxia :: Simplified DocBook Module .................... SKIPPED (dependency build failed
or was skipped)
[INFO] Doxia :: FML Module ................................... SKIPPED (dependency build failed
or was skipped)
[INFO] Doxia :: FO Module .................................... SKIPPED (dependency build failed
or was skipped)
[INFO] Doxia :: iText Module ................................. SKIPPED (dependency build failed
or was skipped)
[INFO] Doxia :: Latex Module ................................. SKIPPED (dependency build failed
or was skipped)
[INFO] Doxia :: RTF Module ................................... SKIPPED (dependency build failed
or was skipped)
[INFO] Doxia :: TWiki Module ................................. SKIPPED (dependency build failed
or was skipped)
[INFO] Doxia :: XDoc Module .................................. SKIPPED (dependency build failed
or was skipped)
[INFO] Doxia :: XHTML Module ................................. SKIPPED (dependency build failed
or was skipped)
[INFO] Doxia :: Markdown Module .............................. SKIPPED (dependency build failed
or was skipped)
[INFO] ------------------------------------------------------------------------
[INFO] Error for project: Doxia :: Core (during install)
[INFO] ------------------------------------------------------------------------
[INFO] There was 1 error.
[INFO] ------------------------------------------------------------------------
[INFO] Trace
org.apache.maven.BuildFailureException: There was 1 error.
	at org.apache.maven.lifecycle.DefaultLifecycleExecutor.executeGoals(DefaultLifecycleExecutor.java:715)
	at org.apache.maven.lifecycle.DefaultLifecycleExecutor.executeGoalWithLifecycle(DefaultLifecycleExecutor.java:556)
	at org.apache.maven.lifecycle.DefaultLifecycleExecutor.executeGoal(DefaultLifecycleExecutor.java:535)
	at org.apache.maven.lifecycle.DefaultLifecycleExecutor.executeGoalAndHandleFailures(DefaultLifecycleExecutor.java:387)
	at org.apache.maven.lifecycle.DefaultLifecycleExecutor.executeTaskSegments(DefaultLifecycleExecutor.java:348)
	at org.apache.maven.lifecycle.DefaultLifecycleExecutor.execute(DefaultLifecycleExecutor.java:180)
	at org.apache.maven.DefaultMaven.doExecute(DefaultMaven.java:328)
	at org.apache.maven.DefaultMaven.execute(DefaultMaven.java:138)
	at org.apache.maven.cli.MavenCli.main(MavenCli.java:362)
	at org.apache.maven.cli.compat.CompatibleMain.main(CompatibleMain.java:60)
	at sun.reflect.NativeMethodAccessorImpl.invoke0(Native Method)
	at sun.reflect.NativeMethodAccessorImpl.invoke(NativeMethodAccessorImpl.java:39)
	at sun.reflect.DelegatingMethodAccessorImpl.invoke(DelegatingMethodAccessorImpl.java:25)
	at java.lang.reflect.Method.invoke(Method.java:597)
	at org.codehaus.classworlds.Launcher.launchEnhanced(Launcher.java:315)
	at org.codehaus.classworlds.Launcher.launch(Launcher.java:255)
	at org.codehaus.classworlds.Launcher.mainWithExitCode(Launcher.java:430)
	at org.codehaus.classworlds.Launcher.main(Launcher.java:375)
Caused by: org.apache.maven.plugin.MojoFailureException: There was 1 error.
	at org.codehaus.mojo.clirr.AbstractClirrCheckMojo.doExecute(AbstractClirrCheckMojo.java:101)
	at org.codehaus.mojo.clirr.AbstractClirrMojo.execute(AbstractClirrMojo.java:200)
	at org.apache.maven.plugin.DefaultPluginManager.executeMojo(DefaultPluginManager.java:490)
	at org.apache.maven.lifecycle.DefaultLifecycleExecutor.executeGoals(DefaultLifecycleExecutor.java:694)
	... 17 more
[INFO] ------------------------------------------------------------------------
[INFO] BUILD ERRORS
[INFO] ------------------------------------------------------------------------
[INFO] Total time: 26 seconds
[INFO] Finished at: Mon Oct 21 21:52:43 UTC 2013
[INFO] Final Memory: 68M/307M
[INFO] ------------------------------------------------------------------------
Build step 'Invoke top-level Maven targets' marked build as failure

Mime
View raw message