maven-notifications mailing list archives

Site index · List index
Message view « Date » · « Thread »
Top « Date » · « Thread »
From Apache Jenkins Server <jenk...@builds.apache.org>
Subject Build failed in Jenkins: core-it-maven-3-win #449
Date Thu, 31 Oct 2013 13:18:30 GMT
See <https://builds.apache.org/job/core-it-maven-3-win/449/changes>

Changes:

[igor] MNG-5530 Introduced mojo execution guice component scope

[igor] MNG-5530 Introduced IT for mojo execution guice scope

------------------------------------------
[...truncated 8461 lines...]
[INFO] Building mng5530-mojo-execution-scope-plugin 0.1
[INFO] ------------------------------------------------------------------------
[INFO] Downloading: http://repo1.maven.org/maven2/org/sonatype/plugins/sisu-maven-plugin/1.1/sisu-maven-plugin-1.1.pom
[INFO] Downloaded: http://repo1.maven.org/maven2/org/sonatype/plugins/sisu-maven-plugin/1.1/sisu-maven-plugin-1.1.pom
(6 KB at 17.1 KB/sec)
[INFO] Downloading: http://repo1.maven.org/maven2/org/sonatype/plugins/plugins-parent/6/plugins-parent-6.pom
[INFO] Downloaded: http://repo1.maven.org/maven2/org/sonatype/plugins/plugins-parent/6/plugins-parent-6.pom
(7 KB at 99.2 KB/sec)
[INFO] Downloading: http://repo1.maven.org/maven2/org/sonatype/plugins/sisu-maven-plugin/1.1/sisu-maven-plugin-1.1.jar
[INFO] Downloaded: http://repo1.maven.org/maven2/org/sonatype/plugins/sisu-maven-plugin/1.1/sisu-maven-plugin-1.1.jar
(13 KB at 67.4 KB/sec)
[INFO] Downloading: http://repo1.maven.org/maven2/org/apache/maven/plugins/maven-plugin-plugin/3.2/maven-plugin-plugin-3.2.pom
[INFO] Downloaded: http://repo1.maven.org/maven2/org/apache/maven/plugins/maven-plugin-plugin/3.2/maven-plugin-plugin-3.2.pom
(12 KB at 198.6 KB/sec)
[INFO] Downloading: http://repo1.maven.org/maven2/org/apache/maven/plugins/maven-plugin-plugin/3.2/maven-plugin-plugin-3.2.jar
[INFO] Downloaded: http://repo1.maven.org/maven2/org/apache/maven/plugins/maven-plugin-plugin/3.2/maven-plugin-plugin-3.2.jar
(47 KB at 424.6 KB/sec)
[INFO] Downloading: http://repo1.maven.org/maven2/org/apache/maven/plugins/maven-resources-plugin/2.6/maven-resources-plugin-2.6.pom
[INFO] Downloaded: http://repo1.maven.org/maven2/org/apache/maven/plugins/maven-resources-plugin/2.6/maven-resources-plugin-2.6.pom
(8 KB at 123.8 KB/sec)
[INFO] Downloading: http://repo1.maven.org/maven2/org/apache/maven/plugins/maven-resources-plugin/2.6/maven-resources-plugin-2.6.jar
[INFO] Downloaded: http://repo1.maven.org/maven2/org/apache/maven/plugins/maven-resources-plugin/2.6/maven-resources-plugin-2.6.jar
(29 KB at 236.3 KB/sec)
[INFO] Downloading: http://repo1.maven.org/maven2/org/apache/maven/plugins/maven-surefire-plugin/2.12.4/maven-surefire-plugin-2.12.4.pom
[INFO] Downloaded: http://repo1.maven.org/maven2/org/apache/maven/plugins/maven-surefire-plugin/2.12.4/maven-surefire-plugin-2.12.4.pom
(11 KB at 68.2 KB/sec)
[INFO] Downloading: http://repo1.maven.org/maven2/org/apache/maven/surefire/surefire/2.12.4/surefire-2.12.4.pom
[INFO] Downloaded: http://repo1.maven.org/maven2/org/apache/maven/surefire/surefire/2.12.4/surefire-2.12.4.pom
(14 KB at 164.2 KB/sec)
[INFO] Downloading: http://repo1.maven.org/maven2/org/apache/maven/plugins/maven-surefire-plugin/2.12.4/maven-surefire-plugin-2.12.4.jar
[INFO] Downloaded: http://repo1.maven.org/maven2/org/apache/maven/plugins/maven-surefire-plugin/2.12.4/maven-surefire-plugin-2.12.4.jar
(30 KB at 270.4 KB/sec)
[INFO] Downloading: http://repo1.maven.org/maven2/org/apache/maven/plugins/maven-install-plugin/2.4/maven-install-plugin-2.4.pom
[INFO] Downloaded: http://repo1.maven.org/maven2/org/apache/maven/plugins/maven-install-plugin/2.4/maven-install-plugin-2.4.pom
(7 KB at 73.3 KB/sec)
[INFO] Downloading: http://repo1.maven.org/maven2/org/apache/maven/plugins/maven-install-plugin/2.4/maven-install-plugin-2.4.jar
[INFO] Downloaded: http://repo1.maven.org/maven2/org/apache/maven/plugins/maven-install-plugin/2.4/maven-install-plugin-2.4.jar
(27 KB at 313.3 KB/sec)
[INFO] Downloading: http://repo1.maven.org/maven2/org/apache/maven/maven-plugin-api/3.1.2-SNAPSHOT/maven-metadata.xml
[INFO] Downloading: http://repo1.maven.org/maven2/org/apache/maven/maven-plugin-api/3.1.2-SNAPSHOT/maven-plugin-api-3.1.2-SNAPSHOT.pom
[WARNING] The POM for org.apache.maven:maven-plugin-api:jar:3.1.2-SNAPSHOT is missing, no
dependency information available
[INFO] Downloading: http://repo1.maven.org/maven2/org/apache/maven/maven-model/3.1.2-SNAPSHOT/maven-metadata.xml
[INFO] Downloading: http://repo1.maven.org/maven2/org/apache/maven/maven-model/3.1.2-SNAPSHOT/maven-model-3.1.2-SNAPSHOT.pom
[WARNING] The POM for org.apache.maven:maven-model:jar:3.1.2-SNAPSHOT is missing, no dependency
information available
[INFO] Downloading: http://repo1.maven.org/maven2/org/apache/maven/maven-core/3.1.2-SNAPSHOT/maven-metadata.xml
[INFO] Downloading: http://repo1.maven.org/maven2/org/apache/maven/maven-core/3.1.2-SNAPSHOT/maven-core-3.1.2-SNAPSHOT.pom
[WARNING] The POM for org.apache.maven:maven-core:jar:3.1.2-SNAPSHOT is missing, no dependency
information available
[INFO] Downloading: http://repo1.maven.org/maven2/org/apache/maven/maven-plugin-api/3.1.2-SNAPSHOT/maven-plugin-api-3.1.2-SNAPSHOT.jar
[INFO] Downloading: http://repo1.maven.org/maven2/org/apache/maven/maven-core/3.1.2-SNAPSHOT/maven-core-3.1.2-SNAPSHOT.jar
[INFO] Downloading: http://repo1.maven.org/maven2/org/apache/maven/maven-model/3.1.2-SNAPSHOT/maven-model-3.1.2-SNAPSHOT.jar
[INFO] ------------------------------------------------------------------------
[INFO] BUILD FAILURE
[INFO] ------------------------------------------------------------------------
[INFO] Total time: 5.060s
[INFO] Finished at: Thu Oct 31 12:39:50 GMT 2013
[INFO] Final Memory: 6M/736M
[INFO] ------------------------------------------------------------------------
[ERROR] Failed to execute goal on project mng5530-mojo-execution-scope-plugin: Could not resolve
dependencies for project io.tesla.its.mojoexecutionscope:mng5530-mojo-execution-scope-plugin:maven-plugin:0.1:
The following artifacts could not be resolved: org.apache.maven:maven-plugin-api:jar:3.1.2-SNAPSHOT,
org.apache.maven:maven-model:jar:3.1.2-SNAPSHOT, org.apache.maven:maven-core:jar:3.1.2-SNAPSHOT:
Could not find artifact org.apache.maven:maven-plugin-api:jar:3.1.2-SNAPSHOT in central (http://repo1.maven.org/maven2)
-> [Help 1]
org.apache.maven.lifecycle.LifecycleExecutionException: Failed to execute goal on project
mng5530-mojo-execution-scope-plugin: Could not resolve dependencies for project io.tesla.its.mojoexecutionscope:mng5530-mojo-execution-scope-plugin:maven-plugin:0.1:
The following artifacts could not be resolved: org.apache.maven:maven-plugin-api:jar:3.1.2-SNAPSHOT,
org.apache.maven:maven-model:jar:3.1.2-SNAPSHOT, org.apache.maven:maven-core:jar:3.1.2-SNAPSHOT:
Could not find artifact org.apache.maven:maven-plugin-api:jar:3.1.2-SNAPSHOT in central (http://repo1.maven.org/maven2)
	at org.apache.maven.lifecycle.internal.LifecycleDependencyResolver.getDependencies(LifecycleDependencyResolver.java:220)
	at org.apache.maven.lifecycle.internal.LifecycleDependencyResolver.resolveProjectDependencies(LifecycleDependencyResolver.java:127)
	at org.apache.maven.lifecycle.internal.MojoExecutor.ensureDependenciesAreResolved(MojoExecutor.java:257)
	at org.apache.maven.lifecycle.internal.MojoExecutor.execute(MojoExecutor.java:200)
	at org.apache.maven.lifecycle.internal.MojoExecutor.execute(MojoExecutor.java:153)
	at org.apache.maven.lifecycle.internal.MojoExecutor.execute(MojoExecutor.java:145)
	at org.apache.maven.lifecycle.internal.LifecycleModuleBuilder.buildProject(LifecycleModuleBuilder.java:84)
	at org.apache.maven.lifecycle.internal.LifecycleModuleBuilder.buildProject(LifecycleModuleBuilder.java:59)
	at org.apache.maven.lifecycle.internal.LifecycleStarter.singleThreadedBuild(LifecycleStarter.java:183)
	at org.apache.maven.lifecycle.internal.LifecycleStarter.execute(LifecycleStarter.java:161)
	at org.apache.maven.DefaultMaven.doExecute(DefaultMaven.java:317)
	at org.apache.maven.DefaultMaven.execute(DefaultMaven.java:152)
	at org.apache.maven.cli.MavenCli.execute(MavenCli.java:555)
	at org.apache.maven.cli.MavenCli.doMain(MavenCli.java:214)
	at org.apache.maven.cli.MavenCli.main(MavenCli.java:158)
	at sun.reflect.NativeMethodAccessorImpl.invoke0(Native Method)
	at sun.reflect.NativeMethodAccessorImpl.invoke(NativeMethodAccessorImpl.java:39)
	at sun.reflect.DelegatingMethodAccessorImpl.invoke(DelegatingMethodAccessorImpl.java:25)
	at java.lang.reflect.Method.invoke(Method.java:597)
	at org.codehaus.plexus.classworlds.launcher.Launcher.launchEnhanced(Launcher.java:289)
	at org.codehaus.plexus.classworlds.launcher.Launcher.launch(Launcher.java:229)
	at org.codehaus.plexus.classworlds.launcher.Launcher.mainWithExitCode(Launcher.java:415)
	at org.codehaus.plexus.classworlds.launcher.Launcher.main(Launcher.java:356)
Caused by: org.apache.maven.project.DependencyResolutionException: Could not resolve dependencies
for project io.tesla.its.mojoexecutionscope:mng5530-mojo-execution-scope-plugin:maven-plugin:0.1:
The following artifacts could not be resolved: org.apache.maven:maven-plugin-api:jar:3.1.2-SNAPSHOT,
org.apache.maven:maven-model:jar:3.1.2-SNAPSHOT, org.apache.maven:maven-core:jar:3.1.2-SNAPSHOT:
Could not find artifact org.apache.maven:maven-plugin-api:jar:3.1.2-SNAPSHOT in central (http://repo1.maven.org/maven2)
	at org.apache.maven.project.DefaultProjectDependenciesResolver.resolve(DefaultProjectDependenciesResolver.java:198)
	at org.apache.maven.lifecycle.internal.LifecycleDependencyResolver.getDependencies(LifecycleDependencyResolver.java:195)
	... 22 more
Caused by: org.eclipse.aether.resolution.DependencyResolutionException: The following artifacts
could not be resolved: org.apache.maven:maven-plugin-api:jar:3.1.2-SNAPSHOT, org.apache.maven:maven-model:jar:3.1.2-SNAPSHOT,
org.apache.maven:maven-core:jar:3.1.2-SNAPSHOT: Could not find artifact org.apache.maven:maven-plugin-api:jar:3.1.2-SNAPSHOT
in central (http://repo1.maven.org/maven2)
	at org.eclipse.aether.internal.impl.DefaultRepositorySystem.resolveDependencies(DefaultRepositorySystem.java:384)
	at org.apache.maven.project.DefaultProjectDependenciesResolver.resolve(DefaultProjectDependenciesResolver.java:192)
	... 23 more
Caused by: org.eclipse.aether.resolution.ArtifactResolutionException: The following artifacts
could not be resolved: org.apache.maven:maven-plugin-api:jar:3.1.2-SNAPSHOT, org.apache.maven:maven-model:jar:3.1.2-SNAPSHOT,
org.apache.maven:maven-core:jar:3.1.2-SNAPSHOT: Could not find artifact org.apache.maven:maven-plugin-api:jar:3.1.2-SNAPSHOT
in central (http://repo1.maven.org/maven2)
	at org.eclipse.aether.internal.impl.DefaultArtifactResolver.resolve(DefaultArtifactResolver.java:459)
	at org.eclipse.aether.internal.impl.DefaultArtifactResolver.resolveArtifacts(DefaultArtifactResolver.java:262)
	at org.eclipse.aether.internal.impl.DefaultRepositorySystem.resolveDependencies(DefaultRepositorySystem.java:367)
	... 24 more
Caused by: org.eclipse.aether.transfer.ArtifactNotFoundException: Could not find artifact
org.apache.maven:maven-plugin-api:jar:3.1.2-SNAPSHOT in central (http://repo1.maven.org/maven2)
	at org.eclipse.aether.connector.wagon.WagonRepositoryConnector$6.wrap(WagonRepositoryConnector.java:1012)
	at org.eclipse.aether.connector.wagon.WagonRepositoryConnector$6.wrap(WagonRepositoryConnector.java:1004)
	at org.eclipse.aether.connector.wagon.WagonRepositoryConnector$GetTask.run(WagonRepositoryConnector.java:725)
	at org.eclipse.aether.util.concurrency.RunnableErrorForwarder$1.run(RunnableErrorForwarder.java:67)
	at java.util.concurrent.ThreadPoolExecutor$Worker.runTask(ThreadPoolExecutor.java:886)
	at java.util.concurrent.ThreadPoolExecutor$Worker.run(ThreadPoolExecutor.java:908)
	at java.lang.Thread.run(Thread.java:662)
[ERROR] 
[ERROR] Re-run Maven using the -X switch to enable full debug logging.
[ERROR] 
[ERROR] For more information about the errors and possible solutions, please read the following
articles:
[ERROR] [Help 1] http://cwiki.apache.org/confluence/display/MAVEN/DependencyResolutionException

	at org.apache.maven.it.Verifier.executeGoals(Verifier.java:1384)
	at org.apache.maven.it.Verifier.executeGoal(Verifier.java:1228)
	at org.apache.maven.it.Verifier.executeGoal(Verifier.java:1222)
	at org.apache.maven.it.MavenITmng5530MojoExecutionScopeTest.test_copyfiles(MavenITmng5530MojoExecutionScopeTest.java:45)

testit(org.apache.maven.it.MavenITmng4625SettingsXmlInterpolationWithXmlMarkupTest)  Time
elapsed: 0.151 sec  <<< ERROR!
org.apache.maven.it.VerificationException: Exit code was non-zero: 1; command line and log
= 
<https://builds.apache.org/job/core-it-maven-3-win/ws/apache-maven-3-SNAPSHOT\bin\mvn>
--global-settings F:\ws\m3-its\core-integration-testing-trunk\core-it-suite\target\test-classes\settings.xml
--settings settings.xml -e --batch-mode -Dtest.prop=&x=y<> -Dmaven.repo.local=<https://builds.apache.org/job/core-it-maven-3-win/ws/it-local-repo>
validate
> was unexpected at this time.

	at org.apache.maven.it.Verifier.executeGoals(Verifier.java:1384)
	at org.apache.maven.it.Verifier.executeGoal(Verifier.java:1228)
	at org.apache.maven.it.Verifier.executeGoal(Verifier.java:1222)
	at org.apache.maven.it.MavenITmng4625SettingsXmlInterpolationWithXmlMarkupTest.testit(MavenITmng4625SettingsXmlInterpolationWithXmlMarkupTest.java:57)


Results :

Tests in error: 
  MavenITmng5530MojoExecutionScopeTest>AbstractMavenIntegrationTestCase.runTest:220->test_copyfiles:45
» Verification
  MavenITmng4625SettingsXmlInterpolationWithXmlMarkupTest>AbstractMavenIntegrationTestCase.runTest:220->testit:57
» Verification

Tests run: 719, Failures: 0, Errors: 2, Skipped: 0

[INFO] ------------------------------------------------------------------------
[INFO] Reactor Summary:
[INFO] 
[INFO] Maven Core ITs .................................... SUCCESS [32.656s]
[INFO] Maven IT Support .................................. SUCCESS [0.099s]
[INFO] Maven IT :: Plugins ............................... SUCCESS [0.126s]
[INFO] Maven IT Plugin :: Active Collection .............. SUCCESS [14.889s]
[INFO] Maven IT Plugin :: Ant-Based ...................... SUCCESS [21.941s]
[INFO] Maven IT Plugin :: Artifact ....................... SUCCESS [1.977s]
[INFO] Maven IT Plugin :: Class Loader :: Dependency A ... SUCCESS [0.325s]
[INFO] Maven IT Plugin :: Class Loader :: Dependency B ... SUCCESS [0.863s]
[INFO] Maven IT Plugin :: Class Loader :: Dependency C ... SUCCESS [0.248s]
[INFO] Maven IT Plugin :: Class Loader ................... SUCCESS [3.560s]
[INFO] Maven IT Plugin :: Class Loader :: Aggregator ..... SUCCESS [0.356s]
[INFO] Maven IT Plugin :: Configuration .................. SUCCESS [0.759s]
[INFO] Maven IT Plugin :: Context Passing ................ SUCCESS [0.273s]
[INFO] Maven ITs :: Core Plugin Stubs .................... SUCCESS [0.080s]
[INFO] Maven IT Clean Plugin Stub ........................ SUCCESS [0.247s]
[INFO] Maven IT Compiler Plugin Stub ..................... SUCCESS [0.280s]
[INFO] Maven IT Deploy Plugin Stub ....................... SUCCESS [0.356s]
[INFO] Maven IT EAR Plugin Stub .......................... SUCCESS [0.269s]
[INFO] Maven IT EJB Plugin Stub .......................... SUCCESS [0.242s]
[INFO] Maven IT Install Plugin Stub ...................... SUCCESS [0.336s]
[INFO] Maven IT JAR Plugin Stub .......................... SUCCESS [0.390s]
[INFO] Maven IT Javadoc Plugin Stub ...................... SUCCESS [0.243s]
[INFO] Maven IT Plugin Plugin Stub ....................... SUCCESS [0.387s]
[INFO] Maven IT RAR Plugin Stub .......................... SUCCESS [0.262s]
[INFO] Maven IT Resources Plugin Stub .................... SUCCESS [0.216s]
[INFO] Maven IT Site Plugin Stub ......................... SUCCESS [0.242s]
[INFO] Maven IT Source Plugin Stub ....................... SUCCESS [0.181s]
[INFO] Maven IT Surefire Plugin Stub ..................... SUCCESS [0.377s]
[INFO] Maven IT WAR Plugin Stub .......................... SUCCESS [0.288s]
[INFO] Maven IT Plugin :: Dependency Collection .......... SUCCESS [4.448s]
[INFO] Maven IT Plugin :: Dependency Resolution .......... SUCCESS [10.188s]
[INFO] Maven IT Plugin :: Expression ..................... SUCCESS [0.611s]
[INFO] Maven IT Plugin :: Error Mojos .................... SUCCESS [2.092s]
[INFO] Maven IT Component ................................ SUCCESS [0.250s]
[INFO] Maven IT Plugin :: Extension Consumer ............. SUCCESS [0.214s]
[INFO] Maven IT Plugin :: Extension Provider ............. SUCCESS [0.307s]
[INFO] Maven IT Plugin :: Fork ........................... SUCCESS [0.298s]
[INFO] Maven IT Plugin :: Invalid Descriptor ............. SUCCESS [0.188s]
[INFO] Maven IT Plugin :: Log File ....................... SUCCESS [0.224s]
[INFO] Maven IT Helper Library ........................... SUCCESS [3.057s]
[INFO] Maven IT Plugin :: Model Interpolation ............ SUCCESS [0.551s]
[INFO] Maven IT Plugin :: No Default Component ........... SUCCESS [0.407s]
[INFO] Maven IT Plugin :: No Project ..................... SUCCESS [0.482s]
[INFO] Maven IT Plugin :: Online ......................... SUCCESS [0.178s]
[INFO] Maven IT Plugin :: Optional Mojos ................. SUCCESS [0.348s]
[INFO] Maven IT Plugin :: Packaging ...................... SUCCESS [0.297s]
[INFO] Maven IT Plugin :: Parameter Implementation ....... SUCCESS [0.249s]
[INFO] Maven IT Plugin :: Plugin Dependency .............. SUCCESS [0.225s]
[INFO] Maven IT Plugin :: Project ........................ SUCCESS [0.596s]
[INFO] Maven IT Plugin :: Project Interpolation .......... SUCCESS [0.326s]
[INFO] Maven IT Plugin :: Setter ......................... SUCCESS [0.269s]
[INFO] Maven IT Plugin :: Singleton Component ............ SUCCESS [0.443s]
[INFO] Maven IT Plugin :: Site ........................... SUCCESS [7.215s]
[INFO] Maven IT Plugin :: Toolchain ...................... SUCCESS [4.382s]
[INFO] Maven IT Plugin :: Touch .......................... SUCCESS [0.523s]
[INFO] Maven IT Plugin :: Uses Properties Plugin ......... SUCCESS [0.203s]
[INFO] Maven IT Plugin :: Uses Wagon Plugin .............. SUCCESS [2.764s]
[INFO] Maven IT Plugin :: This plugin should contain the mojos needed by all tests.  SUCCESS
[0.652s]
[INFO] Maven IT Plugin :: Plexus Utils 1.1 ............... SUCCESS [0.695s]
[INFO] Maven IT Plugin :: Plexus Utils New ............... SUCCESS [0.494s]
[INFO] Maven IT Plugin :: Plexus Component API ........... SUCCESS [1.670s]
[INFO] Maven IT Plugin :: Log4J Client ................... SUCCESS [0.785s]
[INFO] Maven IT Plugin :: Extension 1 .................... SUCCESS [0.281s]
[INFO] Maven IT Plugin :: Extension 2 .................... SUCCESS [0.183s]
[INFO] Maven IT Plugin :: Plexus Lifecycle ............... SUCCESS [2.830s]
[INFO] Maven IT Plugin :: Settings ....................... SUCCESS [1.032s]
[INFO] Maven IT Toolchain ................................ SUCCESS [0.712s]
[INFO] Maven IT Wagon .................................... SUCCESS [0.357s]
[INFO] Maven IT Support Artifacts ........................ SUCCESS [2.391s]
[INFO] Maven IT Extension ................................ SUCCESS [0.149s]
[INFO] Maven ITs ......................................... FAILURE [40:20.440s]
[INFO] ------------------------------------------------------------------------
[INFO] BUILD FAILURE
[INFO] ------------------------------------------------------------------------
[INFO] Total time: 42:39.680s
[INFO] Finished at: Thu Oct 31 13:18:18 GMT 2013
[INFO] Final Memory: 33M/766M
[INFO] ------------------------------------------------------------------------
[ERROR] Failed to execute goal org.apache.maven.plugins:maven-surefire-plugin:2.13:test (default-test)
on project core-it-suite: There are test failures.
[ERROR] 
[ERROR] Please refer to F:\ws\m3-its\core-integration-testing-trunk\core-it-suite\target\surefire-reports
for the individual test results.
[ERROR] -> [Help 1]
org.apache.maven.lifecycle.LifecycleExecutionException: Failed to execute goal org.apache.maven.plugins:maven-surefire-plugin:2.13:test
(default-test) on project core-it-suite: There are test failures.

Please refer to F:\ws\m3-its\core-integration-testing-trunk\core-it-suite\target\surefire-reports
for the individual test results.
	at org.apache.maven.lifecycle.internal.MojoExecutor.execute(MojoExecutor.java:213)
	at org.apache.maven.lifecycle.internal.MojoExecutor.execute(MojoExecutor.java:153)
	at org.apache.maven.lifecycle.internal.MojoExecutor.execute(MojoExecutor.java:145)
	at org.apache.maven.lifecycle.internal.LifecycleModuleBuilder.buildProject(LifecycleModuleBuilder.java:84)
	at org.apache.maven.lifecycle.internal.LifecycleModuleBuilder.buildProject(LifecycleModuleBuilder.java:59)
	at org.apache.maven.lifecycle.internal.LifecycleStarter.singleThreadedBuild(LifecycleStarter.java:183)
	at org.apache.maven.lifecycle.internal.LifecycleStarter.execute(LifecycleStarter.java:161)
	at org.apache.maven.DefaultMaven.doExecute(DefaultMaven.java:320)
	at org.apache.maven.DefaultMaven.execute(DefaultMaven.java:156)
	at org.apache.maven.cli.MavenCli.execute(MavenCli.java:537)
	at org.apache.maven.cli.MavenCli.doMain(MavenCli.java:196)
	at org.apache.maven.cli.MavenCli.main(MavenCli.java:141)
	at sun.reflect.NativeMethodAccessorImpl.invoke0(Native Method)
	at sun.reflect.NativeMethodAccessorImpl.invoke(NativeMethodAccessorImpl.java:39)
	at sun.reflect.DelegatingMethodAccessorImpl.invoke(DelegatingMethodAccessorImpl.java:25)
	at java.lang.reflect.Method.invoke(Method.java:597)
	at org.codehaus.plexus.classworlds.launcher.Launcher.launchEnhanced(Launcher.java:290)
	at org.codehaus.plexus.classworlds.launcher.Launcher.launch(Launcher.java:230)
	at org.codehaus.plexus.classworlds.launcher.Launcher.mainWithExitCode(Launcher.java:409)
	at org.codehaus.plexus.classworlds.launcher.Launcher.main(Launcher.java:352)
Caused by: org.apache.maven.plugin.MojoFailureException: There are test failures.

Please refer to F:\ws\m3-its\core-integration-testing-trunk\core-it-suite\target\surefire-reports
for the individual test results.
	at org.apache.maven.plugin.surefire.SurefireHelper.reportExecution(SurefireHelper.java:82)
	at org.apache.maven.plugin.surefire.SurefirePlugin.handleSummary(SurefirePlugin.java:151)
	at org.apache.maven.plugin.surefire.AbstractSurefireMojo.executeAfterPreconditionsChecked(AbstractSurefireMojo.java:721)
	at org.apache.maven.plugin.surefire.AbstractSurefireMojo.execute(AbstractSurefireMojo.java:620)
	at org.apache.maven.plugin.DefaultBuildPluginManager.executeMojo(DefaultBuildPluginManager.java:101)
	at org.apache.maven.lifecycle.internal.MojoExecutor.execute(MojoExecutor.java:209)
	... 19 more
[ERROR] 
[ERROR] Re-run Maven using the -X switch to enable full debug logging.
[ERROR] 
[ERROR] For more information about the errors and possible solutions, please read the following
articles:
[ERROR] [Help 1] http://cwiki.apache.org/confluence/display/MAVEN/MojoFailureException
[ERROR] 
[ERROR] After correcting the problems, you can resume the build with the command
[ERROR]   mvn <goals> -rf :core-it-suite
Build step 'Invoke top-level Maven targets' marked build as failure
Recording test results

Mime
View raw message