maven-notifications mailing list archives

Site index · List index
Message view « Date » · « Thread »
Top « Date » · « Thread »
From Apache Jenkins Server <jenk...@builds.apache.org>
Subject Build failed in Jenkins: maven-plugins-ITs-m3-windows #458
Date Fri, 14 Feb 2014 00:29:58 GMT
See <https://builds.apache.org/job/maven-plugins-ITs-m3-windows/458/changes>

Changes:

[olamy] [MPMD-176] use pmd 5.1.0

------------------------------------------
[...truncated 10632 lines...]
[INFO] ..SUCCESS (7.3 s)
[INFO] Building: manifest-transformed\pom.xml
[INFO] run script verify.bsh
[INFO] ..SUCCESS (5.8 s)
[INFO] Building: mini-jar\pom.xml
[INFO] run script verify.bsh
[INFO] ..SUCCESS (5.7 s)
[INFO] Building: mini-jar-malformed-dependencies\pom.xml
[INFO] ..SUCCESS (11.0 s)
[INFO] Building: mini-jar-package-info\pom.xml
[INFO] run script verify.bsh
[INFO] ..SUCCESS (5.7 s)
[INFO] Building: mini-jar-respect-includes\pom.xml
[INFO] run script verify.bsh
[INFO] ..SUCCESS (5.8 s)
[INFO] Building: MSHADE-105\pom.xml
[INFO] run script verify.bsh
[INFO] ..SUCCESS (16.1 s)
[INFO] Building: MSHADE-114\pom.xml
[INFO] ..SUCCESS (5.0 s)
[INFO] Building: mshade-123\pom.xml
[INFO] ..SUCCESS (9.3 s)
[INFO] Building: MSHADE-133\pom.xml
[INFO] run script verify.groovy
[INFO] ..SUCCESS (4.8 s)
[INFO] Building: non-runtime-scope-excluded\pom.xml
[INFO] run script verify.bsh
[INFO] ..SUCCESS (5.8 s)
[INFO] Building: plugin-descriptor-relocation\pom.xml
[INFO] run script verify.groovy
[INFO] ..SUCCESS (10.1 s)
[INFO] Building: pom-packaging\pom.xml
[INFO] run script verify.bsh
[INFO] ..SUCCESS (3.3 s)
[INFO] Building: project-with-reactors-included\pom.xml
[INFO] run script verify.bsh
[INFO] ..SUCCESS (7.4 s)
[INFO] Building: reloc-abs-resource-path\pom.xml
[INFO] ..SUCCESS (9.2 s)
[INFO] Building: reloc-anno\pom.xml
[INFO] ..SUCCESS (4.5 s)
[INFO] Building: reloc-class-from-string-pool\pom.xml
[INFO] ..SUCCESS (4.5 s)
[INFO] Building: reloc-enum-ref-from-anno\pom.xml
[INFO] ..SUCCESS (4.3 s)
[INFO] Building: reloc-includes-excludes\pom.xml
[INFO] run script verify.bsh
[INFO] ..SUCCESS (5.9 s)
[INFO] Building: rerun-with-reloc\pom.xml
[INFO] ..SUCCESS (6.3 s)
[INFO] Building: rerun-without-reloc\pom.xml
[INFO] ..SUCCESS (4.6 s)
[INFO] Building: services-resource-transformer\pom.xml
[INFO] run script verify.bsh
[INFO] ..SUCCESS (4.8 s)
[INFO] Building: shadePomDependency\pom.xml
[INFO] ..SUCCESS (6.4 s)
[INFO] Building: users-shader-impl\pom.xml
[INFO] run script verify.groovy
[INFO] ..SUCCESS (5.2 s)
[INFO] Building: xml-transformer-ignores-dtd\pom.xml
[INFO] run script verify.bsh
[INFO] ..SUCCESS (5.1 s)
[INFO] 
[INFO] --- maven-invoker-plugin:1.8:verify (integration-test) @ maven-shade-plugin ---
[INFO] -------------------------------------------------
[INFO] Build Summary:
[INFO]   Passed: 45, Failed: 0, Errors: 0, Skipped: 0
[INFO] -------------------------------------------------
[INFO] 
[INFO] --- maven-install-plugin:2.3.1:install (default-install) @ maven-shade-plugin ---
[INFO] Installing F:\hudson\hudson-slave\workspace\maven-plugins-ITs-m3-windows\maven-shade-plugin\target\maven-shade-plugin-2.3-SNAPSHOT.jar
to C:\Users\hudson\.m2\repository\org\apache\maven\plugins\maven-shade-plugin\2.3-SNAPSHOT\maven-shade-plugin-2.3-SNAPSHOT.jar
[INFO] Installing F:\hudson\hudson-slave\workspace\maven-plugins-ITs-m3-windows\maven-shade-plugin\pom.xml
to C:\Users\hudson\.m2\repository\org\apache\maven\plugins\maven-shade-plugin\2.3-SNAPSHOT\maven-shade-plugin-2.3-SNAPSHOT.pom
[INFO] Installing F:\hudson\hudson-slave\workspace\maven-plugins-ITs-m3-windows\maven-shade-plugin\target\maven-shade-plugin-2.3-SNAPSHOT-tests.jar
to C:\Users\hudson\.m2\repository\org\apache\maven\plugins\maven-shade-plugin\2.3-SNAPSHOT\maven-shade-plugin-2.3-SNAPSHOT-tests.jar
[INFO]                                                                         
[INFO] ------------------------------------------------------------------------
[INFO] Building Apache Maven SCM Publish Plugin 1.1-SNAPSHOT
[INFO] ------------------------------------------------------------------------
[INFO] 
[INFO] --- maven-clean-plugin:2.5:clean (default-clean) @ maven-scm-publish-plugin ---
[INFO] Deleting F:\hudson\hudson-slave\workspace\maven-plugins-ITs-m3-windows\maven-scm-publish-plugin\target
[INFO] 
[INFO] --- maven-enforcer-plugin:1.0.1:enforce (ensure-no-container-api) @ maven-scm-publish-plugin
---
[INFO] 
[INFO] --- maven-plugin-plugin:3.2:helpmojo (generated-helpmojo) @ maven-scm-publish-plugin
---
[INFO] Using 'UTF-8' encoding to read mojo metadata.
[INFO] Applying mojo extractor for language: java
[INFO] Mojo extractor for language: java found 1 mojo descriptors.
[INFO] Applying mojo extractor for language: bsh
[INFO] Mojo extractor for language: bsh found 0 mojo descriptors.
[INFO] Applying mojo extractor for language: java-annotations
[INFO] Mojo extractor for language: java-annotations found 0 mojo descriptors.
[INFO] 
[INFO] --- maven-plugin-plugin:3.2:descriptor (default-descriptor) @ maven-scm-publish-plugin
---
[INFO] Using 'UTF-8' encoding to read mojo metadata.
[INFO] Applying mojo extractor for language: java
[INFO] Mojo extractor for language: java found 1 mojo descriptors.
[INFO] Applying mojo extractor for language: bsh
[INFO] Mojo extractor for language: bsh found 0 mojo descriptors.
[INFO] Applying mojo extractor for language: java-annotations
[INFO] Mojo extractor for language: java-annotations found 0 mojo descriptors.
[INFO] 
[INFO] --- maven-remote-resources-plugin:1.4:process (default) @ maven-scm-publish-plugin
---
[INFO] 
[INFO] --- maven-resources-plugin:2.6:resources (default-resources) @ maven-scm-publish-plugin
---
[INFO] Using 'UTF-8' encoding to copy filtered resources.
[INFO] Copying 2 resources
[INFO] Copying 3 resources
[INFO] 
[INFO] --- maven-compiler-plugin:3.0:compile (default-compile) @ maven-scm-publish-plugin
---
[INFO] Changes detected - recompiling the module!
[INFO] Compiling 4 source files to F:\hudson\hudson-slave\workspace\maven-plugins-ITs-m3-windows\maven-scm-publish-plugin\target\classes
[INFO] 
[INFO] --- maven-plugin-plugin:3.2:descriptor (mojo-descriptor) @ maven-scm-publish-plugin
---
[INFO] Using 'UTF-8' encoding to read mojo metadata.
[INFO] Applying mojo extractor for language: java
[INFO] Mojo extractor for language: java found 1 mojo descriptors.
[INFO] Applying mojo extractor for language: bsh
[INFO] Mojo extractor for language: bsh found 0 mojo descriptors.
[INFO] Applying mojo extractor for language: java-annotations
[INFO] Mojo extractor for language: java-annotations found 2 mojo descriptors.
[INFO] 
[INFO] --- maven-resources-plugin:2.6:testResources (default-testResources) @ maven-scm-publish-plugin
---
[INFO] Using 'UTF-8' encoding to copy filtered resources.
[INFO] skip non existing resourceDirectory F:\hudson\hudson-slave\workspace\maven-plugins-ITs-m3-windows\maven-scm-publish-plugin\src\test\resources
[INFO] Copying 3 resources
[INFO] 
[INFO] --- maven-compiler-plugin:3.0:testCompile (default-testCompile) @ maven-scm-publish-plugin
---
[INFO] No sources to compile
[INFO] 
[INFO] --- maven-surefire-plugin:2.12.4:test (default-test) @ maven-scm-publish-plugin ---
[INFO] 
[INFO] --- maven-jar-plugin:2.4:jar (default-jar) @ maven-scm-publish-plugin ---
[INFO] Building jar: F:\hudson\hudson-slave\workspace\maven-plugins-ITs-m3-windows\maven-scm-publish-plugin\target\maven-scm-publish-plugin-1.1-SNAPSHOT.jar
[INFO] 
[INFO] --- maven-plugin-plugin:3.2:addPluginArtifactMetadata (default-addPluginArtifactMetadata)
@ maven-scm-publish-plugin ---
[INFO] 
[INFO] --- maven-invoker-plugin:1.7:install (integration-test) @ maven-scm-publish-plugin
---
[INFO] Installing F:\hudson\hudson-slave\workspace\maven-plugins-ITs-m3-windows\maven-scm-publish-plugin\pom.xml
to F:\hudson\hudson-slave\workspace\maven-plugins-ITs-m3-windows\maven-scm-publish-plugin\target\local-repo\org\apache\maven\plugins\maven-scm-publish-plugin\1.1-SNAPSHOT\maven-scm-publish-plugin-1.1-SNAPSHOT.pom
[INFO] Installing F:\hudson\hudson-slave\workspace\maven-plugins-ITs-m3-windows\maven-scm-publish-plugin\target\maven-scm-publish-plugin-1.1-SNAPSHOT.jar
to F:\hudson\hudson-slave\workspace\maven-plugins-ITs-m3-windows\maven-scm-publish-plugin\target\local-repo\org\apache\maven\plugins\maven-scm-publish-plugin\1.1-SNAPSHOT\maven-scm-publish-plugin-1.1-SNAPSHOT.jar
[INFO] 
[INFO] --- maven-invoker-plugin:1.7:integration-test (integration-test) @ maven-scm-publish-plugin
---
[INFO] Building: 003-lifecycle\pom.xml
[INFO] run script setup.bsh
[INFO] ..SUCCESS (10.9 s)
[INFO] Building: 004-publish-scm\pom.xml
[INFO] run script setup.bsh
[INFO] ..SUCCESS (28.3 s)
[INFO] Building: 005-site-lifecycle\pom.xml
[INFO] run script setup.bsh
[INFO] ..SUCCESS (15.5 s)
[INFO] Building: 006-site-multi-module\pom.xml
[INFO] run script setup.bsh
[INFO] ..SUCCESS (16.2 s)
[INFO] 
[INFO] --- maven-invoker-plugin:1.7:verify (integration-test) @ maven-scm-publish-plugin ---
[INFO] -------------------------------------------------
[INFO] Build Summary:
[INFO]   Passed: 4, Failed: 0, Errors: 0, Skipped: 0
[INFO] -------------------------------------------------
[INFO] 
[INFO] --- maven-install-plugin:2.3.1:install (default-install) @ maven-scm-publish-plugin
---
[INFO] Installing F:\hudson\hudson-slave\workspace\maven-plugins-ITs-m3-windows\maven-scm-publish-plugin\target\maven-scm-publish-plugin-1.1-SNAPSHOT.jar
to C:\Users\hudson\.m2\repository\org\apache\maven\plugins\maven-scm-publish-plugin\1.1-SNAPSHOT\maven-scm-publish-plugin-1.1-SNAPSHOT.jar
[INFO] Installing F:\hudson\hudson-slave\workspace\maven-plugins-ITs-m3-windows\maven-scm-publish-plugin\pom.xml
to C:\Users\hudson\.m2\repository\org\apache\maven\plugins\maven-scm-publish-plugin\1.1-SNAPSHOT\maven-scm-publish-plugin-1.1-SNAPSHOT.pom
[INFO]                                                                         
[INFO] ------------------------------------------------------------------------
[INFO] Building Apache Maven Plugins Aggregator 1-SNAPSHOT
[INFO] ------------------------------------------------------------------------
[INFO] 
[INFO] --- maven-clean-plugin:2.4.1:clean (default-clean) @ maven-plugins-aggregator ---
[INFO] Deleting <https://builds.apache.org/job/maven-plugins-ITs-m3-windows/ws/target>
[INFO] 
[INFO] --- maven-remote-resources-plugin:1.1:process (default) @ maven-plugins-aggregator
---
[INFO] Setting property: classpath.resource.loader.class => 'org.codehaus.plexus.velocity.ContextClassLoaderResourceLoader'.
[INFO] Setting property: velocimacro.messages.on => 'false'.
[INFO] Setting property: resource.loader => 'classpath'.
[INFO] Setting property: resource.manager.logwhenfound => 'false'.
[INFO] 
[INFO] --- maven-install-plugin:2.3.1:install (default-install) @ maven-plugins-aggregator
---
[INFO] Installing <https://builds.apache.org/job/maven-plugins-ITs-m3-windows/ws/pom.xml>
to C:\Users\hudson\.m2\repository\org\apache\maven\plugins\maven-plugins-aggregator\1-SNAPSHOT\maven-plugins-aggregator-1-SNAPSHOT.pom
[INFO] ------------------------------------------------------------------------
[INFO] Reactor Summary:
[INFO] 
[INFO] Apache Maven Plugins .............................. SUCCESS [16.646s]
[INFO] Apache Maven ACR Plugin ........................... SUCCESS [43.721s]
[INFO] Apache Maven Ant Plugin ........................... SUCCESS [1:58.345s]
[INFO] Apache Maven AntRun Plugin ........................ SUCCESS [1:22.550s]
[INFO] Apache Maven Eclipse Plugin ....................... SUCCESS [11:09.208s]
[INFO] Apache Maven Assembly Plugin ...................... SUCCESS [14:15.516s]
[INFO] Apache Maven Changelog Plugin ..................... SUCCESS [1:16.860s]
[INFO] Apache Maven Changes Plugin ....................... SUCCESS [1:29.079s]
[INFO] Apache Maven Checkstyle Plugin .................... SUCCESS [2:52.848s]
[INFO] Apache Maven Clean Plugin ......................... SUCCESS [25.323s]
[INFO] Apache Maven Compiler Plugin ...................... SUCCESS [2:07.530s]
[INFO] Apache Maven Dependency Plugin .................... SUCCESS [3:38.753s]
[INFO] Apache Maven Deploy Plugin ........................ SUCCESS [1:57.909s]
[INFO] Apache Maven DOAP Plugin .......................... SUCCESS [9.062s]
[INFO] Apache Maven Documentation Checker Plugin ......... SUCCESS [7.260s]
[INFO] Apache Maven EAR Plugin ........................... SUCCESS [5:47.385s]
[INFO] Apache Maven EJB Plugin ........................... SUCCESS [37.683s]
[INFO] Apache Maven Help Plugin .......................... SUCCESS [1:08.292s]
[INFO] Apache Maven Install Plugin ....................... SUCCESS [1:29.484s]
[INFO] Apache Maven JAR Plugin ........................... SUCCESS [1:47.090s]
[INFO] Apache Maven Jarsigner Plugin ..................... SUCCESS [1:12.154s]
[INFO] Apache Maven Javadoc Plugin ....................... SUCCESS [4:22.061s]
[INFO] Apache Maven Linkcheck Plugin ..................... SUCCESS [3.917s]
[INFO] Apache Maven Patch Plugin ......................... SUCCESS [12.148s]
[INFO] Apache Maven PDF Plugin ........................... SUCCESS [47.988s]
[INFO] Apache Maven PMD Plugin ........................... FAILURE [18.585s]
[INFO] Apache Maven RAR Plugin ........................... SUCCESS [19.699s]
[INFO] Apache Maven Reactor Plugin ....................... SUCCESS [3.046s]
[INFO] Apache Maven Repository Plugin .................... SUCCESS [1:08.526s]
[INFO] Apache Maven Resources Plugin ..................... SUCCESS [1:13.469s]
[INFO] Apache Maven Site Plugin 3 ........................ SUCCESS [11:27.262s]
[INFO] Apache Maven Source Plugin ........................ SUCCESS [1:16.868s]
[INFO] Apache Maven Stage Plugin ......................... SUCCESS [3.118s]
[INFO] Apache Maven Toolchains Plugin .................... SUCCESS [2.407s]
[INFO] Apache Maven Verifier Plugin ...................... SUCCESS [25.831s]
[INFO] Apache Maven WAR Plugin ........................... SUCCESS [1:51.322s]
[INFO] Apache Maven Invoker Plugin ....................... SUCCESS [7:13.093s]
[INFO] Apache Maven Project Info Reports Plugin .......... SUCCESS [3:07.661s]
[INFO] Apache Maven Remote Resources Plugin .............. SUCCESS [1:42.905s]
[INFO] Apache Maven Shade Plugin ......................... SUCCESS [5:12.466s]
[INFO] Apache Maven SCM Publish Plugin ................... SUCCESS [1:35.562s]
[INFO] Apache Maven Plugins Aggregator ................... SUCCESS [0.577s]
[INFO] ------------------------------------------------------------------------
[INFO] BUILD FAILURE
[INFO] ------------------------------------------------------------------------
[INFO] Total time: 1:38:24.624s
[INFO] Finished at: Fri Feb 14 00:27:11 GMT 2014
[INFO] Final Memory: 125M/397M
[INFO] ------------------------------------------------------------------------
[WARNING] The requested profile "apache.snapshots" could not be activated because it does
not exist.
[ERROR] Failed to execute goal org.apache.maven.plugins:maven-compiler-plugin:3.0:compile
(default-compile) on project maven-pmd-plugin: Compilation failure
[ERROR] F:\hudson\hudson-slave\workspace\maven-plugins-ITs-m3-windows\maven-pmd-plugin\src\main\java\org\apache\maven\plugin\pmd\rules\DummyRule.java:[24,-1]
cannot access net.sourceforge.pmd.RuleContext
[ERROR] bad class file: C:\Users\hudson\.m2\repository\net\sourceforge\pmd\pmd\5.1.0\pmd-5.1.0.jar(net/sourceforge/pmd/RuleContext.class)
[ERROR] class file has wrong version 50.0, should be 49.0
[ERROR] -> [Help 1]
[ERROR] 
[ERROR] To see the full stack trace of the errors, re-run Maven with the -e switch.
[ERROR] Re-run Maven using the -X switch to enable full debug logging.
[ERROR] 
[ERROR] For more information about the errors and possible solutions, please read the following
articles:
[ERROR] [Help 1] http://cwiki.apache.org/confluence/display/MAVEN/MojoFailureException
[ERROR] 
[ERROR] After correcting the problems, you can resume the build with the command
[ERROR]   mvn <goals> -rf :maven-pmd-plugin
Build step 'Invoke top-level Maven targets' marked build as failure
Recording test results

Mime
View raw message