maven-notifications mailing list archives

Site index · List index
Message view « Date » · « Thread »
Top « Date » · « Thread »
From Apache Jenkins Server <jenk...@builds.apache.org>
Subject Build failed in Jenkins: maven-plugin-tools-jdk-1.7 #64
Date Thu, 17 Apr 2014 16:20:22 GMT
See <https://builds.apache.org/job/maven-plugin-tools-jdk-1.7/64/changes>

Changes:

[ifedorenko] MPLUGIN-264 made supported packaging types configurable

------------------------------------------
[...truncated 997 lines...]
[INFO] ------------------------------------------------------------------------
[INFO] Building Maven Plugin Metadata Model 3.3-SNAPSHOT
[INFO] ------------------------------------------------------------------------
[INFO] 
[INFO] --- maven-clean-plugin:2.5:clean (default-clean) @ maven-plugin-tools-model ---
[INFO] 
[INFO] --- modello-maven-plugin:1.4.1:java (standard) @ maven-plugin-tools-model ---
[INFO] outputDirectory: <https://builds.apache.org/job/maven-plugin-tools-jdk-1.7/ws/maven-plugin-tools-model/target/generated-sources/modello>
[INFO] Working on model: src/main/mdo/plugin-metadata.mdo
[INFO] Generating current version: 1.1.0
[INFO] 
[INFO] --- modello-maven-plugin:1.4.1:xpp3-reader (standard) @ maven-plugin-tools-model ---
[INFO] outputDirectory: <https://builds.apache.org/job/maven-plugin-tools-jdk-1.7/ws/maven-plugin-tools-model/target/generated-sources/modello>
[INFO] Working on model: src/main/mdo/plugin-metadata.mdo
[INFO] Generating current version: 1.1.0
[INFO] 
[INFO] --- modello-maven-plugin:1.4.1:xpp3-writer (standard) @ maven-plugin-tools-model ---
[INFO] outputDirectory: <https://builds.apache.org/job/maven-plugin-tools-jdk-1.7/ws/maven-plugin-tools-model/target/generated-sources/modello>
[INFO] Working on model: src/main/mdo/plugin-metadata.mdo
[INFO] Generating current version: 1.1.0
[INFO] 
[INFO] --- maven-remote-resources-plugin:1.4:process (default) @ maven-plugin-tools-model
---
[INFO] 
[INFO] --- maven-resources-plugin:2.6:resources (default-resources) @ maven-plugin-tools-model
---
[INFO] Using 'UTF-8' encoding to copy filtered resources.
[INFO] skip non existing resourceDirectory <https://builds.apache.org/job/maven-plugin-tools-jdk-1.7/ws/maven-plugin-tools-model/src/main/resources>
[INFO] Copying 3 resources
[INFO] 
[INFO] --- maven-compiler-plugin:2.5:compile (default-compile) @ maven-plugin-tools-model
---
[INFO] Compiling 9 source files to <https://builds.apache.org/job/maven-plugin-tools-jdk-1.7/ws/maven-plugin-tools-model/target/classes>
[INFO] 
[INFO] --- maven-resources-plugin:2.6:testResources (default-testResources) @ maven-plugin-tools-model
---
[INFO] Using 'UTF-8' encoding to copy filtered resources.
[INFO] Copying 2 resources
[INFO] Copying 3 resources
[INFO] 
[INFO] --- maven-compiler-plugin:2.5:testCompile (default-testCompile) @ maven-plugin-tools-model
---
[INFO] Compiling 1 source file to <https://builds.apache.org/job/maven-plugin-tools-jdk-1.7/ws/maven-plugin-tools-model/target/test-classes>
[INFO] -------------------------------------------------------------
[ERROR] COMPILATION ERROR : 
[INFO] -------------------------------------------------------------
[ERROR] error: error reading /home/jenkins/jenkins-slave/maven-repositories/1/junit/junit/3.8.2/junit-3.8.2.jar;
error in opening zip file
[INFO] 1 error
[INFO] -------------------------------------------------------------
[INFO]                                                                         
[INFO] ------------------------------------------------------------------------
[INFO] Skipping Maven Plugin Tool for Ant
[INFO] This project has been banned from the build due to previous failures.
[INFO] ------------------------------------------------------------------------
[INFO]                                                                         
[INFO] ------------------------------------------------------------------------
[INFO] Skipping Maven Plugin Tool for Beanshell
[INFO] This project has been banned from the build due to previous failures.
[INFO] ------------------------------------------------------------------------
[INFO]                                                                         
[INFO] ------------------------------------------------------------------------
[INFO] Skipping Maven Plugin Plugin
[INFO] This project has been banned from the build due to previous failures.
[INFO] ------------------------------------------------------------------------
[INFO] ------------------------------------------------------------------------
[INFO] Reactor Summary:
[INFO] 
[INFO] Maven Plugin Tools ................................ SUCCESS [2.510s]
[INFO] Maven Script Mojo Support ......................... SUCCESS [0.535s]
[INFO] Maven Ant Mojo Support ............................ FAILURE [3.106s]
[INFO] Maven Beanshell Mojo Support ...................... SUCCESS [1.325s]
[INFO] Maven Plugin Tools APIs ........................... FAILURE [1.149s]
[INFO] Maven Plugin Tools Generators ..................... SKIPPED
[INFO] Maven Plugin Tool for Java with Javadoc Tags ...... SKIPPED
[INFO] Maven Plugin Tools Javadoc ........................ SKIPPED
[INFO] Maven Plugin Java 5 Annotations ................... SUCCESS [2.750s]
[INFO] Maven Plugin Tool for Annotations ................. SKIPPED
[INFO] Maven Plugin Metadata Model ....................... FAILURE [1.406s]
[INFO] Maven Plugin Tool for Ant ......................... SKIPPED
[INFO] Maven Plugin Tool for Beanshell ................... SKIPPED
[INFO] Maven Plugin Plugin ............................... SKIPPED
[INFO] ------------------------------------------------------------------------
[INFO] BUILD FAILURE
[INFO] ------------------------------------------------------------------------
[INFO] Total time: 20.656s
[INFO] Finished at: Thu Apr 17 16:19:12 UTC 2014
[INFO] Final Memory: 30M/257M
[INFO] ------------------------------------------------------------------------
Waiting for Jenkins to finish collecting data
[ERROR] Failed to execute goal org.apache.maven.plugins:maven-compiler-plugin:2.5:testCompile
(default-testCompile) on project maven-script-ant: Compilation failure
[ERROR] error: error reading /home/jenkins/jenkins-slave/maven-repositories/1/junit/junit/3.8.2/junit-3.8.2.jar;
error in opening zip file
[ERROR] -> [Help 1]
org.apache.maven.lifecycle.LifecycleExecutionException: Failed to execute goal org.apache.maven.plugins:maven-compiler-plugin:2.5:testCompile
(default-testCompile) on project maven-script-ant: Compilation failure
error: error reading /home/jenkins/jenkins-slave/maven-repositories/1/junit/junit/3.8.2/junit-3.8.2.jar;
error in opening zip file

	at org.apache.maven.lifecycle.internal.MojoExecutor.execute(MojoExecutor.java:213)
	at org.apache.maven.lifecycle.internal.MojoExecutor.execute(MojoExecutor.java:153)
	at org.apache.maven.lifecycle.internal.MojoExecutor.execute(MojoExecutor.java:145)
	at org.apache.maven.lifecycle.internal.LifecycleModuleBuilder.buildProject(LifecycleModuleBuilder.java:84)
	at org.apache.maven.lifecycle.internal.LifecycleModuleBuilder.buildProject(LifecycleModuleBuilder.java:59)
	at org.apache.maven.lifecycle.internal.LifecycleStarter.singleThreadedBuild(LifecycleStarter.java:183)
	at org.apache.maven.lifecycle.internal.LifecycleStarter.execute(LifecycleStarter.java:161)
	at org.apache.maven.DefaultMaven.doExecute(DefaultMaven.java:320)
	at org.apache.maven.DefaultMaven.execute(DefaultMaven.java:156)
	at org.jvnet.hudson.maven3.launcher.Maven3Launcher.main(Maven3Launcher.java:117)
	at sun.reflect.NativeMethodAccessorImpl.invoke0(Native Method)
	at sun.reflect.NativeMethodAccessorImpl.invoke(NativeMethodAccessorImpl.java:57)
	at sun.reflect.DelegatingMethodAccessorImpl.invoke(DelegatingMethodAccessorImpl.java:43)
	at java.lang.reflect.Method.invoke(Method.java:606)
	at org.codehaus.plexus.classworlds.launcher.Launcher.launchStandard(Launcher.java:329)
	at org.codehaus.plexus.classworlds.launcher.Launcher.launch(Launcher.java:239)
	at org.jvnet.hudson.maven3.agent.Maven3Main.launch(Maven3Main.java:178)
	at sun.reflect.NativeMethodAccessorImpl.invoke0(Native Method)
	at sun.reflect.NativeMethodAccessorImpl.invoke(NativeMethodAccessorImpl.java:57)
	at sun.reflect.DelegatingMethodAccessorImpl.invoke(DelegatingMethodAccessorImpl.java:43)
	at java.lang.reflect.Method.invoke(Method.java:606)
	at hudson.maven.Maven3Builder.call(Maven3Builder.java:134)
	at hudson.maven.Maven3Builder.call(Maven3Builder.java:69)
	at hudson.remoting.UserRequest.perform(UserRequest.java:118)
	at hudson.remoting.UserRequest.perform(UserRequest.java:48)
	at hudson.remoting.Request$2.run(Request.java:328)
	at hudson.remoting.InterceptingExecutorService$1.call(InterceptingExecutorService.java:72)
	at java.util.concurrent.FutureTask$Sync.innerRun(FutureTask.java:334)
	at java.util.concurrent.FutureTask.run(FutureTask.java:166)
	at java.util.concurrent.ThreadPoolExecutor.runWorker(ThreadPoolExecutor.java:1145)
	at java.util.concurrent.ThreadPoolExecutor$Worker.run(ThreadPoolExecutor.java:615)
	at java.lang.Thread.run(Thread.java:724)
Caused by: org.apache.maven.plugin.CompilationFailureException: Compilation failure
error: error reading /home/jenkins/jenkins-slave/maven-repositories/1/junit/junit/3.8.2/junit-3.8.2.jar;
error in opening zip file

	at org.apache.maven.plugin.AbstractCompilerMojo.execute(AbstractCompilerMojo.java:729)
	at org.apache.maven.plugin.TestCompilerMojo.execute(TestCompilerMojo.java:161)
	at org.apache.maven.plugin.DefaultBuildPluginManager.executeMojo(DefaultBuildPluginManager.java:101)
	at org.apache.maven.lifecycle.internal.MojoExecutor.execute(MojoExecutor.java:209)
	... 31 more
[ERROR] Failed to execute goal org.apache.maven.plugins:maven-compiler-plugin:2.5:testCompile
(default-testCompile) on project maven-plugin-tools-api: Compilation failure
[ERROR] error: error reading /home/jenkins/jenkins-slave/maven-repositories/1/junit/junit/3.8.2/junit-3.8.2.jar;
error in opening zip file
[ERROR] -> [Help 1]
org.apache.maven.lifecycle.LifecycleExecutionException: Failed to execute goal org.apache.maven.plugins:maven-compiler-plugin:2.5:testCompile
(default-testCompile) on project maven-plugin-tools-api: Compilation failure
error: error reading /home/jenkins/jenkins-slave/maven-repositories/1/junit/junit/3.8.2/junit-3.8.2.jar;
error in opening zip file

	at org.apache.maven.lifecycle.internal.MojoExecutor.execute(MojoExecutor.java:213)
	at org.apache.maven.lifecycle.internal.MojoExecutor.execute(MojoExecutor.java:153)
	at org.apache.maven.lifecycle.internal.MojoExecutor.execute(MojoExecutor.java:145)
	at org.apache.maven.lifecycle.internal.LifecycleModuleBuilder.buildProject(LifecycleModuleBuilder.java:84)
	at org.apache.maven.lifecycle.internal.LifecycleModuleBuilder.buildProject(LifecycleModuleBuilder.java:59)
	at org.apache.maven.lifecycle.internal.LifecycleStarter.singleThreadedBuild(LifecycleStarter.java:183)
	at org.apache.maven.lifecycle.internal.LifecycleStarter.execute(LifecycleStarter.java:161)
	at org.apache.maven.DefaultMaven.doExecute(DefaultMaven.java:320)
	at org.apache.maven.DefaultMaven.execute(DefaultMaven.java:156)
	at org.jvnet.hudson.maven3.launcher.Maven3Launcher.main(Maven3Launcher.java:117)
	at sun.reflect.NativeMethodAccessorImpl.invoke0(Native Method)
	at sun.reflect.NativeMethodAccessorImpl.invoke(NativeMethodAccessorImpl.java:57)
	at sun.reflect.DelegatingMethodAccessorImpl.invoke(DelegatingMethodAccessorImpl.java:43)
	at java.lang.reflect.Method.invoke(Method.java:606)
	at org.codehaus.plexus.classworlds.launcher.Launcher.launchStandard(Launcher.java:329)
	at org.codehaus.plexus.classworlds.launcher.Launcher.launch(Launcher.java:239)
	at org.jvnet.hudson.maven3.agent.Maven3Main.launch(Maven3Main.java:178)
	at sun.reflect.NativeMethodAccessorImpl.invoke0(Native Method)
	at sun.reflect.NativeMethodAccessorImpl.invoke(NativeMethodAccessorImpl.java:57)
	at sun.reflect.DelegatingMethodAccessorImpl.invoke(DelegatingMethodAccessorImpl.java:43)
	at java.lang.reflect.Method.invoke(Method.java:606)
	at hudson.maven.Maven3Builder.call(Maven3Builder.java:134)
	at hudson.maven.Maven3Builder.call(Maven3Builder.java:69)
	at hudson.remoting.UserRequest.perform(UserRequest.java:118)
	at hudson.remoting.UserRequest.perform(UserRequest.java:48)
	at hudson.remoting.Request$2.run(Request.java:328)
	at hudson.remoting.InterceptingExecutorService$1.call(InterceptingExecutorService.java:72)
	at java.util.concurrent.FutureTask$Sync.innerRun(FutureTask.java:334)
	at java.util.concurrent.FutureTask.run(FutureTask.java:166)
	at java.util.concurrent.ThreadPoolExecutor.runWorker(ThreadPoolExecutor.java:1145)
	at java.util.concurrent.ThreadPoolExecutor$Worker.run(ThreadPoolExecutor.java:615)
	at java.lang.Thread.run(Thread.java:724)
Caused by: org.apache.maven.plugin.CompilationFailureException: Compilation failure
error: error reading /home/jenkins/jenkins-slave/maven-repositories/1/junit/junit/3.8.2/junit-3.8.2.jar;
error in opening zip file

	at org.apache.maven.plugin.AbstractCompilerMojo.execute(AbstractCompilerMojo.java:729)
	at org.apache.maven.plugin.TestCompilerMojo.execute(TestCompilerMojo.java:161)
	at org.apache.maven.plugin.DefaultBuildPluginManager.executeMojo(DefaultBuildPluginManager.java:101)
	at org.apache.maven.lifecycle.internal.MojoExecutor.execute(MojoExecutor.java:209)
	... 31 more
[ERROR] Failed to execute goal org.apache.maven.plugins:maven-compiler-plugin:2.5:testCompile
(default-testCompile) on project maven-plugin-tools-model: Compilation failure
[ERROR] error: error reading /home/jenkins/jenkins-slave/maven-repositories/1/junit/junit/3.8.2/junit-3.8.2.jar;
error in opening zip file
[JENKINS] Archiving <https://builds.apache.org/job/maven-plugin-tools-jdk-1.7/ws/maven-plugin-plugin/pom.xml>
to org.apache.maven.plugins/maven-plugin-plugin/3.3-SNAPSHOT/maven-plugin-plugin-3.3-SNAPSHOT.pom
[ERROR] -> [Help 1]
org.apache.maven.lifecycle.LifecycleExecutionException: Failed to execute goal org.apache.maven.plugins:maven-compiler-plugin:2.5:testCompile
(default-testCompile) on project maven-plugin-tools-model: Compilation failure
error: error reading /home/jenkins/jenkins-slave/maven-repositories/1/junit/junit/3.8.2/junit-3.8.2.jar;
error in opening zip file

	at org.apache.maven.lifecycle.internal.MojoExecutor.execute(MojoExecutor.java:213)
	at org.apache.maven.lifecycle.internal.MojoExecutor.execute(MojoExecutor.java:153)
	at org.apache.maven.lifecycle.internal.MojoExecutor.execute(MojoExecutor.java:145)
	at org.apache.maven.lifecycle.internal.LifecycleModuleBuilder.buildProject(LifecycleModuleBuilder.java:84)
	at org.apache.maven.lifecycle.internal.LifecycleModuleBuilder.buildProject(LifecycleModuleBuilder.java:59)
	at org.apache.maven.lifecycle.internal.LifecycleStarter.singleThreadedBuild(LifecycleStarter.java:183)
	at org.apache.maven.lifecycle.internal.LifecycleStarter.execute(LifecycleStarter.java:161)
	at org.apache.maven.DefaultMaven.doExecute(DefaultMaven.java:320)
	at org.apache.maven.DefaultMaven.execute(DefaultMaven.java:156)
	at org.jvnet.hudson.maven3.launcher.Maven3Launcher.main(Maven3Launcher.java:117)
	at sun.reflect.NativeMethodAccessorImpl.invoke0(Native Method)
	at sun.reflect.NativeMethodAccessorImpl.invoke(NativeMethodAccessorImpl.java:57)
	at sun.reflect.DelegatingMethodAccessorImpl.invoke(DelegatingMethodAccessorImpl.java:43)
	at java.lang.reflect.Method.invoke(Method.java:606)
	at org.codehaus.plexus.classworlds.launcher.Launcher.launchStandard(Launcher.java:329)
	at org.codehaus.plexus.classworlds.launcher.Launcher.launch(Launcher.java:239)
	at org.jvnet.hudson.maven3.agent.Maven3Main.launch(Maven3Main.java:178)
	at sun.reflect.NativeMethodAccessorImpl.invoke0(Native Method)
	at sun.reflect.NativeMethodAccessorImpl.invoke(NativeMethodAccessorImpl.java:57)
	at sun.reflect.DelegatingMethodAccessorImpl.invoke(DelegatingMethodAccessorImpl.java:43)
	at java.lang.reflect.Method.invoke(Method.java:606)
	at hudson.maven.Maven3Builder.call(Maven3Builder.java:134)
	at hudson.maven.Maven3Builder.call(Maven3Builder.java:69)
	at hudson.remoting.UserRequest.perform(UserRequest.java:118)
	at hudson.remoting.UserRequest.perform(UserRequest.java:48)
	at hudson.remoting.Request$2.run(Request.java:328)
	at hudson.remoting.InterceptingExecutorService$1.call(InterceptingExecutorService.java:72)
	at java.util.concurrent.FutureTask$Sync.innerRun(FutureTask.java:334)
	at java.util.concurrent.FutureTask.run(FutureTask.java:166)
	at java.util.concurrent.ThreadPoolExecutor.runWorker(ThreadPoolExecutor.java:1145)
	at java.util.concurrent.ThreadPoolExecutor$Worker.run(ThreadPoolExecutor.java:615)
	at java.lang.Thread.run(Thread.java:724)
Caused by: org.apache.maven.plugin.CompilationFailureException: Compilation failure
error: error reading /home/jenkins/jenkins-slave/maven-repositories/1/junit/junit/3.8.2/junit-3.8.2.jar;
error in opening zip file

	at org.apache.maven.plugin.AbstractCompilerMojo.execute(AbstractCompilerMojo.java:729)
	at org.apache.maven.plugin.TestCompilerMojo.execute(TestCompilerMojo.java:161)
	at org.apache.maven.plugin.DefaultBuildPluginManager.executeMojo(DefaultBuildPluginManager.java:101)
	at org.apache.maven.lifecycle.internal.MojoExecutor.execute(MojoExecutor.java:209)
	... 31 more
[ERROR] 
[ERROR] Re-run Maven using the -X switch to enable full debug logging.
[ERROR] 
[ERROR] For more information about the errors and possible solutions, please read the following
articles:
[ERROR] [Help 1] http://cwiki.apache.org/confluence/display/MAVEN/MojoFailureException
[ERROR] 
[ERROR] After correcting the problems, you can resume the build with the command
[ERROR]   mvn <goals> -rf :maven-script-ant
[JENKINS] Archiving <https://builds.apache.org/job/maven-plugin-tools-jdk-1.7/ws/maven-plugin-tools-java/pom.xml>
to org.apache.maven.plugin-tools/maven-plugin-tools-java/3.3-SNAPSHOT/maven-plugin-tools-java-3.3-SNAPSHOT.pom
[JENKINS] Archiving <https://builds.apache.org/job/maven-plugin-tools-jdk-1.7/ws/maven-plugin-tools-ant/pom.xml>
to org.apache.maven.plugin-tools/maven-plugin-tools-ant/3.3-SNAPSHOT/maven-plugin-tools-ant-3.3-SNAPSHOT.pom
[JENKINS] Archiving <https://builds.apache.org/job/maven-plugin-tools-jdk-1.7/ws/maven-script/pom.xml>
to org.apache.maven.plugin-tools/maven-script/3.3-SNAPSHOT/maven-script-3.3-SNAPSHOT.pom
[JENKINS] Archiving <https://builds.apache.org/job/maven-plugin-tools-jdk-1.7/ws/maven-script/target/maven-script-3.3-SNAPSHOT-site.xml>
to org.apache.maven.plugin-tools/maven-script/3.3-SNAPSHOT/maven-script-3.3-SNAPSHOT-site.xml
[JENKINS] Archiving <https://builds.apache.org/job/maven-plugin-tools-jdk-1.7/ws/maven-plugin-tools-javadoc/pom.xml>
to org.apache.maven.plugin-tools/maven-plugin-tools-javadoc/3.3-SNAPSHOT/maven-plugin-tools-javadoc-3.3-SNAPSHOT.pom
[JENKINS] Archiving <https://builds.apache.org/job/maven-plugin-tools-jdk-1.7/ws/pom.xml>
to org.apache.maven.plugin-tools/maven-plugin-tools/3.3-SNAPSHOT/maven-plugin-tools-3.3-SNAPSHOT.pom
[JENKINS] Archiving <https://builds.apache.org/job/maven-plugin-tools-jdk-1.7/ws/target/maven-plugin-tools-3.3-SNAPSHOT-site.xml>
to org.apache.maven.plugin-tools/maven-plugin-tools/3.3-SNAPSHOT/maven-plugin-tools-3.3-SNAPSHOT-site.xml
[JENKINS] Archiving <https://builds.apache.org/job/maven-plugin-tools-jdk-1.7/ws/maven-plugin-annotations/pom.xml>
to org.apache.maven.plugin-tools/maven-plugin-annotations/3.3-SNAPSHOT/maven-plugin-annotations-3.3-SNAPSHOT.pom
[JENKINS] Archiving <https://builds.apache.org/job/maven-plugin-tools-jdk-1.7/ws/maven-plugin-annotations/target/maven-plugin-annotations-3.3-SNAPSHOT.jar>
to org.apache.maven.plugin-tools/maven-plugin-annotations/3.3-SNAPSHOT/maven-plugin-annotations-3.3-SNAPSHOT.jar
[JENKINS] Archiving <https://builds.apache.org/job/maven-plugin-tools-jdk-1.7/ws/maven-script/maven-script-ant/pom.xml>
to org.apache.maven.plugin-tools/maven-script-ant/3.3-SNAPSHOT/maven-script-ant-3.3-SNAPSHOT.pom
[JENKINS] Archiving <https://builds.apache.org/job/maven-plugin-tools-jdk-1.7/ws/maven-script/maven-script-beanshell/pom.xml>
to org.apache.maven.plugin-tools/maven-script-beanshell/3.3-SNAPSHOT/maven-script-beanshell-3.3-SNAPSHOT.pom
[JENKINS] Archiving <https://builds.apache.org/job/maven-plugin-tools-jdk-1.7/ws/maven-script/maven-script-beanshell/target/maven-script-beanshell-3.3-SNAPSHOT.jar>
to org.apache.maven.plugin-tools/maven-script-beanshell/3.3-SNAPSHOT/maven-script-beanshell-3.3-SNAPSHOT.jar
[JENKINS] Archiving <https://builds.apache.org/job/maven-plugin-tools-jdk-1.7/ws/maven-plugin-tools-generators/pom.xml>
to org.apache.maven.plugin-tools/maven-plugin-tools-generators/3.3-SNAPSHOT/maven-plugin-tools-generators-3.3-SNAPSHOT.pom
[JENKINS] Archiving <https://builds.apache.org/job/maven-plugin-tools-jdk-1.7/ws/maven-plugin-tools-api/pom.xml>
to org.apache.maven.plugin-tools/maven-plugin-tools-api/3.3-SNAPSHOT/maven-plugin-tools-api-3.3-SNAPSHOT.pom
[JENKINS] Archiving <https://builds.apache.org/job/maven-plugin-tools-jdk-1.7/ws/maven-plugin-tools-beanshell/pom.xml>
to org.apache.maven.plugin-tools/maven-plugin-tools-beanshell/3.3-SNAPSHOT/maven-plugin-tools-beanshell-3.3-SNAPSHOT.pom
[JENKINS] Archiving <https://builds.apache.org/job/maven-plugin-tools-jdk-1.7/ws/maven-plugin-tools-annotations/pom.xml>
to org.apache.maven.plugin-tools/maven-plugin-tools-annotations/3.3-SNAPSHOT/maven-plugin-tools-annotations-3.3-SNAPSHOT.pom
[JENKINS] Archiving <https://builds.apache.org/job/maven-plugin-tools-jdk-1.7/ws/maven-plugin-tools-model/pom.xml>
to org.apache.maven.plugin-tools/maven-plugin-tools-model/3.3-SNAPSHOT/maven-plugin-tools-model-3.3-SNAPSHOT.pom
channel stopped

Mime
View raw message