maven-notifications mailing list archives

Site index · List index
Message view « Date » · « Thread »
Top « Date » · « Thread »
From Apache Jenkins Server <jenk...@builds.apache.org>
Subject Build failed in Jenkins: dist-tool-plugin #447
Date Sat, 12 Apr 2014 15:06:25 GMT
See <https://builds.apache.org/job/dist-tool-plugin/447/changes>

Changes:

[hboutemy] updated parent pom

[hboutemy] maven-parent pom is now in dist

[hboutemy] tweaked configuration for resources since their dedicated (poor) sites were deleted

------------------------------------------
Started by user hboutemy
Building remotely on ubuntu5 (Ubuntu ubuntu) in workspace <https://builds.apache.org/job/dist-tool-plugin/ws/>
Updating http://svn.apache.org/repos/asf/maven/sandbox/trunk/dist-tools/dist-tool-plugin at
revision '2014-04-12T15:06:04.884 +0000'
U         src/main/resources/dist-tool.conf
U         pom.xml
At revision 1586860
Parsing POMs
ERROR: Failed to parse POMs
java.io.IOException: remote file operation failed: <https://builds.apache.org/job/dist-tool-plugin/ws/>
at hudson.remoting.Channel@7c9dfb0e:ubuntu5
	at hudson.FilePath.act(FilePath.java:910)
	at hudson.FilePath.act(FilePath.java:887)
	at hudson.maven.MavenModuleSetBuild$MavenModuleSetBuildExecution.parsePoms(MavenModuleSetBuild.java:943)
	at hudson.maven.MavenModuleSetBuild$MavenModuleSetBuildExecution.doRun(MavenModuleSetBuild.java:671)
	at hudson.model.AbstractBuild$AbstractBuildExecution.run(AbstractBuild.java:523)
	at hudson.model.Run.execute(Run.java:1700)
	at hudson.maven.MavenModuleSetBuild.run(MavenModuleSetBuild.java:519)
	at hudson.model.ResourceController.execute(ResourceController.java:88)
	at hudson.model.Executor.run(Executor.java:231)
Caused by: hudson.remoting.ProxyException: hudson.maven.MavenModuleSetBuild$MavenExecutionException:
org.apache.maven.project.ProjectBuildingException: Some problems were encountered while processing
the POMs:
[FATAL] Non-resolvable parent POM: Could not find artifact org.apache.maven:maven-parent:pom:25-SNAPSHOT
and 'parent.relativePath' points at wrong local POM @ line 17, column 11

	at hudson.maven.MavenModuleSetBuild$PomParser.invoke(MavenModuleSetBuild.java:1347)
	at hudson.maven.MavenModuleSetBuild$PomParser.invoke(MavenModuleSetBuild.java:1081)
	at hudson.FilePath$FileCallableWrapper.call(FilePath.java:2462)
	at hudson.remoting.UserRequest.perform(UserRequest.java:118)
	at hudson.remoting.UserRequest.perform(UserRequest.java:48)
	at hudson.remoting.Request$2.run(Request.java:328)
	at hudson.remoting.InterceptingExecutorService$1.call(InterceptingExecutorService.java:72)
	at java.util.concurrent.FutureTask.run(FutureTask.java:262)
	at java.util.concurrent.ThreadPoolExecutor.runWorker(ThreadPoolExecutor.java:1145)
	at java.util.concurrent.ThreadPoolExecutor$Worker.run(ThreadPoolExecutor.java:615)
	at java.lang.Thread.run(Thread.java:744)
Caused by: hudson.remoting.ProxyException: org.apache.maven.project.ProjectBuildingException:
Some problems were encountered while processing the POMs:
[FATAL] Non-resolvable parent POM: Could not find artifact org.apache.maven:maven-parent:pom:25-SNAPSHOT
and 'parent.relativePath' points at wrong local POM @ line 17, column 11

	at org.apache.maven.project.DefaultProjectBuilder.build(DefaultProjectBuilder.java:364)
	at hudson.maven.MavenEmbedder.buildProjects(MavenEmbedder.java:361)
	at hudson.maven.MavenEmbedder.readProjects(MavenEmbedder.java:331)
	at hudson.maven.MavenModuleSetBuild$PomParser.invoke(MavenModuleSetBuild.java:1284)
	... 10 more

Mime
View raw message