maven-notifications mailing list archives

Site index · List index
Message view « Date » · « Thread »
Top « Date » · « Thread »
From Apache Jenkins Server <jenk...@builds.apache.org>
Subject Build failed in Jenkins: maven-plugins-ITs-m3 #1280
Date Thu, 03 Apr 2014 03:06:09 GMT
See <https://builds.apache.org/job/maven-plugins-ITs-m3/1280/>

------------------------------------------
[...truncated 10640 lines...]
[INFO] 
[INFO] --- maven-plugin-plugin:3.2:helpmojo (generated-helpmojo) @ maven-scm-publish-plugin
---
[INFO] Using 'UTF-8' encoding to read mojo metadata.
[INFO] Applying mojo extractor for language: java
[INFO] Mojo extractor for language: java found 1 mojo descriptors.
[INFO] Applying mojo extractor for language: bsh
[INFO] Mojo extractor for language: bsh found 0 mojo descriptors.
[INFO] Applying mojo extractor for language: java-annotations
[INFO] Mojo extractor for language: java-annotations found 0 mojo descriptors.
[INFO] 
[INFO] --- maven-plugin-plugin:3.2:descriptor (default-descriptor) @ maven-scm-publish-plugin
---
[INFO] Using 'UTF-8' encoding to read mojo metadata.
[INFO] Applying mojo extractor for language: java
[INFO] Mojo extractor for language: java found 1 mojo descriptors.
[INFO] Applying mojo extractor for language: bsh
[INFO] Mojo extractor for language: bsh found 0 mojo descriptors.
[INFO] Applying mojo extractor for language: java-annotations
[INFO] Mojo extractor for language: java-annotations found 0 mojo descriptors.
[INFO] 
[INFO] --- maven-remote-resources-plugin:1.4:process (default) @ maven-scm-publish-plugin
---
[INFO] 
[INFO] --- maven-resources-plugin:2.6:resources (default-resources) @ maven-scm-publish-plugin
---
[INFO] Using 'UTF-8' encoding to copy filtered resources.
[INFO] Copying 2 resources
[INFO] Copying 3 resources
[INFO] 
[INFO] --- maven-compiler-plugin:3.0:compile (default-compile) @ maven-scm-publish-plugin
---
[INFO] Changes detected - recompiling the module!
[INFO] Compiling 4 source files to /x1/jenkins/jenkins-slave/workspace/maven-plugins-ITs-m3/maven-scm-publish-plugin/target/classes
[INFO] 
[INFO] --- maven-plugin-plugin:3.2:descriptor (mojo-descriptor) @ maven-scm-publish-plugin
---
[INFO] Using 'UTF-8' encoding to read mojo metadata.
[INFO] Applying mojo extractor for language: java
[INFO] Mojo extractor for language: java found 1 mojo descriptors.
[INFO] Applying mojo extractor for language: bsh
[INFO] Mojo extractor for language: bsh found 0 mojo descriptors.
[INFO] Applying mojo extractor for language: java-annotations
[INFO] Mojo extractor for language: java-annotations found 2 mojo descriptors.
[INFO] 
[INFO] --- maven-resources-plugin:2.6:testResources (default-testResources) @ maven-scm-publish-plugin
---
[INFO] Using 'UTF-8' encoding to copy filtered resources.
[INFO] skip non existing resourceDirectory /x1/jenkins/jenkins-slave/workspace/maven-plugins-ITs-m3/maven-scm-publish-plugin/src/test/resources
[INFO] Copying 3 resources
[INFO] 
[INFO] --- maven-compiler-plugin:3.0:testCompile (default-testCompile) @ maven-scm-publish-plugin
---
[INFO] No sources to compile
[INFO] 
[INFO] --- maven-surefire-plugin:2.12.4:test (default-test) @ maven-scm-publish-plugin ---
[INFO] 
[INFO] --- maven-jar-plugin:2.4:jar (default-jar) @ maven-scm-publish-plugin ---
[INFO] Building jar: /x1/jenkins/jenkins-slave/workspace/maven-plugins-ITs-m3/maven-scm-publish-plugin/target/maven-scm-publish-plugin-1.1-SNAPSHOT.jar
[INFO] 
[INFO] --- maven-plugin-plugin:3.2:addPluginArtifactMetadata (default-addPluginArtifactMetadata)
@ maven-scm-publish-plugin ---
[INFO] 
[INFO] --- maven-invoker-plugin:1.7:install (integration-test) @ maven-scm-publish-plugin
---
[INFO] Installing /x1/jenkins/jenkins-slave/workspace/maven-plugins-ITs-m3/maven-scm-publish-plugin/pom.xml
to /x1/jenkins/jenkins-slave/workspace/maven-plugins-ITs-m3/maven-scm-publish-plugin/target/local-repo/org/apache/maven/plugins/maven-scm-publish-plugin/1.1-SNAPSHOT/maven-scm-publish-plugin-1.1-SNAPSHOT.pom
[INFO] Installing /x1/jenkins/jenkins-slave/workspace/maven-plugins-ITs-m3/maven-scm-publish-plugin/target/maven-scm-publish-plugin-1.1-SNAPSHOT.jar
to /x1/jenkins/jenkins-slave/workspace/maven-plugins-ITs-m3/maven-scm-publish-plugin/target/local-repo/org/apache/maven/plugins/maven-scm-publish-plugin/1.1-SNAPSHOT/maven-scm-publish-plugin-1.1-SNAPSHOT.jar
[INFO] 
[INFO] --- maven-invoker-plugin:1.7:integration-test (integration-test) @ maven-scm-publish-plugin
---
[INFO] Building: 006-site-multi-module/pom.xml
[INFO] run script setup.bsh
[INFO] ..SUCCESS (24.9 s)
[INFO] Building: 005-site-lifecycle/pom.xml
[INFO] run script setup.bsh
[INFO] ..SUCCESS (20.2 s)
[INFO] Building: 004-publish-scm/pom.xml
[INFO] run script setup.bsh
[INFO] ..SUCCESS (20.0 s)
[INFO] Building: 003-lifecycle/pom.xml
[INFO] run script setup.bsh
[INFO] ..SUCCESS (10.0 s)
[INFO] 
[INFO] --- maven-invoker-plugin:1.7:verify (integration-test) @ maven-scm-publish-plugin ---
[INFO] -------------------------------------------------
[INFO] Build Summary:
[INFO]   Passed: 4, Failed: 0, Errors: 0, Skipped: 0
[INFO] -------------------------------------------------
[INFO] 
[INFO] --- maven-install-plugin:2.3.1:install (default-install) @ maven-scm-publish-plugin
---
[INFO] Installing /x1/jenkins/jenkins-slave/workspace/maven-plugins-ITs-m3/maven-scm-publish-plugin/target/maven-scm-publish-plugin-1.1-SNAPSHOT.jar
to /home/jenkins/.m2/repository/org/apache/maven/plugins/maven-scm-publish-plugin/1.1-SNAPSHOT/maven-scm-publish-plugin-1.1-SNAPSHOT.jar
[INFO] Installing /x1/jenkins/jenkins-slave/workspace/maven-plugins-ITs-m3/maven-scm-publish-plugin/pom.xml
to /home/jenkins/.m2/repository/org/apache/maven/plugins/maven-scm-publish-plugin/1.1-SNAPSHOT/maven-scm-publish-plugin-1.1-SNAPSHOT.pom
[INFO]                                                                         
[INFO] ------------------------------------------------------------------------
[INFO] Building Apache Maven GPG Plugin 1.6-SNAPSHOT
[INFO] ------------------------------------------------------------------------
[INFO] 
[INFO] --- maven-clean-plugin:2.5:clean (default-clean) @ maven-gpg-plugin ---
[INFO] Deleting /x1/jenkins/jenkins-slave/workspace/maven-plugins-ITs-m3/maven-gpg-plugin/target
[INFO] 
[INFO] --- maven-enforcer-plugin:1.0.1:enforce (ensure-no-container-api) @ maven-gpg-plugin
---
[INFO] 
[INFO] --- maven-plugin-plugin:3.2:helpmojo (generated-helpmojo) @ maven-gpg-plugin ---
[INFO] Using 'UTF-8' encoding to read mojo metadata.
[INFO] Applying mojo extractor for language: java
[INFO] Mojo extractor for language: java found 0 mojo descriptors.
[INFO] Applying mojo extractor for language: bsh
[INFO] Mojo extractor for language: bsh found 0 mojo descriptors.
[INFO] Applying mojo extractor for language: java-annotations
[INFO] Mojo extractor for language: java-annotations found 0 mojo descriptors.
[INFO] 
[INFO] --- maven-plugin-plugin:3.2:descriptor (default-descriptor) @ maven-gpg-plugin ---
[INFO] Using 'UTF-8' encoding to read mojo metadata.
[INFO] Applying mojo extractor for language: java
[INFO] Mojo extractor for language: java found 0 mojo descriptors.
[INFO] Applying mojo extractor for language: bsh
[INFO] Mojo extractor for language: bsh found 0 mojo descriptors.
[INFO] Applying mojo extractor for language: java-annotations
[INFO] Mojo extractor for language: java-annotations found 0 mojo descriptors.
[INFO] 
[INFO] --- maven-remote-resources-plugin:1.4:process (default) @ maven-gpg-plugin ---
[INFO] 
[INFO] --- maven-resources-plugin:2.6:resources (default-resources) @ maven-gpg-plugin ---
[INFO] Using 'UTF-8' encoding to copy filtered resources.
[INFO] skip non existing resourceDirectory /x1/jenkins/jenkins-slave/workspace/maven-plugins-ITs-m3/maven-gpg-plugin/src/main/resources
[INFO] Copying 3 resources
[INFO] 
[INFO] --- maven-compiler-plugin:3.0:compile (default-compile) @ maven-gpg-plugin ---
[INFO] Changes detected - recompiling the module!
[INFO] Compiling 9 source files to /x1/jenkins/jenkins-slave/workspace/maven-plugins-ITs-m3/maven-gpg-plugin/target/classes
[INFO] 
[INFO] --- maven-plugin-plugin:3.2:descriptor (generate-descriptor) @ maven-gpg-plugin ---
[INFO] Using 'UTF-8' encoding to read mojo metadata.
[INFO] Applying mojo extractor for language: java
[INFO] Mojo extractor for language: java found 0 mojo descriptors.
[INFO] Applying mojo extractor for language: bsh
[INFO] Mojo extractor for language: bsh found 0 mojo descriptors.
[INFO] Applying mojo extractor for language: java-annotations
[INFO] Mojo extractor for language: java-annotations found 3 mojo descriptors.
[INFO] 
[INFO] --- maven-resources-plugin:2.6:testResources (default-testResources) @ maven-gpg-plugin
---
[INFO] Using 'UTF-8' encoding to copy filtered resources.
[INFO] Copying 8 resources
[INFO] Copying 3 resources
[INFO] 
[INFO] --- maven-compiler-plugin:3.0:testCompile (default-testCompile) @ maven-gpg-plugin
---
[INFO] No sources to compile
[INFO] 
[INFO] --- maven-surefire-plugin:2.12.4:test (default-test) @ maven-gpg-plugin ---
[INFO] 
[INFO] --- maven-jar-plugin:2.4:jar (default-jar) @ maven-gpg-plugin ---
[INFO] Building jar: /x1/jenkins/jenkins-slave/workspace/maven-plugins-ITs-m3/maven-gpg-plugin/target/maven-gpg-plugin-1.6-SNAPSHOT.jar
[INFO] 
[INFO] --- maven-plugin-plugin:3.2:addPluginArtifactMetadata (default-addPluginArtifactMetadata)
@ maven-gpg-plugin ---
[INFO] 
[INFO] --- maven-invoker-plugin:1.7:install (integration-test) @ maven-gpg-plugin ---
[INFO] Installing /x1/jenkins/jenkins-slave/workspace/maven-plugins-ITs-m3/maven-gpg-plugin/pom.xml
to /x1/jenkins/jenkins-slave/workspace/maven-plugins-ITs-m3/maven-gpg-plugin/target/local-repo/org/apache/maven/plugins/maven-gpg-plugin/1.6-SNAPSHOT/maven-gpg-plugin-1.6-SNAPSHOT.pom
[INFO] Installing /x1/jenkins/jenkins-slave/workspace/maven-plugins-ITs-m3/maven-gpg-plugin/target/maven-gpg-plugin-1.6-SNAPSHOT.jar
to /x1/jenkins/jenkins-slave/workspace/maven-plugins-ITs-m3/maven-gpg-plugin/target/local-repo/org/apache/maven/plugins/maven-gpg-plugin/1.6-SNAPSHOT/maven-gpg-plugin-1.6-SNAPSHOT.jar
[INFO] 
[INFO] --- maven-invoker-plugin:1.7:integration-test (integration-test) @ maven-gpg-plugin
---
[INFO] Building: alternative-secret-keyring/pom.xml
[INFO] run script verify.bsh
[INFO] ..SUCCESS (3.5 s)
[INFO] Building: no-main-artifact/pom.xml
[INFO] run script verify.bsh
[INFO] ..SUCCESS (3.0 s)
[INFO] Building: sign-release/pom.xml
[INFO] run script verify.bsh
[INFO] ..SUCCESS (3.1 s)
[INFO] 
[INFO] --- maven-invoker-plugin:1.7:verify (integration-test) @ maven-gpg-plugin ---
[INFO] -------------------------------------------------
[INFO] Build Summary:
[INFO]   Passed: 3, Failed: 0, Errors: 0, Skipped: 0
[INFO] -------------------------------------------------
[INFO] 
[INFO] --- maven-install-plugin:2.3.1:install (default-install) @ maven-gpg-plugin ---
[INFO] Installing /x1/jenkins/jenkins-slave/workspace/maven-plugins-ITs-m3/maven-gpg-plugin/target/maven-gpg-plugin-1.6-SNAPSHOT.jar
to /home/jenkins/.m2/repository/org/apache/maven/plugins/maven-gpg-plugin/1.6-SNAPSHOT/maven-gpg-plugin-1.6-SNAPSHOT.jar
[INFO] Installing /x1/jenkins/jenkins-slave/workspace/maven-plugins-ITs-m3/maven-gpg-plugin/pom.xml
to /home/jenkins/.m2/repository/org/apache/maven/plugins/maven-gpg-plugin/1.6-SNAPSHOT/maven-gpg-plugin-1.6-SNAPSHOT.pom
[INFO]                                                                         
[INFO] ------------------------------------------------------------------------
[INFO] Building Apache Maven Plugins Aggregator 1-SNAPSHOT
[INFO] ------------------------------------------------------------------------
[INFO] 
[INFO] --- maven-clean-plugin:2.4.1:clean (default-clean) @ maven-plugins-aggregator ---
[INFO] Deleting /x1/jenkins/jenkins-slave/workspace/maven-plugins-ITs-m3/target
[INFO] 
[INFO] --- maven-remote-resources-plugin:1.1:process (default) @ maven-plugins-aggregator
---
[INFO] Setting property: classpath.resource.loader.class => 'org.codehaus.plexus.velocity.ContextClassLoaderResourceLoader'.
[INFO] Setting property: velocimacro.messages.on => 'false'.
[INFO] Setting property: resource.loader => 'classpath'.
[INFO] Setting property: resource.manager.logwhenfound => 'false'.
[INFO] 
[INFO] --- maven-install-plugin:2.3.1:install (default-install) @ maven-plugins-aggregator
---
[INFO] Installing /x1/jenkins/jenkins-slave/workspace/maven-plugins-ITs-m3/pom.xml to /home/jenkins/.m2/repository/org/apache/maven/plugins/maven-plugins-aggregator/1-SNAPSHOT/maven-plugins-aggregator-1-SNAPSHOT.pom
[INFO] ------------------------------------------------------------------------
[INFO] Reactor Summary:
[INFO] 
[INFO] Apache Maven Plugins .............................. SUCCESS [13.682s]
[INFO] Apache Maven ACR Plugin ........................... SUCCESS [52.300s]
[INFO] Apache Maven Ant Plugin ........................... SUCCESS [1:22.668s]
[INFO] Apache Maven AntRun Plugin ........................ SUCCESS [1:01.648s]
[INFO] Apache Maven Eclipse Plugin ....................... SUCCESS [8:07.060s]
[INFO] Apache Maven Assembly Plugin ...................... FAILURE [11:42.206s]
[INFO] Apache Maven Changelog Plugin ..................... SUCCESS [52.636s]
[INFO] Apache Maven Changes Plugin ....................... SUCCESS [1:11.519s]
[INFO] Apache Maven Checkstyle Plugin .................... SUCCESS [2:52.711s]
[INFO] Apache Maven Clean Plugin ......................... SUCCESS [23.954s]
[INFO] Apache Maven Compiler Plugin ...................... SUCCESS [1:33.529s]
[INFO] Apache Maven Dependency Plugin .................... SUCCESS [3:00.004s]
[INFO] Apache Maven Deploy Plugin ........................ SUCCESS [1:35.751s]
[INFO] Apache Maven DOAP Plugin .......................... SUCCESS [8.825s]
[INFO] Apache Maven Documentation Checker Plugin ......... SUCCESS [6.191s]
[INFO] Apache Maven EAR Plugin ........................... SUCCESS [4:52.186s]
[INFO] Apache Maven EJB Plugin ........................... SUCCESS [28.616s]
[INFO] Apache Maven Help Plugin .......................... SUCCESS [53.930s]
[INFO] Apache Maven Install Plugin ....................... SUCCESS [1:06.432s]
[INFO] Apache Maven JAR Plugin ........................... SUCCESS [1:19.195s]
[INFO] Apache Maven Jarsigner Plugin ..................... SUCCESS [40.845s]
[INFO] Apache Maven Javadoc Plugin ....................... SUCCESS [3:38.199s]
[INFO] Apache Maven Linkcheck Plugin ..................... SUCCESS [2.538s]
[INFO] Apache Maven Patch Plugin ......................... SUCCESS [15.336s]
[INFO] Apache Maven PDF Plugin ........................... SUCCESS [1:36.110s]
[INFO] Apache Maven PMD Plugin ........................... SUCCESS [2:08.611s]
[INFO] Apache Maven RAR Plugin ........................... SUCCESS [11.354s]
[INFO] Apache Maven Repository Plugin .................... SUCCESS [55.769s]
[INFO] Apache Maven Resources Plugin ..................... SUCCESS [1:04.758s]
[INFO] Apache Maven Site Plugin 3 ........................ SUCCESS [8:10.454s]
[INFO] Apache Maven Source Plugin ........................ SUCCESS [57.258s]
[INFO] Apache Maven Stage Plugin ......................... SUCCESS [2.019s]
[INFO] Apache Maven Toolchains Plugin .................... SUCCESS [1.624s]
[INFO] Apache Maven Verifier Plugin ...................... SUCCESS [16.013s]
[INFO] Apache Maven WAR Plugin ........................... SUCCESS [1:24.184s]
[INFO] Apache Maven Invoker Plugin ....................... SUCCESS [5:29.803s]
[INFO] Apache Maven Project Info Reports Plugin .......... SUCCESS [2:29.668s]
[INFO] Apache Maven Remote Resources Plugin .............. SUCCESS [1:13.447s]
[INFO] Apache Maven Shade Plugin ......................... SUCCESS [3:33.293s]
[INFO] Apache Maven SCM Publish Plugin ................... SUCCESS [1:23.684s]
[INFO] Apache Maven GPG Plugin ........................... SUCCESS [11.381s]
[INFO] Apache Maven Plugins Aggregator ................... SUCCESS [0.457s]
[INFO] ------------------------------------------------------------------------
[INFO] BUILD FAILURE
[INFO] ------------------------------------------------------------------------
[INFO] Total time: 1:19:34.488s
[INFO] Finished at: Thu Apr 03 03:06:05 GMT 2014
[INFO] Final Memory: 91M/192M
[INFO] ------------------------------------------------------------------------
[WARNING] The requested profile "apache.snapshots" could not be activated because it does
not exist.
[ERROR] Failed to execute goal org.apache.maven.plugins:maven-invoker-plugin:1.5:verify (integration-test)
on project maven-assembly-plugin: 1 build failed. -> [Help 1]
[ERROR] 
[ERROR] To see the full stack trace of the errors, re-run Maven with the -e switch.
[ERROR] Re-run Maven using the -X switch to enable full debug logging.
[ERROR] 
[ERROR] For more information about the errors and possible solutions, please read the following
articles:
[ERROR] [Help 1] http://cwiki.apache.org/confluence/display/MAVEN/MojoFailureException
[ERROR] 
[ERROR] After correcting the problems, you can resume the build with the command
[ERROR]   mvn <goals> -rf :maven-assembly-plugin
Build step 'Invoke top-level Maven targets' marked build as failure
Recording test results

Mime
View raw message