maven-notifications mailing list archives

Site index · List index
Message view « Date » · « Thread »
Top « Date » · « Thread »
From Apache Jenkins Server <jenk...@builds.apache.org>
Subject Build failed in Jenkins: maven-plugin-tools-windows #46
Date Mon, 02 Jun 2014 10:57:55 GMT
See <https://builds.apache.org/job/maven-plugin-tools-windows/46/changes>

Changes:

[tchemit] [MPLUGIN-266] Incorrect warning comment about deprecated @component usage for maven
objects

------------------------------------------
[...truncated 933 lines...]
[INFO] Installing F:\jenkins\jenkins-slave\workspace\maven-plugin-tools-windows\maven-plugin-tools-annotations\pom.xml
to F:\jenkins\jenkins-slave\workspace\maven-plugin-tools-windows\maven-plugin-plugin\target\local-repo\org\apache\maven\plugin-tools\maven-plugin-tools-annotations\3.4-SNAPSHOT\maven-plugin-tools-annotations-3.4-SNAPSHOT.pom
[INFO] Installing F:\jenkins\jenkins-slave\workspace\maven-plugin-tools-windows\maven-plugin-tools-annotations\target\maven-plugin-tools-annotations-3.4-SNAPSHOT.jar
to F:\jenkins\jenkins-slave\workspace\maven-plugin-tools-windows\maven-plugin-plugin\target\local-repo\org\apache\maven\plugin-tools\maven-plugin-tools-annotations\3.4-SNAPSHOT\maven-plugin-tools-annotations-3.4-SNAPSHOT.jar
[INFO] Installing F:\jenkins\jenkins-slave\workspace\maven-plugin-tools-windows\maven-plugin-tools-annotations\pom.xml
to F:\jenkins\jenkins-slave\workspace\maven-plugin-tools-windows\maven-plugin-plugin\target\local-repo\org\apache\maven\plugin-tools\maven-plugin-tools-annotations\3.4-SNAPSHOT\maven-plugin-tools-annotations-3.4-SNAPSHOT.pom
[INFO] Installing F:\jenkins\jenkins-slave\workspace\maven-plugin-tools-windows\maven-plugin-tools-annotations\target\maven-plugin-tools-annotations-3.4-SNAPSHOT-tests.jar
to F:\jenkins\jenkins-slave\workspace\maven-plugin-tools-windows\maven-plugin-plugin\target\local-repo\org\apache\maven\plugin-tools\maven-plugin-tools-annotations\3.4-SNAPSHOT\maven-plugin-tools-annotations-3.4-SNAPSHOT-tests.jar
[INFO] Installing F:\jenkins\jenkins-slave\workspace\maven-plugin-tools-windows\maven-plugin-tools-annotations\target\maven-plugin-tools-annotations-3.4-SNAPSHOT-test-sources.jar
to F:\jenkins\jenkins-slave\workspace\maven-plugin-tools-windows\maven-plugin-plugin\target\local-repo\org\apache\maven\plugin-tools\maven-plugin-tools-annotations\3.4-SNAPSHOT\maven-plugin-tools-annotations-3.4-SNAPSHOT-test-sources.jar
[INFO] Installing F:\jenkins\jenkins-slave\workspace\maven-plugin-tools-windows\maven-plugin-tools-model\pom.xml
to F:\jenkins\jenkins-slave\workspace\maven-plugin-tools-windows\maven-plugin-plugin\target\local-repo\org\apache\maven\plugin-tools\maven-plugin-tools-model\3.4-SNAPSHOT\maven-plugin-tools-model-3.4-SNAPSHOT.pom
[INFO] Installing F:\jenkins\jenkins-slave\workspace\maven-plugin-tools-windows\maven-plugin-tools-model\target\maven-plugin-tools-model-3.4-SNAPSHOT.jar
to F:\jenkins\jenkins-slave\workspace\maven-plugin-tools-windows\maven-plugin-plugin\target\local-repo\org\apache\maven\plugin-tools\maven-plugin-tools-model\3.4-SNAPSHOT\maven-plugin-tools-model-3.4-SNAPSHOT.jar
[INFO] Installing F:\jenkins\jenkins-slave\workspace\maven-plugin-tools-windows\maven-plugin-tools-model\pom.xml
to F:\jenkins\jenkins-slave\workspace\maven-plugin-tools-windows\maven-plugin-plugin\target\local-repo\org\apache\maven\plugin-tools\maven-plugin-tools-model\3.4-SNAPSHOT\maven-plugin-tools-model-3.4-SNAPSHOT.pom
[INFO] Installing F:\jenkins\jenkins-slave\workspace\maven-plugin-tools-windows\maven-plugin-tools-ant\pom.xml
to F:\jenkins\jenkins-slave\workspace\maven-plugin-tools-windows\maven-plugin-plugin\target\local-repo\org\apache\maven\plugin-tools\maven-plugin-tools-ant\3.4-SNAPSHOT\maven-plugin-tools-ant-3.4-SNAPSHOT.pom
[INFO] Installing F:\jenkins\jenkins-slave\workspace\maven-plugin-tools-windows\maven-plugin-tools-ant\target\maven-plugin-tools-ant-3.4-SNAPSHOT.jar
to F:\jenkins\jenkins-slave\workspace\maven-plugin-tools-windows\maven-plugin-plugin\target\local-repo\org\apache\maven\plugin-tools\maven-plugin-tools-ant\3.4-SNAPSHOT\maven-plugin-tools-ant-3.4-SNAPSHOT.jar
[INFO] Installing F:\jenkins\jenkins-slave\workspace\maven-plugin-tools-windows\maven-plugin-tools-ant\pom.xml
to F:\jenkins\jenkins-slave\workspace\maven-plugin-tools-windows\maven-plugin-plugin\target\local-repo\org\apache\maven\plugin-tools\maven-plugin-tools-ant\3.4-SNAPSHOT\maven-plugin-tools-ant-3.4-SNAPSHOT.pom
[INFO] Installing F:\jenkins\jenkins-slave\workspace\maven-plugin-tools-windows\maven-plugin-tools-beanshell\pom.xml
to F:\jenkins\jenkins-slave\workspace\maven-plugin-tools-windows\maven-plugin-plugin\target\local-repo\org\apache\maven\plugin-tools\maven-plugin-tools-beanshell\3.4-SNAPSHOT\maven-plugin-tools-beanshell-3.4-SNAPSHOT.pom
[INFO] Installing F:\jenkins\jenkins-slave\workspace\maven-plugin-tools-windows\maven-plugin-tools-beanshell\target\maven-plugin-tools-beanshell-3.4-SNAPSHOT.jar
to F:\jenkins\jenkins-slave\workspace\maven-plugin-tools-windows\maven-plugin-plugin\target\local-repo\org\apache\maven\plugin-tools\maven-plugin-tools-beanshell\3.4-SNAPSHOT\maven-plugin-tools-beanshell-3.4-SNAPSHOT.jar
[INFO] Installing F:\jenkins\jenkins-slave\workspace\maven-plugin-tools-windows\maven-plugin-tools-beanshell\pom.xml
to F:\jenkins\jenkins-slave\workspace\maven-plugin-tools-windows\maven-plugin-plugin\target\local-repo\org\apache\maven\plugin-tools\maven-plugin-tools-beanshell\3.4-SNAPSHOT\maven-plugin-tools-beanshell-3.4-SNAPSHOT.pom
[INFO] Installing F:\jenkins\jenkins-slave\workspace\maven-plugin-tools-windows\maven-plugin-plugin\pom.xml
to F:\jenkins\jenkins-slave\workspace\maven-plugin-tools-windows\maven-plugin-plugin\target\local-repo\org\apache\maven\plugins\maven-plugin-plugin\3.4-SNAPSHOT\maven-plugin-plugin-3.4-SNAPSHOT.pom
[INFO] Installing F:\jenkins\jenkins-slave\workspace\maven-plugin-tools-windows\maven-plugin-plugin\target\maven-plugin-plugin-3.4-SNAPSHOT.jar
to F:\jenkins\jenkins-slave\workspace\maven-plugin-tools-windows\maven-plugin-plugin\target\local-repo\org\apache\maven\plugins\maven-plugin-plugin\3.4-SNAPSHOT\maven-plugin-plugin-3.4-SNAPSHOT.jar
[INFO] 
[INFO] --- maven-invoker-plugin:1.8:run (integration-test) @ maven-plugin-plugin ---
[INFO] Building: annotation-with-inheritance\pom.xml
[INFO] run script verify.groovy
[INFO] ..SUCCESS (32.7 s)
[INFO] Building: annotation-with-inheritance-from-deps\pom.xml
[INFO] run script verify.groovy
[INFO] ..SUCCESS (27.8 s)
[INFO] Building: annotation-with-inheritance-reactor\pom.xml
[INFO] run script verify.groovy
[INFO] ..SUCCESS (17.8 s)
[INFO] Building: ant-basic\pom.xml
[INFO] run script verify.groovy
[INFO] ..SUCCESS (12.5 s)
[INFO] Building: ant-reference-parameter\pom.xml
[INFO] ..SUCCESS (13.8 s)
[INFO] Building: ant-simple-usage\pom.xml
[INFO] ..SUCCESS (8.2 s)
[INFO] Building: ant-since-maven-plugin\pom.xml
[INFO] ..SUCCESS (7.0 s)
[INFO] Building: beanshell-simple\pom.xml
[INFO] run script verify.groovy
[INFO] ..SUCCESS (10.7 s)
[INFO] Building: fix-maven-since-3.x\pom.xml
[INFO] run script verify.groovy
[INFO] ..SUCCESS (25.0 s)
[INFO] Building: help-basic\pom.xml
[INFO] run script verify.groovy
[INFO] ..FAILED (13.2 s)
[INFO]   The post-build script did not succeed. assert log == expected
       |   |  |
       |   |  [INFO] help 1.0-SNAPSHOT
       |   |    Tests generation and compilation of the help mojo.
       |   |   
       |   |  help:test
       |   |    Deprecated. As of 1.0, use the "quoted" goal instead.
       |   |   
       |   |    MOJO-DESCRIPTION. Some 'quotation' marks and backslashes '\\', some important
       |   |    javadoc
       |   |    and an inline link to AnotherMojo.
       |   |   
       |   |    Available parameters:
       |   |   
       |   |      defaultParam (Default: escape\backslash)
       |   |        This parameter uses 'quotation' marks and backslashes '\\' in its
       |   |        description. Those characters must be escaped in Java string literals.
       |   |   
       |   |      deprecatedParam
       |   |        Deprecated. As of version 1.0, use the {@link #defaultParam} instead.
       |   |   
       |   |        This parameter is deprecated.
       |   |   
       |   |      undocumentedParam
       |   |        
       |   |        Required: Yes
       |   |        User property: test.undocumented
       |   false
       [INFO] help 1.0-SNAPSHOT
         Tests generation and compilation of the help mojo.
        
       help:test
         Deprecated. As of 1.0, use the "quoted" goal instead.
        
         MOJO-DESCRIPTION. Some 'quotation' marks and backslashes '\\', some important
         javadoc
         and an inline link to AnotherMojo.
        
         Available parameters:
        
           defaultParam (Default: escape\backslash)
             This parameter uses 'quotation' marks and backslashes '\\' in its
             description. Those characters must be escaped in Java string literals.
        
           deprecatedParam
             Deprecated. As of version 1.0, use the {@link #defaultParam} instead.
        
             This parameter is deprecated.
        
           undocumentedParam
             
             Required: Yes
             User property: test.undocumented
[INFO] Building: help-package\pom.xml
[INFO] run script verify.bsh
[INFO] ..SUCCESS (8.6 s)
[INFO] Building: ignore-plugin-class-realm\pom.xml
[INFO] ..SUCCESS (15.1 s)
[INFO] Building: java-basic\pom.xml
[INFO] run script verify.groovy
[INFO] ..SUCCESS (12.8 s)
[INFO] Building: java-basic-annotations\pom.xml
[INFO] run script verify.groovy
[INFO] ..SUCCESS (18.6 s)
[INFO] Building: java-basic-annotations-jdk8\pom.xml
[INFO] ..SKIPPED due to JRE version
[INFO] Building: mplugin-187\pom.xml
[INFO] ..SUCCESS (5.8 s)
[INFO] Building: mplugin-191\pom.xml
[INFO] run script verify.groovy
[INFO] ..SUCCESS (10.4 s)
[INFO] Building: mplugin-223\pom.xml
[INFO] run script verify.groovy
[INFO] ..SUCCESS (9.5 s)
[INFO] Building: packaging-jar\pom.xml
[INFO] run script verify.groovy
[INFO] ..SUCCESS (11.4 s)
[INFO] Building: plugin-info-jdk-default-version\pom.xml
[INFO] run script verify.groovy
[INFO] ..SUCCESS (23.4 s)
[INFO] Building: plugin-report\pom.xml
[INFO] run script verify.bsh
[INFO] ..SUCCESS (36.4 s)
[INFO] Building: plugin-report-annotations\pom.xml
[INFO] run script verify.bsh
[INFO] ..SUCCESS (15.8 s)
[INFO] Building: skip\pom.xml
[INFO] run script verify.groovy
[INFO] ..SUCCESS (8.1 s)
[INFO] Building: source-encoding\pom.xml
[INFO] run script verify.groovy
[INFO] ..SUCCESS (9.2 s)
[INFO] -------------------------------------------------
[INFO] Build Summary:
[INFO]   Passed: 22, Failed: 1, Errors: 0, Skipped: 1
[INFO] -------------------------------------------------
[ERROR] The following builds failed:
[ERROR] *  help-basic\pom.xml
[INFO] -------------------------------------------------
[INFO] ------------------------------------------------------------------------
[INFO] Reactor Summary:
[INFO] 
[INFO] Maven Plugin Tools ................................ SUCCESS [13.254s]
[INFO] Maven Script Mojo Support ......................... SUCCESS [1.333s]
[INFO] Maven Ant Mojo Support ............................ SUCCESS [13.459s]
[INFO] Maven Beanshell Mojo Support ...................... SUCCESS [2.592s]
[INFO] Maven Plugin Tools APIs ........................... SUCCESS [5.880s]
[INFO] Maven Plugin Tools Generators ..................... SUCCESS [8.640s]
[INFO] Maven Plugin Tool for Java with Mojo Javadoc Tags . SUCCESS [8.665s]
[INFO] Maven Plugin Tools Javadoc ........................ SUCCESS [14.755s]
[INFO] Maven Plugin Tools Java 5 Annotations ............. SUCCESS [0.793s]
[INFO] Maven Plugin Tool for Java with Annotations ....... SUCCESS [10.768s]
[INFO] Maven Plugin Metadata Model ....................... SUCCESS [3.626s]
[INFO] Maven Plugin Tool for Ant ......................... SUCCESS [4.297s]
[INFO] Maven Plugin Tool for Beanshell ................... SUCCESS [1.234s]
[INFO] Maven Plugin Plugin ............................... FAILURE [6:09.330s]
[INFO] ------------------------------------------------------------------------
[INFO] BUILD FAILURE
[INFO] ------------------------------------------------------------------------
[INFO] Total time: 7:50.439s
[INFO] Finished at: Mon Jun 02 03:12:19 PDT 2014
[INFO] Final Memory: 37M/89M
[INFO] ------------------------------------------------------------------------
Waiting for Jenkins to finish collecting data
[ERROR] Failed to execute goal org.apache.maven.plugins:maven-invoker-plugin:1.8:run (integration-test)
on project maven-plugin-plugin: 1 build failed. See console output above for details. ->
[Help 1]
org.apache.maven.lifecycle.LifecycleExecutionException: Failed to execute goal org.apache.maven.plugins:maven-invoker-plugin:1.8:run
(integration-test) on project maven-plugin-plugin: 1 build failed. See console output above
for details.
	at org.apache.maven.lifecycle.internal.MojoExecutor.execute(MojoExecutor.java:213)
	at org.apache.maven.lifecycle.internal.MojoExecutor.execute(MojoExecutor.java:153)
	at org.apache.maven.lifecycle.internal.MojoExecutor.execute(MojoExecutor.java:145)
	at org.apache.maven.lifecycle.internal.LifecycleModuleBuilder.buildProject(LifecycleModuleBuilder.java:84)
	at org.apache.maven.lifecycle.internal.LifecycleModuleBuilder.buildProject(LifecycleModuleBuilder.java:59)
	at org.apache.maven.lifecycle.internal.LifecycleStarter.singleThreadedBuild(LifecycleStarter.java:183)
	at org.apache.maven.lifecycle.internal.LifecycleStarter.execute(LifecycleStarter.java:161)
	at org.apache.maven.DefaultMaven.doExecute(DefaultMaven.java:320)
	at org.apache.maven.DefaultMaven.execute(DefaultMaven.java:156)
	at org.jvnet.hudson.maven3.launcher.Maven3Launcher.main(Maven3Launcher.java:117)
	at sun.reflect.NativeMethodAccessorImpl.invoke0(Native Method)
	at sun.reflect.NativeMethodAccessorImpl.invoke(NativeMethodAccessorImpl.java:39)
	at sun.reflect.DelegatingMethodAccessorImpl.invoke(DelegatingMethodAccessorImpl.java:25)
	at java.lang.reflect.Method.invoke(Method.java:597)
	at org.codehaus.plexus.classworlds.launcher.Launcher.launchStandard(Launcher.java:329)
	at org.codehaus.plexus.classworlds.launcher.Launcher.launch(Launcher.java:239)
	at org.jvnet.hudson.maven3.agent.Maven3Main.launch(Maven3Main.java:178)
	at sun.reflect.NativeMethodAccessorImpl.invoke0(Native Method)
	at sun.reflect.NativeMethodAccessorImpl.invoke(NativeMethodAccessorImpl.java:39)
	at sun.reflect.DelegatingMethodAccessorImpl.invoke(DelegatingMethodAccessorImpl.java:25)
	at java.lang.reflect.Method.invoke(Method.java:597)
	at hudson.maven.Maven3Builder.call(Maven3Builder.java:134)
	at hudson.maven.Maven3Builder.call(Maven3Builder.java:69)
	at hudson.remoting.UserRequest.perform(UserRequest.java:118)
	at hudson.remoting.UserRequest.perform(UserRequest.java:48)
[JENKINS] Archiving F:\jenkins\jenkins-slave\workspace\maven-plugin-tools-windows\maven-plugin-tools-api\pom.xml
to org.apache.maven.plugin-tools/maven-plugin-tools-api/3.4-SNAPSHOT/maven-plugin-tools-api-3.4-SNAPSHOT.pom
[JENKINS] Archiving F:\jenkins\jenkins-slave\workspace\maven-plugin-tools-windows\maven-plugin-tools-api\target\maven-plugin-tools-api-3.4-SNAPSHOT.jar
to org.apache.maven.plugin-tools/maven-plugin-tools-api/3.4-SNAPSHOT/maven-plugin-tools-api-3.4-SNAPSHOT.jar
	at hudson.remoting.Request$2.run(Request.java:328)
	at hudson.remoting.InterceptingExecutorService$1.call(InterceptingExecutorService.java:72)
	at java.util.concurrent.FutureTask$Sync.innerRun(FutureTask.java:303)
	at java.util.concurrent.FutureTask.run(FutureTask.java:138)
	at java.util.concurrent.ThreadPoolExecutor$Worker.runTask(ThreadPoolExecutor.java:886)
	at java.util.concurrent.ThreadPoolExecutor$Worker.run(ThreadPoolExecutor.java:908)
	at java.lang.Thread.run(Thread.java:662)
Caused by: org.apache.maven.plugin.MojoFailureException: 1 build failed. See console output
above for details.
	at org.apache.maven.plugin.invoker.InvokerSession.handleFailures(InvokerSession.java:258)
	at org.apache.maven.plugin.invoker.InvokerMojo.processResults(InvokerMojo.java:61)
	at org.apache.maven.plugin.invoker.AbstractInvokerMojo.execute(AbstractInvokerMojo.java:725)
	at org.apache.maven.plugin.DefaultBuildPluginManager.executeMojo(DefaultBuildPluginManager.java:101)
	at org.apache.maven.lifecycle.internal.MojoExecutor.execute(MojoExecutor.java:209)
	... 31 more
[ERROR] 
[ERROR] Re-run Maven using the -X switch to enable full debug logging.
[ERROR] 
[ERROR] For more information about the errors and possible solutions, please read the following
articles:
[ERROR] [Help 1] http://cwiki.apache.org/confluence/display/MAVEN/MojoFailureException
[ERROR] 
[ERROR] After correcting the problems, you can resume the build with the command
[ERROR]   mvn <goals> -rf :maven-plugin-plugin
[JENKINS] Archiving F:\jenkins\jenkins-slave\workspace\maven-plugin-tools-windows\maven-plugin-tools-generators\pom.xml
to org.apache.maven.plugin-tools/maven-plugin-tools-generators/3.4-SNAPSHOT/maven-plugin-tools-generators-3.4-SNAPSHOT.pom
[JENKINS] Archiving F:\jenkins\jenkins-slave\workspace\maven-plugin-tools-windows\maven-plugin-tools-generators\target\maven-plugin-tools-generators-3.4-SNAPSHOT.jar
to org.apache.maven.plugin-tools/maven-plugin-tools-generators/3.4-SNAPSHOT/maven-plugin-tools-generators-3.4-SNAPSHOT.jar
[JENKINS] Archiving F:\jenkins\jenkins-slave\workspace\maven-plugin-tools-windows\maven-plugin-annotations\pom.xml
to org.apache.maven.plugin-tools/maven-plugin-annotations/3.4-SNAPSHOT/maven-plugin-annotations-3.4-SNAPSHOT.pom
[JENKINS] Archiving F:\jenkins\jenkins-slave\workspace\maven-plugin-tools-windows\maven-plugin-annotations\target\maven-plugin-annotations-3.4-SNAPSHOT.jar
to org.apache.maven.plugin-tools/maven-plugin-annotations/3.4-SNAPSHOT/maven-plugin-annotations-3.4-SNAPSHOT.jar
[JENKINS] Archiving F:\jenkins\jenkins-slave\workspace\maven-plugin-tools-windows\maven-script\pom.xml
to org.apache.maven.plugin-tools/maven-script/3.4-SNAPSHOT/maven-script-3.4-SNAPSHOT.pom
[JENKINS] Archiving F:\jenkins\jenkins-slave\workspace\maven-plugin-tools-windows\maven-script\target\maven-script-3.4-SNAPSHOT-site.xml
to org.apache.maven.plugin-tools/maven-script/3.4-SNAPSHOT/maven-script-3.4-SNAPSHOT-site.xml
[JENKINS] Archiving F:\jenkins\jenkins-slave\workspace\maven-plugin-tools-windows\maven-plugin-plugin\pom.xml
to org.apache.maven.plugins/maven-plugin-plugin/3.4-SNAPSHOT/maven-plugin-plugin-3.4-SNAPSHOT.pom
[JENKINS] Archiving F:\jenkins\jenkins-slave\workspace\maven-plugin-tools-windows\maven-plugin-plugin\target\maven-plugin-plugin-3.4-SNAPSHOT.jar
to org.apache.maven.plugins/maven-plugin-plugin/3.4-SNAPSHOT/maven-plugin-plugin-3.4-SNAPSHOT.jar
[JENKINS] Archiving <https://builds.apache.org/job/maven-plugin-tools-windows/ws/pom.xml>
to org.apache.maven.plugin-tools/maven-plugin-tools/3.4-SNAPSHOT/maven-plugin-tools-3.4-SNAPSHOT.pom
[JENKINS] Archiving <https://builds.apache.org/job/maven-plugin-tools-windows/ws/target\maven-plugin-tools-3.4-SNAPSHOT-site.xml>
to org.apache.maven.plugin-tools/maven-plugin-tools/3.4-SNAPSHOT/maven-plugin-tools-3.4-SNAPSHOT-site.xml
[JENKINS] Archiving F:\jenkins\jenkins-slave\workspace\maven-plugin-tools-windows\maven-plugin-tools-model\pom.xml
to org.apache.maven.plugin-tools/maven-plugin-tools-model/3.4-SNAPSHOT/maven-plugin-tools-model-3.4-SNAPSHOT.pom
[JENKINS] Archiving F:\jenkins\jenkins-slave\workspace\maven-plugin-tools-windows\maven-plugin-tools-model\target\maven-plugin-tools-model-3.4-SNAPSHOT.jar
to org.apache.maven.plugin-tools/maven-plugin-tools-model/3.4-SNAPSHOT/maven-plugin-tools-model-3.4-SNAPSHOT.jar
[JENKINS] Archiving F:\jenkins\jenkins-slave\workspace\maven-plugin-tools-windows\maven-plugin-tools-ant\pom.xml
to org.apache.maven.plugin-tools/maven-plugin-tools-ant/3.4-SNAPSHOT/maven-plugin-tools-ant-3.4-SNAPSHOT.pom
[JENKINS] Archiving F:\jenkins\jenkins-slave\workspace\maven-plugin-tools-windows\maven-plugin-tools-ant\target\maven-plugin-tools-ant-3.4-SNAPSHOT.jar
to org.apache.maven.plugin-tools/maven-plugin-tools-ant/3.4-SNAPSHOT/maven-plugin-tools-ant-3.4-SNAPSHOT.jar
[JENKINS] Archiving F:\jenkins\jenkins-slave\workspace\maven-plugin-tools-windows\maven-plugin-tools-annotations\pom.xml
to org.apache.maven.plugin-tools/maven-plugin-tools-annotations/3.4-SNAPSHOT/maven-plugin-tools-annotations-3.4-SNAPSHOT.pom
[JENKINS] Archiving F:\jenkins\jenkins-slave\workspace\maven-plugin-tools-windows\maven-plugin-tools-annotations\target\maven-plugin-tools-annotations-3.4-SNAPSHOT.jar
to org.apache.maven.plugin-tools/maven-plugin-tools-annotations/3.4-SNAPSHOT/maven-plugin-tools-annotations-3.4-SNAPSHOT.jar
[JENKINS] Archiving F:\jenkins\jenkins-slave\workspace\maven-plugin-tools-windows\maven-plugin-tools-annotations\target\maven-plugin-tools-annotations-3.4-SNAPSHOT-tests.jar
to org.apache.maven.plugin-tools/maven-plugin-tools-annotations/3.4-SNAPSHOT/maven-plugin-tools-annotations-3.4-SNAPSHOT-tests.jar
[JENKINS] Archiving F:\jenkins\jenkins-slave\workspace\maven-plugin-tools-windows\maven-plugin-tools-annotations\target\maven-plugin-tools-annotations-3.4-SNAPSHOT-test-sources.jar
to org.apache.maven.plugin-tools/maven-plugin-tools-annotations/3.4-SNAPSHOT/maven-plugin-tools-annotations-3.4-SNAPSHOT-test-sources.jar
[JENKINS] Archiving F:\jenkins\jenkins-slave\workspace\maven-plugin-tools-windows\maven-script\maven-script-ant\pom.xml
to org.apache.maven.plugin-tools/maven-script-ant/3.4-SNAPSHOT/maven-script-ant-3.4-SNAPSHOT.pom
[JENKINS] Archiving F:\jenkins\jenkins-slave\workspace\maven-plugin-tools-windows\maven-script\maven-script-ant\target\maven-script-ant-3.4-SNAPSHOT.jar
to org.apache.maven.plugin-tools/maven-script-ant/3.4-SNAPSHOT/maven-script-ant-3.4-SNAPSHOT.jar
[JENKINS] Archiving F:\jenkins\jenkins-slave\workspace\maven-plugin-tools-windows\maven-plugin-tools-beanshell\pom.xml
to org.apache.maven.plugin-tools/maven-plugin-tools-beanshell/3.4-SNAPSHOT/maven-plugin-tools-beanshell-3.4-SNAPSHOT.pom
[JENKINS] Archiving F:\jenkins\jenkins-slave\workspace\maven-plugin-tools-windows\maven-plugin-tools-beanshell\target\maven-plugin-tools-beanshell-3.4-SNAPSHOT.jar
to org.apache.maven.plugin-tools/maven-plugin-tools-beanshell/3.4-SNAPSHOT/maven-plugin-tools-beanshell-3.4-SNAPSHOT.jar
[JENKINS] Archiving F:\jenkins\jenkins-slave\workspace\maven-plugin-tools-windows\maven-plugin-tools-java\pom.xml
to org.apache.maven.plugin-tools/maven-plugin-tools-java/3.4-SNAPSHOT/maven-plugin-tools-java-3.4-SNAPSHOT.pom
[JENKINS] Archiving F:\jenkins\jenkins-slave\workspace\maven-plugin-tools-windows\maven-plugin-tools-java\target\maven-plugin-tools-java-3.4-SNAPSHOT.jar
to org.apache.maven.plugin-tools/maven-plugin-tools-java/3.4-SNAPSHOT/maven-plugin-tools-java-3.4-SNAPSHOT.jar
[JENKINS] Archiving F:\jenkins\jenkins-slave\workspace\maven-plugin-tools-windows\maven-script\maven-script-beanshell\pom.xml
to org.apache.maven.plugin-tools/maven-script-beanshell/3.4-SNAPSHOT/maven-script-beanshell-3.4-SNAPSHOT.pom
[JENKINS] Archiving F:\jenkins\jenkins-slave\workspace\maven-plugin-tools-windows\maven-script\maven-script-beanshell\target\maven-script-beanshell-3.4-SNAPSHOT.jar
to org.apache.maven.plugin-tools/maven-script-beanshell/3.4-SNAPSHOT/maven-script-beanshell-3.4-SNAPSHOT.jar
[JENKINS] Archiving F:\jenkins\jenkins-slave\workspace\maven-plugin-tools-windows\maven-plugin-tools-javadoc\pom.xml
to org.apache.maven.plugin-tools/maven-plugin-tools-javadoc/3.4-SNAPSHOT/maven-plugin-tools-javadoc-3.4-SNAPSHOT.pom
[JENKINS] Archiving F:\jenkins\jenkins-slave\workspace\maven-plugin-tools-windows\maven-plugin-tools-javadoc\target\maven-plugin-tools-javadoc-3.4-SNAPSHOT.jar
to org.apache.maven.plugin-tools/maven-plugin-tools-javadoc/3.4-SNAPSHOT/maven-plugin-tools-javadoc-3.4-SNAPSHOT.jar
channel stopped

Mime
View raw message