maven-notifications mailing list archives

Site index · List index
Message view « Date » · « Thread »
Top « Date » · « Thread »
From Apache Jenkins Server <jenk...@builds.apache.org>
Subject Build failed in Jenkins: core-it-maven-3-win #598
Date Fri, 20 Jun 2014 15:36:27 GMT
See <https://builds.apache.org/job/core-it-maven-3-win/598/changes>

Changes:

[krosenvold] Added synchronization around copying system properties since they are a singleton,

------------------------------------------
[...truncated 2647 lines...]
     [java] [main] INFO org.codehaus.modello.maven.ModelloXpp3ReaderMojo - outputDirectory:
F:\ws\m3-its\maven-3-trunk\maven-compat\target\generated-sources\modello
     [java] [main] INFO org.codehaus.modello.maven.ModelloXpp3ReaderMojo - Working on model:
src/main/mdo/profiles.mdo
     [java] [main] INFO org.codehaus.modello.maven.ModelloXpp3ReaderMojo - Generating current
version: 1.0.0
     [java] [main] INFO org.codehaus.modello.maven.ModelloXpp3ReaderMojo - Working on model:
src/main/mdo/paramdoc.mdo
     [java] [main] INFO org.codehaus.modello.maven.ModelloXpp3ReaderMojo - Generating current
version: 1.0.0
     [java] [main] INFO org.apache.maven.cli.event.ExecutionEventLogger - 
     [java] [main] INFO org.apache.maven.cli.event.ExecutionEventLogger - --- modello-maven-plugin:1.8.1:xpp3-writer
(standard) @ maven-compat ---
     [java] [main] INFO org.codehaus.modello.maven.ModelloXpp3WriterMojo - outputDirectory:
F:\ws\m3-its\maven-3-trunk\maven-compat\target\generated-sources\modello
     [java] [main] INFO org.codehaus.modello.maven.ModelloXpp3WriterMojo - Working on model:
src/main/mdo/profiles.mdo
     [java] [main] INFO org.codehaus.modello.maven.ModelloXpp3WriterMojo - Generating current
version: 1.0.0
     [java] [main] INFO org.codehaus.modello.maven.ModelloXpp3WriterMojo - Working on model:
src/main/mdo/paramdoc.mdo
     [java] [main] INFO org.codehaus.modello.maven.ModelloXpp3WriterMojo - Generating current
version: 1.0.0
     [java] [main] INFO org.apache.maven.cli.event.ExecutionEventLogger - 
     [java] [main] INFO org.apache.maven.cli.event.ExecutionEventLogger - --- maven-remote-resources-plugin:1.5:process
(default) @ maven-compat ---
     [java] [main] INFO org.apache.maven.cli.event.ExecutionEventLogger - 
     [java] [main] INFO org.apache.maven.cli.event.ExecutionEventLogger - --- maven-resources-plugin:2.6:resources
(default-resources) @ maven-compat ---
     [java] [main] INFO org.apache.maven.shared.filtering.DefaultMavenResourcesFiltering -
Using 'UTF-8' encoding to copy filtered resources.
     [java] [main] INFO org.apache.maven.shared.filtering.DefaultMavenResourcesFiltering -
Copying 4 resources
     [java] [main] INFO org.apache.maven.shared.filtering.DefaultMavenResourcesFiltering -
Copying 3 resources
     [java] [main] INFO org.apache.maven.cli.event.ExecutionEventLogger - 
     [java] [main] INFO org.apache.maven.cli.event.ExecutionEventLogger - --- maven-compiler-plugin:3.1:compile
(default-compile) @ maven-compat ---
     [java] [main] INFO org.apache.maven.plugin.compiler.CompilerMojo - Changes detected -
recompiling the module!
     [java] [main] INFO org.codehaus.plexus.compiler.javac.JavacCompiler - Compiling 146 source
files to F:\ws\m3-its\maven-3-trunk\maven-compat\target\classes
     [java] [main] WARN org.apache.maven.plugin.compiler.CompilerMojo - Note: Some input files
use or override a deprecated API.
     [java] [main] WARN org.apache.maven.plugin.compiler.CompilerMojo - Note: Recompile with
-Xlint:deprecation for details.
     [java] [main] WARN org.apache.maven.plugin.compiler.CompilerMojo - Note: Some input files
use unchecked or unsafe operations.
     [java] [main] WARN org.apache.maven.plugin.compiler.CompilerMojo - Note: Recompile with
-Xlint:unchecked for details.
     [java] [main] INFO org.apache.maven.cli.event.ExecutionEventLogger - 
     [java] [main] INFO org.apache.maven.cli.event.ExecutionEventLogger - --- animal-sniffer-maven-plugin:1.10:check
(check-java-1.6-compat) @ maven-compat ---
     [java] [main] INFO org.codehaus.mojo.animal_sniffer.maven.CheckSignatureMojo - Checking
unresolved references to org.codehaus.mojo.signature:java16:1.1
     [java] [main] INFO org.apache.maven.cli.event.ExecutionEventLogger - 
     [java] [main] INFO org.apache.maven.cli.event.ExecutionEventLogger - --- plexus-component-metadata:1.5.5:generate-metadata
(default) @ maven-compat ---
     [java] [main] INFO org.codehaus.plexus.metadata.DefaultMetadataGenerator - Discovered
34 component descriptors(s)
     [java] [main] INFO org.apache.maven.cli.event.ExecutionEventLogger - 
     [java] [main] INFO org.apache.maven.cli.event.ExecutionEventLogger - --- maven-resources-plugin:2.6:testResources
(default-testResources) @ maven-compat ---
     [java] [main] INFO org.apache.maven.shared.filtering.DefaultMavenResourcesFiltering -
Using 'UTF-8' encoding to copy filtered resources.
     [java] [main] INFO org.apache.maven.shared.filtering.DefaultMavenResourcesFiltering -
Copying 156 resources
     [java] [main] INFO org.apache.maven.shared.filtering.DefaultMavenResourcesFiltering -
Copying 3 resources
     [java] [main] INFO org.apache.maven.cli.event.ExecutionEventLogger - 
     [java] [main] INFO org.apache.maven.cli.event.ExecutionEventLogger - --- maven-compiler-plugin:3.1:testCompile
(default-testCompile) @ maven-compat ---
     [java] [main] INFO org.apache.maven.plugin.compiler.TestCompilerMojo - Changes detected
- recompiling the module!
     [java] [main] INFO org.codehaus.plexus.compiler.javac.JavacCompiler - Compiling 72 source
files to F:\ws\m3-its\maven-3-trunk\maven-compat\target\test-classes
     [java] [main] WARN org.apache.maven.plugin.compiler.TestCompilerMojo - Note: Some input
files use or override a deprecated API.
     [java] [main] WARN org.apache.maven.plugin.compiler.TestCompilerMojo - Note: Recompile
with -Xlint:deprecation for details.
     [java] [main] WARN org.apache.maven.plugin.compiler.TestCompilerMojo - Note: Some input
files use unchecked or unsafe operations.
     [java] [main] WARN org.apache.maven.plugin.compiler.TestCompilerMojo - Note: Recompile
with -Xlint:unchecked for details.
     [java] [main] INFO org.apache.maven.cli.event.ExecutionEventLogger - 
     [java] [main] INFO org.apache.maven.cli.event.ExecutionEventLogger - --- plexus-component-metadata:1.5.5:generate-test-metadata
(default) @ maven-compat ---
     [java] [main] INFO org.codehaus.plexus.metadata.DefaultMetadataGenerator - Discovered
12 component descriptors(s)
     [java] [main] INFO org.apache.maven.cli.event.ExecutionEventLogger - 
     [java] [main] INFO org.apache.maven.cli.event.ExecutionEventLogger - --- maven-surefire-plugin:2.16:test
(default-test) @ maven-compat ---
     [java] [main] INFO org.apache.maven.plugin.surefire.SurefirePlugin - Tests are skipped.
     [java] [main] INFO org.apache.maven.cli.event.ExecutionEventLogger - 
     [java] [main] INFO org.apache.maven.cli.event.ExecutionEventLogger - --- maven-jar-plugin:2.4:jar
(default-jar) @ maven-compat ---
     [java] [main] INFO org.codehaus.plexus.archiver.jar.JarArchiver - Building jar: F:\ws\m3-its\maven-3-trunk\maven-compat\target\maven-compat-3.2.3-SNAPSHOT.jar
     [java] [main] INFO org.apache.maven.cli.event.ExecutionEventLogger - 
     [java] [main] INFO org.apache.maven.cli.event.ExecutionEventLogger - --- maven-site-plugin:3.3:attach-descriptor
(attach-descriptor) @ maven-compat ---
     [java] [main] INFO org.apache.maven.cli.event.ExecutionEventLogger - 
     [java] [main] INFO org.apache.maven.cli.event.ExecutionEventLogger - --- maven-install-plugin:2.5.1:install
(default-install) @ maven-compat ---
     [java] [main] INFO org.apache.maven.DefaultMaven - Installing F:\ws\m3-its\maven-3-trunk\maven-compat\target\maven-compat-3.2.3-SNAPSHOT.jar
to <https://builds.apache.org/job/core-it-maven-3-win/ws/.repository\org\apache\maven\maven-compat\3.2.3-SNAPSHOT\maven-compat-3.2.3-SNAPSHOT.jar>
     [java] [main] INFO org.apache.maven.DefaultMaven - Installing F:\ws\m3-its\maven-3-trunk\maven-compat\pom.xml
to <https://builds.apache.org/job/core-it-maven-3-win/ws/.repository\org\apache\maven\maven-compat\3.2.3-SNAPSHOT\maven-compat-3.2.3-SNAPSHOT.pom>
     [java] [main] INFO org.apache.maven.cli.event.ExecutionEventLogger -                
                                                        
     [java] [main] INFO org.apache.maven.cli.event.ExecutionEventLogger - ------------------------------------------------------------------------
     [java] [main] INFO org.apache.maven.cli.event.ExecutionEventLogger - Building Maven Embedder
3.2.3-SNAPSHOT
     [java] [main] INFO org.apache.maven.cli.event.ExecutionEventLogger - ------------------------------------------------------------------------
     [java] [main] INFO org.apache.maven.cli.event.ExecutionEventLogger - 
     [java] [main] INFO org.apache.maven.cli.event.ExecutionEventLogger - --- maven-clean-plugin:2.5:clean
(default-clean) @ maven-embedder ---
     [java] [main] INFO org.apache.maven.plugin.clean.CleanMojo - Deleting F:\ws\m3-its\maven-3-trunk\maven-embedder\target
     [java] [main] INFO org.apache.maven.cli.event.ExecutionEventLogger - 
     [java] [main] INFO org.apache.maven.cli.event.ExecutionEventLogger - --- maven-enforcer-plugin:1.3.1:enforce
(enforce-bytecode-version) @ maven-embedder ---
     [java] [main] INFO org.apache.maven.cli.event.ExecutionEventLogger - 
     [java] [main] INFO org.apache.maven.cli.event.ExecutionEventLogger - --- maven-enforcer-plugin:1.3.1:enforce
(ban-known-bad-maven-versions) @ maven-embedder ---
     [java] [main] INFO org.apache.maven.cli.event.ExecutionEventLogger - 
     [java] [main] INFO org.apache.maven.cli.event.ExecutionEventLogger - --- apache-rat-plugin:0.10:check
(check) @ maven-embedder ---
     [java] [main] INFO org.apache.rat.mp.RatCheckMojo - 51 implicit excludes (use -debug
for more details).
     [java] [main] INFO org.apache.rat.mp.RatCheckMojo - Exclude: src/test/resources*/**
     [java] [main] INFO org.apache.rat.mp.RatCheckMojo - Exclude: src/test/projects/**
     [java] [main] INFO org.apache.rat.mp.RatCheckMojo - Exclude: src/test/remote-repo/**
     [java] [main] INFO org.apache.rat.mp.RatCheckMojo - Exclude: **/*.odg
     [java] [main] INFO org.apache.rat.mp.RatCheckMojo - Exclude: src/main/resources/META-INF/MANIFEST.MF
     [java] [main] INFO org.apache.rat.mp.RatCheckMojo - Exclude: src/test/*-projects/**
     [java] [main] INFO org.apache.rat.mp.RatCheckMojo - Exclude: src/test/*-project/**
     [java] [main] INFO org.apache.rat.mp.RatCheckMojo - Exclude: src/test/plugin-version-references/**
     [java] [main] INFO org.apache.rat.mp.RatCheckMojo - Exclude: bootstrap/**
     [java] [main] INFO org.apache.rat.mp.RatCheckMojo - Exclude: README.bootstrap.txt
     [java] [main] INFO org.apache.rat.mp.RatCheckMojo - Exclude: .repository/**
     [java] [main] INFO org.apache.rat.mp.RatCheckMojo - 35 resources included (use -debug
for more details)
     [java] [main] INFO org.apache.rat.mp.RatCheckMojo - Rat check: Summary of files. Unapproved:
0 unknown: 0 generated: 0 approved: 35 licence.
     [java] [main] INFO org.apache.maven.cli.event.ExecutionEventLogger - 
     [java] [main] INFO org.apache.maven.cli.event.ExecutionEventLogger - --- maven-remote-resources-plugin:1.5:process
(default) @ maven-embedder ---
     [java] [main] INFO org.apache.maven.cli.event.ExecutionEventLogger - 
     [java] [main] INFO org.apache.maven.cli.event.ExecutionEventLogger - --- maven-resources-plugin:2.6:resources
(default-resources) @ maven-embedder ---
     [java] [main] INFO org.apache.maven.shared.filtering.DefaultMavenResourcesFiltering -
Using 'UTF-8' encoding to copy filtered resources.
     [java] [main] INFO org.apache.maven.shared.filtering.DefaultMavenResourcesFiltering -
Copying 2 resources
     [java] [main] INFO org.apache.maven.shared.filtering.DefaultMavenResourcesFiltering -
Copying 3 resources
     [java] [main] INFO org.apache.maven.cli.event.ExecutionEventLogger - 
     [java] [main] INFO org.apache.maven.cli.event.ExecutionEventLogger - --- maven-compiler-plugin:3.1:compile
(default-compile) @ maven-embedder ---
     [java] [main] INFO org.apache.maven.plugin.compiler.CompilerMojo - Changes detected -
recompiling the module!
     [java] [main] INFO org.codehaus.plexus.compiler.javac.JavacCompiler - Compiling 21 source
files to F:\ws\m3-its\maven-3-trunk\maven-embedder\target\classes
     [java] [main] INFO org.apache.maven.cli.event.ExecutionEventLogger - 
     [java] [main] INFO org.apache.maven.cli.event.ExecutionEventLogger - --- animal-sniffer-maven-plugin:1.10:check
(check-java-1.6-compat) @ maven-embedder ---
     [java] [main] INFO org.codehaus.mojo.animal_sniffer.maven.CheckSignatureMojo - Checking
unresolved references to org.codehaus.mojo.signature:java16:1.1
     [java] [main] INFO org.apache.maven.cli.event.ExecutionEventLogger - 
     [java] [main] INFO org.apache.maven.cli.event.ExecutionEventLogger - --- plexus-component-metadata:1.5.5:generate-metadata
(default) @ maven-embedder ---
     [java] [main] INFO org.apache.maven.cli.event.ExecutionEventLogger - 
     [java] [main] INFO org.apache.maven.cli.event.ExecutionEventLogger - --- maven-resources-plugin:2.6:testResources
(default-testResources) @ maven-embedder ---
     [java] [main] INFO org.apache.maven.shared.filtering.DefaultMavenResourcesFiltering -
Using 'UTF-8' encoding to copy filtered resources.
     [java] [main] INFO org.apache.maven.shared.filtering.DefaultMavenResourcesFiltering -
Copying 7 resources
     [java] [main] INFO org.apache.maven.shared.filtering.DefaultMavenResourcesFiltering -
Copying 3 resources
     [java] [main] INFO org.apache.maven.cli.event.ExecutionEventLogger - 
     [java] [main] INFO org.apache.maven.cli.event.ExecutionEventLogger - --- maven-compiler-plugin:3.1:testCompile
(default-testCompile) @ maven-embedder ---
     [java] [main] INFO org.apache.maven.plugin.compiler.TestCompilerMojo - Changes detected
- recompiling the module!
     [java] [main] INFO org.codehaus.plexus.compiler.javac.JavacCompiler - Compiling 3 source
files to F:\ws\m3-its\maven-3-trunk\maven-embedder\target\test-classes
     [java] [main] INFO org.apache.maven.cli.event.ExecutionEventLogger - 
     [java] [main] INFO org.apache.maven.cli.event.ExecutionEventLogger - --- plexus-component-metadata:1.5.5:generate-test-metadata
(default) @ maven-embedder ---
     [java] [main] INFO org.apache.maven.cli.event.ExecutionEventLogger - 
     [java] [main] INFO org.apache.maven.cli.event.ExecutionEventLogger - --- maven-surefire-plugin:2.16:test
(default-test) @ maven-embedder ---
     [java] [main] INFO org.apache.maven.plugin.surefire.SurefirePlugin - Tests are skipped.
     [java] [main] INFO org.apache.maven.cli.event.ExecutionEventLogger - 
     [java] [main] INFO org.apache.maven.cli.event.ExecutionEventLogger - --- maven-jar-plugin:2.4:jar
(default-jar) @ maven-embedder ---
     [java] [main] INFO org.codehaus.plexus.archiver.jar.JarArchiver - Building jar: F:\ws\m3-its\maven-3-trunk\maven-embedder\target\maven-embedder-3.2.3-SNAPSHOT.jar
     [java] [main] INFO org.apache.maven.cli.event.ExecutionEventLogger - 
     [java] [main] INFO org.apache.maven.cli.event.ExecutionEventLogger - --- maven-site-plugin:3.3:attach-descriptor
(attach-descriptor) @ maven-embedder ---
     [java] [main] INFO org.apache.maven.cli.event.ExecutionEventLogger - 
     [java] [main] INFO org.apache.maven.cli.event.ExecutionEventLogger - --- maven-install-plugin:2.5.1:install
(default-install) @ maven-embedder ---
     [java] [main] INFO org.apache.maven.DefaultMaven - Installing F:\ws\m3-its\maven-3-trunk\maven-embedder\target\maven-embedder-3.2.3-SNAPSHOT.jar
to <https://builds.apache.org/job/core-it-maven-3-win/ws/.repository\org\apache\maven\maven-embedder\3.2.3-SNAPSHOT\maven-embedder-3.2.3-SNAPSHOT.jar>
     [java] [main] INFO org.apache.maven.DefaultMaven - Installing F:\ws\m3-its\maven-3-trunk\maven-embedder\pom.xml
to <https://builds.apache.org/job/core-it-maven-3-win/ws/.repository\org\apache\maven\maven-embedder\3.2.3-SNAPSHOT\maven-embedder-3.2.3-SNAPSHOT.pom>
     [java] [main] INFO org.apache.maven.cli.event.ExecutionEventLogger -                
                                                        
     [java] [main] INFO org.apache.maven.cli.event.ExecutionEventLogger - ------------------------------------------------------------------------
     [java] [main] INFO org.apache.maven.cli.event.ExecutionEventLogger - Building Apache
Maven Distribution 3.2.3-SNAPSHOT
     [java] [main] INFO org.apache.maven.cli.event.ExecutionEventLogger - ------------------------------------------------------------------------
     [java] [pool-470-thread-1] INFO org.apache.maven.cli.transfer.Slf4jMavenTransferListener
- Downloading: http://repo.maven.apache.org/maven2/org/apache/maven/plugins/maven-assembly-plugin/2.4/maven-assembly-plugin-2.4.pom
     [java] [pool-470-thread-1] INFO org.apache.maven.cli.transfer.Slf4jMavenTransferListener
- Downloaded: http://repo.maven.apache.org/maven2/org/apache/maven/plugins/maven-assembly-plugin/2.4/maven-assembly-plugin-2.4.pom
(17 KB at 164.5 KB/sec)
     [java] [pool-471-thread-1] INFO org.apache.maven.cli.transfer.Slf4jMavenTransferListener
- Downloading: http://repo.maven.apache.org/maven2/org/apache/maven/plugins/maven-assembly-plugin/2.4/maven-assembly-plugin-2.4.jar
     [java] [pool-471-thread-1] INFO org.apache.maven.cli.transfer.Slf4jMavenTransferListener
- Downloaded: http://repo.maven.apache.org/maven2/org/apache/maven/plugins/maven-assembly-plugin/2.4/maven-assembly-plugin-2.4.jar
(221 KB at 851.6 KB/sec)
     [java] [main] INFO org.apache.maven.cli.event.ExecutionEventLogger - 
     [java] [main] INFO org.apache.maven.cli.event.ExecutionEventLogger - --- maven-clean-plugin:2.5:clean
(default-clean) @ apache-maven ---
     [java] [main] INFO org.apache.maven.plugin.clean.CleanMojo - Deleting F:\ws\m3-its\maven-3-trunk\apache-maven\target
     [java] [main] INFO org.apache.maven.cli.event.ExecutionEventLogger - 
     [java] [main] INFO org.apache.maven.cli.event.ExecutionEventLogger - --- maven-enforcer-plugin:1.3.1:enforce
(enforce-bytecode-version) @ apache-maven ---
     [java] [main] INFO org.apache.maven.cli.event.ExecutionEventLogger - 
     [java] [main] INFO org.apache.maven.cli.event.ExecutionEventLogger - --- maven-enforcer-plugin:1.3.1:enforce
(ban-known-bad-maven-versions) @ apache-maven ---
     [java] [main] INFO org.apache.maven.cli.event.ExecutionEventLogger - 
     [java] [main] INFO org.apache.maven.cli.event.ExecutionEventLogger - --- apache-rat-plugin:0.10:check
(check) @ apache-maven ---
     [java] [main] INFO org.apache.rat.mp.RatCheckMojo - 51 implicit excludes (use -debug
for more details).
     [java] [main] INFO org.apache.rat.mp.RatCheckMojo - Exclude: src/test/resources*/**
     [java] [main] INFO org.apache.rat.mp.RatCheckMojo - Exclude: src/test/projects/**
     [java] [main] INFO org.apache.rat.mp.RatCheckMojo - Exclude: src/test/remote-repo/**
     [java] [main] INFO org.apache.rat.mp.RatCheckMojo - Exclude: **/*.odg
     [java] [main] INFO org.apache.rat.mp.RatCheckMojo - Exclude: src/bin/m2.conf
     [java] [main] INFO org.apache.rat.mp.RatCheckMojo - Exclude: bootstrap/**
     [java] [main] INFO org.apache.rat.mp.RatCheckMojo - Exclude: README.bootstrap.txt
     [java] [main] INFO org.apache.rat.mp.RatCheckMojo - Exclude: .repository/**
     [java] [main] INFO org.apache.rat.mp.RatCheckMojo - 15 resources included (use -debug
for more details)
     [java] [main] INFO org.apache.rat.mp.RatCheckMojo - Rat check: Summary of files. Unapproved:
0 unknown: 0 generated: 0 approved: 13 licence.
     [java] [main] INFO org.apache.maven.cli.event.ExecutionEventLogger - 
     [java] [main] INFO org.apache.maven.cli.event.ExecutionEventLogger - --- maven-remote-resources-plugin:1.5:process
(default) @ apache-maven ---
     [java] [main] INFO org.apache.maven.cli.event.ExecutionEventLogger - ------------------------------------------------------------------------
     [java] [main] INFO org.apache.maven.cli.event.ExecutionEventLogger - Reactor Summary:
     [java] [main] INFO org.apache.maven.cli.event.ExecutionEventLogger - 
     [java] [main] INFO org.apache.maven.cli.event.ExecutionEventLogger - Apache Maven .......................................
SUCCESS [01:34 min]
     [java] [main] INFO org.apache.maven.cli.event.ExecutionEventLogger - Maven Model ........................................
SUCCESS [ 19.879 s]
     [java] [main] INFO org.apache.maven.cli.event.ExecutionEventLogger - Maven Artifact .....................................
SUCCESS [  7.030 s]
     [java] [main] INFO org.apache.maven.cli.event.ExecutionEventLogger - Maven Plugin API
................................... SUCCESS [  3.420 s]
     [java] [main] INFO org.apache.maven.cli.event.ExecutionEventLogger - Maven Model Builder
................................ SUCCESS [ 10.034 s]
     [java] [main] INFO org.apache.maven.cli.event.ExecutionEventLogger - Maven Settings .....................................
SUCCESS [  1.421 s]
     [java] [main] INFO org.apache.maven.cli.event.ExecutionEventLogger - Maven Settings Builder
............................. SUCCESS [  2.772 s]
     [java] [main] INFO org.apache.maven.cli.event.ExecutionEventLogger - Maven Repository
Metadata Model .................... SUCCESS [  1.793 s]
     [java] [main] INFO org.apache.maven.cli.event.ExecutionEventLogger - Maven Aether Provider
.............................. SUCCESS [  6.139 s]
     [java] [main] INFO org.apache.maven.cli.event.ExecutionEventLogger - Maven Core .........................................
SUCCESS [ 43.947 s]
     [java] [main] INFO org.apache.maven.cli.event.ExecutionEventLogger - Maven Compat .......................................
SUCCESS [ 10.534 s]
     [java] [main] INFO org.apache.maven.cli.event.ExecutionEventLogger - Maven Embedder .....................................
SUCCESS [  4.814 s]
     [java] [main] INFO org.apache.maven.cli.event.ExecutionEventLogger - Apache Maven Distribution
.......................... FAILURE [ 21.626 s]
     [java] [main] INFO org.apache.maven.cli.event.ExecutionEventLogger - ------------------------------------------------------------------------
     [java] [main] INFO org.apache.maven.cli.event.ExecutionEventLogger - BUILD FAILURE
     [java] [main] INFO org.apache.maven.cli.event.ExecutionEventLogger - ------------------------------------------------------------------------
     [java] [main] INFO org.apache.maven.cli.event.ExecutionEventLogger - Total time: 03:49
min
     [java] [main] INFO org.apache.maven.cli.event.ExecutionEventLogger - Finished at: 2014-06-20T16:36:02+01:00
     [java] [main] INFO org.apache.maven.cli.event.ExecutionEventLogger - Final Memory: 38M/216M
     [java] [main] INFO org.apache.maven.cli.event.ExecutionEventLogger - ------------------------------------------------------------------------
     [java] [main] ERROR org.apache.maven.cli.MavenCli - Failed to execute goal org.apache.maven.plugins:maven-remote-resources-plugin:1.5:process
(default) on project apache-maven: Error rendering velocity resource. Invocation of method
'getResourceAsFile' in  class org.codehaus.plexus.resource.DefaultResourceManager threw exception
org.codehaus.plexus.resource.loader.ResourceNotFoundException: Could not find resource 'http://jsoup.com/license'.
at remote-resources[line 40, column 26] -> [Help 1]
     [java] org.apache.maven.lifecycle.LifecycleExecutionException: Failed to execute goal
org.apache.maven.plugins:maven-remote-resources-plugin:1.5:process (default) on project apache-maven:
Error rendering velocity resource.
     [java] 	at org.apache.maven.lifecycle.internal.MojoExecutor.execute(MojoExecutor.java:216)
     [java] 	at org.apache.maven.lifecycle.internal.MojoExecutor.execute(MojoExecutor.java:153)
     [java] 	at org.apache.maven.lifecycle.internal.MojoExecutor.execute(MojoExecutor.java:145)
     [java] 	at org.apache.maven.lifecycle.internal.LifecycleModuleBuilder.buildProject(LifecycleModuleBuilder.java:116)
     [java] 	at org.apache.maven.lifecycle.internal.LifecycleModuleBuilder.buildProject(LifecycleModuleBuilder.java:80)
     [java] 	at org.apache.maven.lifecycle.internal.builder.singlethreaded.SingleThreadedBuilder.build(SingleThreadedBuilder.java:51)
     [java] 	at org.apache.maven.lifecycle.internal.LifecycleStarter.execute(LifecycleStarter.java:120)
     [java] 	at org.apache.maven.DefaultMaven.doExecute(DefaultMaven.java:347)
     [java] 	at org.apache.maven.DefaultMaven.execute(DefaultMaven.java:154)
     [java] 	at org.apache.maven.cli.MavenCli.execute(MavenCli.java:584)
     [java] 	at org.apache.maven.cli.MavenCli.doMain(MavenCli.java:213)
     [java] 	at org.apache.maven.cli.MavenCli.main(MavenCli.java:157)
     [java] 	at org.apache.maven.cli.MavenCli.main(MavenCli.java:148)
     [java] Caused by: org.apache.maven.plugin.MojoExecutionException: Error rendering velocity
resource.
     [java] 	at org.apache.maven.plugin.resources.remote.ProcessRemoteResourcesMojo.processResourceBundles(ProcessRemoteResourcesMojo.java:1246)
     [java] 	at org.apache.maven.plugin.resources.remote.ProcessRemoteResourcesMojo.execute(ProcessRemoteResourcesMojo.java:520)
     [java] 	at org.apache.maven.plugin.DefaultBuildPluginManager.executeMojo(DefaultBuildPluginManager.java:132)
     [java] 	at org.apache.maven.lifecycle.internal.MojoExecutor.execute(MojoExecutor.java:208)
     [java] 	... 12 more
     [java] Caused by: org.apache.velocity.exception.MethodInvocationException: Invocation
of method 'getResourceAsFile' in  class org.codehaus.plexus.resource.DefaultResourceManager
threw exception org.codehaus.plexus.resource.loader.ResourceNotFoundException: Could not find
resource 'http://jsoup.com/license'. at remote-resources[line 40, column 26]
     [java] 	at org.apache.velocity.runtime.parser.node.ASTMethod.handleInvocationException(ASTMethod.java:243)
     [java] 	at org.apache.velocity.runtime.parser.node.ASTMethod.execute(ASTMethod.java:187)
     [java] 	at org.apache.velocity.runtime.parser.node.ASTReference.execute(ASTReference.java:280)
     [java] 	at org.apache.velocity.runtime.parser.node.ASTReference.value(ASTReference.java:567)
     [java] 	at org.apache.velocity.runtime.parser.node.ASTExpression.value(ASTExpression.java:71)
     [java] 	at org.apache.velocity.runtime.parser.node.ASTSetDirective.render(ASTSetDirective.java:142)
     [java] 	at org.apache.velocity.runtime.parser.node.ASTBlock.render(ASTBlock.java:72)
     [java] 	at org.apache.velocity.runtime.parser.node.ASTIfStatement.render(ASTIfStatement.java:87)
     [java] 	at org.apache.velocity.runtime.parser.node.ASTBlock.render(ASTBlock.java:72)
     [java] 	at org.apache.velocity.runtime.parser.node.ASTIfStatement.render(ASTIfStatement.java:87)
     [java] 	at org.apache.velocity.runtime.parser.node.ASTBlock.render(ASTBlock.java:72)
     [java] 	at org.apache.velocity.runtime.directive.Foreach.render(Foreach.java:420)
     [java] 	at org.apache.velocity.runtime.parser.node.ASTDirective.render(ASTDirective.java:207)
     [java] 	at org.apache.velocity.runtime.parser.node.ASTBlock.render(ASTBlock.java:72)
     [java] 	at org.apache.velocity.runtime.directive.Foreach.render(Foreach.java:420)
     [java] 	at org.apache.velocity.runtime.parser.node.ASTDirective.render(ASTDirective.java:207)
     [java] 	at org.apache.velocity.runtime.parser.node.SimpleNode.render(SimpleNode.java:342)
     [java] 	at org.apache.velocity.runtime.RuntimeInstance.render(RuntimeInstance.java:1378)
     [java] 	at org.apache.velocity.runtime.RuntimeInstance.evaluate(RuntimeInstance.java:1314)
     [java] 	at org.apache.velocity.app.Velocity.evaluate(Velocity.java:254)
     [java] 	at org.apache.maven.plugin.resources.remote.ProcessRemoteResourcesMojo.processResourceBundles(ProcessRemoteResourcesMojo.java:1218)
     [java] 	... 15 more
     [java] Caused by: org.codehaus.plexus.resource.loader.ResourceNotFoundException: Could
not find resource 'http://jsoup.com/license'.
     [java] 	at org.codehaus.plexus.resource.DefaultResourceManager.getResource(DefaultResourceManager.java:173)
     [java] 	at org.codehaus.plexus.resource.DefaultResourceManager.getResourceAsFile(DefaultResourceManager.java:91)
     [java] 	at sun.reflect.GeneratedMethodAccessor72.invoke(Unknown Source)
     [java] 	at sun.reflect.DelegatingMethodAccessorImpl.invoke(DelegatingMethodAccessorImpl.java:25)
     [java] 	at java.lang.reflect.Method.invoke(Method.java:597)
     [java] 	at org.apache.velocity.util.introspection.UberspectImpl$VelMethodImpl.doInvoke(UberspectImpl.java:395)
     [java] 	at org.apache.velocity.util.introspection.UberspectImpl$VelMethodImpl.invoke(UberspectImpl.java:384)
     [java] 	at org.apache.velocity.runtime.parser.node.ASTMethod.execute(ASTMethod.java:173)
     [java] 	... 34 more
     [java] [main] ERROR org.apache.maven.cli.MavenCli - 
     [java] [main] ERROR org.apache.maven.cli.MavenCli - Re-run Maven using the -X switch
to enable full debug logging.
     [java] [main] ERROR org.apache.maven.cli.MavenCli - 
     [java] [main] ERROR org.apache.maven.cli.MavenCli - For more information about the errors
and possible solutions, please read the following articles:
     [java] [main] ERROR org.apache.maven.cli.MavenCli - [Help 1] http://cwiki.apache.org/confluence/display/MAVEN/MojoExecutionException
     [java] [main] ERROR org.apache.maven.cli.MavenCli - 
     [java] [main] ERROR org.apache.maven.cli.MavenCli - After correcting the problems, you
can resume the build with the command
     [java] [main] ERROR org.apache.maven.cli.MavenCli -   mvn <goals> -rf :apache-maven

BUILD FAILED
<https://builds.apache.org/job/core-it-maven-3-win/ws/maven-3-trunk\build.xml>:253:
Java returned: 1

Total time: 6 minutes 28 seconds
Build step 'Invoke Ant' marked build as failure
Recording test results

Mime
View raw message