maven-notifications mailing list archives

Site index · List index
Message view « Date » · « Thread »
Top « Date » · « Thread »
From Apache Jenkins Server <jenk...@builds.apache.org>
Subject Build failed in Jenkins: maven-plugin-tools-m2 #154
Date Mon, 02 Jun 2014 18:47:47 GMT
See <https://builds.apache.org/job/maven-plugin-tools-m2/154/changes>

Changes:

[hboutemy] [MPLUGIN-267] document how to change desriptor phase instead of running it twice
with skipErrorNoDescriptorsFound

[hboutemy] try to make the IT pass on Windows

------------------------------------------
[...truncated 555 lines...]
[INFO] Copying 2 resources
[INFO] Copying 3 resources
[INFO] [compiler:testCompile {execution: default-testCompile}]
[INFO] Changes detected - recompiling the module!
[INFO] Compiling 1 source file to <https://builds.apache.org/job/maven-plugin-tools-m2/ws/maven-plugin-tools-ant/target/test-classes>
[WARNING] Note: <https://builds.apache.org/job/maven-plugin-tools-m2/ws/maven-plugin-tools-ant/src/test/java/org/apache/maven/tools/plugin/extractor/ant/AntMojoDescriptorExtractorTest.java>
uses unchecked or unsafe operations.
[WARNING] Note: Recompile with -Xlint:unchecked for details.
[INFO] [plexus-component-metadata:generate-test-metadata {execution: default}]
[INFO] [surefire:test {execution: default-test}]
[INFO] Surefire report directory: <https://builds.apache.org/job/maven-plugin-tools-m2/ws/maven-plugin-tools-ant/target/surefire-reports>

-------------------------------------------------------
 T E S T S
-------------------------------------------------------
Running org.apache.maven.tools.plugin.extractor.ant.AntMojoDescriptorExtractorTest
Tests run: 1, Failures: 0, Errors: 0, Skipped: 0, Time elapsed: 0.077 sec - in org.apache.maven.tools.plugin.extractor.ant.AntMojoDescriptorExtractorTest

Results :

Tests run: 1, Failures: 0, Errors: 0, Skipped: 0

[JENKINS] Recording test results
[INFO] [jar:jar {execution: default-jar}]
[INFO] Building jar: <https://builds.apache.org/job/maven-plugin-tools-m2/ws/maven-plugin-tools-ant/target/maven-plugin-tools-ant-3.4-SNAPSHOT.jar>
[INFO] [install:install {execution: default-install}]
[INFO] Installing <https://builds.apache.org/job/maven-plugin-tools-m2/ws/maven-plugin-tools-ant/target/maven-plugin-tools-ant-3.4-SNAPSHOT.jar>
to /home/jenkins/jenkins-slave/maven-repositories/1/org/apache/maven/plugin-tools/maven-plugin-tools-ant/3.4-SNAPSHOT/maven-plugin-tools-ant-3.4-SNAPSHOT.jar
[INFO] ------------------------------------------------------------------------
[INFO] Building Maven Plugin Tool for Beanshell
[INFO]    task-segment: [clean, install]
[INFO] ------------------------------------------------------------------------
[INFO] [clean:clean {execution: default-clean}]
[INFO] [enforcer:enforce {execution: enforce-bytecode-version}]
[INFO] [enforcer:enforce {execution: ban-known-bad-maven-versions}]
[INFO] [remote-resources:process {execution: default}]
[JENKINS] Recording test results[INFO] [resources:resources {execution: default-resources}]
[INFO] Using 'UTF-8' encoding to copy filtered resources.
[INFO] Copying 1 resource
[INFO] Copying 3 resources
[INFO] [compiler:compile {execution: default-compile}]
[INFO] Changes detected - recompiling the module!
[INFO] Compiling 1 source file to <https://builds.apache.org/job/maven-plugin-tools-m2/ws/maven-plugin-tools-beanshell/target/classes>
[INFO] [plexus-component-metadata:generate-metadata {execution: default}]
[INFO] Discovered 1 component descriptors(s)
[INFO] [resources:testResources {execution: default-testResources}]
[INFO] Using 'UTF-8' encoding to copy filtered resources.
[INFO] skip non existing resourceDirectory <https://builds.apache.org/job/maven-plugin-tools-m2/ws/maven-plugin-tools-beanshell/src/test/resources>
[INFO] Copying 3 resources
[INFO] [compiler:testCompile {execution: default-testCompile}]
[INFO] No sources to compile
[INFO] [plexus-component-metadata:generate-test-metadata {execution: default}]
[INFO] [surefire:test {execution: default-test}]

[INFO] [jar:jar {execution: default-jar}]
[INFO] Building jar: <https://builds.apache.org/job/maven-plugin-tools-m2/ws/maven-plugin-tools-beanshell/target/maven-plugin-tools-beanshell-3.4-SNAPSHOT.jar>
[INFO] [install:install {execution: default-install}]
[INFO] Installing <https://builds.apache.org/job/maven-plugin-tools-m2/ws/maven-plugin-tools-beanshell/target/maven-plugin-tools-beanshell-3.4-SNAPSHOT.jar>
to /home/jenkins/jenkins-slave/maven-repositories/1/org/apache/maven/plugin-tools/maven-plugin-tools-beanshell/3.4-SNAPSHOT/maven-plugin-tools-beanshell-3.4-SNAPSHOT.jar
[INFO] ------------------------------------------------------------------------
[INFO] Building Maven Plugin Plugin
[INFO]    task-segment: [clean, install]
[INFO] ------------------------------------------------------------------------
[INFO] [clean:clean {execution: default-clean}]
[INFO] [enforcer:enforce {execution: enforce-bytecode-version}]
[INFO] [enforcer:enforce {execution: ban-known-bad-maven-versions}]
[INFO] [enforcer:enforce {execution: ensure-no-container-api}]
-----------------------------------------------------
this realm = app0.child-container[org.apache.maven.plugins:maven-enforcer-plugin:1.3.1]
urls[0] = file:/home/jenkins/jenkins-slave/maven-repositories/1/org/apache/maven/plugins/maven-enforcer-plugin/1.3.1/maven-enforcer-plugin-1.3.1.jar
urls[1] = file:/home/jenkins/jenkins-slave/maven-repositories/1/org/codehaus/mojo/extra-enforcer-rules/1.0-beta-2/extra-enforcer-rules-1.0-beta-2.jar
urls[2] = file:/home/jenkins/jenkins-slave/maven-repositories/1/org/apache/maven/enforcer/enforcer-api/1.3.1/enforcer-api-1.3.1.jar
urls[3] = file:/home/jenkins/jenkins-slave/maven-repositories/1/org/codehaus/plexus/plexus-utils/1.5.8/plexus-utils-1.5.8.jar
urls[4] = file:/home/jenkins/jenkins-slave/maven-repositories/1/org/apache/maven/shared/maven-dependency-tree/2.1/maven-dependency-tree-2.1.jar
urls[5] = file:/home/jenkins/jenkins-slave/maven-repositories/1/org/codehaus/plexus/plexus-component-annotations/1.5.5/plexus-component-annotations-1.5.5.jar
urls[6] = file:/home/jenkins/jenkins-slave/maven-repositories/1/org/eclipse/aether/aether-util/0.9.0.M2/aether-util-0.9.0.M2.jar
urls[7] = file:/home/jenkins/jenkins-slave/maven-repositories/1/org/apache/maven/shared/maven-common-artifact-filters/1.4/maven-common-artifact-filters-1.4.jar
urls[8] = file:/home/jenkins/jenkins-slave/maven-repositories/1/commons-lang/commons-lang/2.3/commons-lang-2.3.jar
urls[9] = file:/home/jenkins/jenkins-slave/maven-repositories/1/org/apache/maven/enforcer/enforcer-rules/1.3.1/enforcer-rules-1.3.1.jar
urls[10] = file:/home/jenkins/jenkins-slave/maven-repositories/1/org/beanshell/bsh/2.0b4/bsh-2.0b4.jar
urls[11] = file:/home/jenkins/jenkins-slave/maven-repositories/1/org/codehaus/plexus/plexus-i18n/1.0-beta-6/plexus-i18n-1.0-beta-6.jar
Number of imports: 10
import: org.codehaus.classworlds.Entry@a6c57a42
import: org.codehaus.classworlds.Entry@12f43f3b
import: org.codehaus.classworlds.Entry@20025374
import: org.codehaus.classworlds.Entry@f8e44ca4
import: org.codehaus.classworlds.Entry@92758522
import: org.codehaus.classworlds.Entry@ebf2705b
import: org.codehaus.classworlds.Entry@bb25e54
import: org.codehaus.classworlds.Entry@bece5185
import: org.codehaus.classworlds.Entry@3fee8e37
import: org.codehaus.classworlds.Entry@3fee19d8


this realm = plexus.core.maven
Number of imports: 10
import: org.codehaus.classworlds.Entry@a6c57a42
import: org.codehaus.classworlds.Entry@12f43f3b
import: org.codehaus.classworlds.Entry@20025374
import: org.codehaus.classworlds.Entry@f8e44ca4
import: org.codehaus.classworlds.Entry@92758522
import: org.codehaus.classworlds.Entry@ebf2705b
import: org.codehaus.classworlds.Entry@bb25e54
import: org.codehaus.classworlds.Entry@bece5185
import: org.codehaus.classworlds.Entry@3fee8e37
import: org.codehaus.classworlds.Entry@3fee19d8


this realm = plexus.core
urls[0] = file:/home/jenkins/jenkins-slave/maven2.1-interceptor.jar
urls[1] = file:/home/jenkins/jenkins-slave/maven-interceptor.jar
urls[2] = file:/home/jenkins/tools/maven/apache-maven-2.2.1/lib/maven-2.2.1-uber.jar
Number of imports: 10
import: org.codehaus.classworlds.Entry@a6c57a42
import: org.codehaus.classworlds.Entry@12f43f3b
import: org.codehaus.classworlds.Entry@20025374
import: org.codehaus.classworlds.Entry@f8e44ca4
import: org.codehaus.classworlds.Entry@92758522
import: org.codehaus.classworlds.Entry@ebf2705b
import: org.codehaus.classworlds.Entry@bb25e54
import: org.codehaus.classworlds.Entry@bece5185
import: org.codehaus.classworlds.Entry@3fee8e37
import: org.codehaus.classworlds.Entry@3fee19d8
-----------------------------------------------------
[INFO] [modello:java {execution: default}]
[INFO] outputDirectory: <https://builds.apache.org/job/maven-plugin-tools-m2/ws/maven-plugin-plugin/target/generated-sources/modello>
[INFO] Working on model: src/main/mdo/pluginRequirements.mdo
[INFO] Generating current version: 1.0.0
[INFO] [plugin:helpmojo {execution: generated-helpmojo}]
[INFO] Using 'UTF-8' encoding to read mojo metadata.
[INFO] Applying mojo extractor for language: java-annotations
[INFO] snapshot org.apache.maven.plugin-tools:maven-plugin-tools-annotations:3.4-SNAPSHOT:
checking for updates from apache.snapshots
[INFO] Mojo extractor for language: java-annotations found 0 mojo descriptors.
[INFO] Applying mojo extractor for language: java
[INFO] Mojo extractor for language: java found 0 mojo descriptors.
[INFO] Applying mojo extractor for language: bsh
[INFO] Mojo extractor for language: bsh found 0 mojo descriptors.
[INFO] [plugin:descriptor {execution: default-descriptor}]
[INFO] Using 'UTF-8' encoding to read mojo metadata.
[INFO] Applying mojo extractor for language: java-annotations
[INFO] Mojo extractor for language: java-annotations found 0 mojo descriptors.
[INFO] Applying mojo extractor for language: java
[INFO] Mojo extractor for language: java found 0 mojo descriptors.
[INFO] Applying mojo extractor for language: bsh
[INFO] Mojo extractor for language: bsh found 0 mojo descriptors.
[INFO] 
[INFO] 
[INFO] ------------------------------------------------------------------------
[INFO] Reactor Summary:
[INFO] ------------------------------------------------------------------------
[INFO] Maven Plugin Tools .................................... SUCCESS [27.961s]
[INFO] Maven Script Mojo Support ............................. SUCCESS [1.012s]
[INFO] Maven Ant Mojo Support ................................ SUCCESS [32.366s]
[INFO] Maven Beanshell Mojo Support .......................... SUCCESS [2.059s]
[INFO] Maven Plugin Tools APIs ............................... SUCCESS [5.848s]
[INFO] Maven Plugin Tools Generators ......................... SUCCESS [4.525s]
[INFO] Maven Plugin Tool for Java with Mojo Javadoc Tags ..... SUCCESS [5.460s]
[INFO] Maven Plugin Tools Javadoc ............................ SUCCESS [15.396s]
[INFO] Maven Plugin Tools Java 5 Annotations ................. SUCCESS [2.737s]
[INFO] Maven Plugin Tool for Java with Annotations ........... SUCCESS [4.375s]
[INFO] Maven Plugin Metadata Model ........................... SUCCESS [5.992s]
[INFO] Maven Plugin Tool for Ant ............................. SUCCESS [4.175s]
[INFO] Maven Plugin Tool for Beanshell ....................... SUCCESS [2.727s]
[INFO] Maven Plugin Plugin ................................... FAILED [7.654s]
[INFO] ------------------------------------------------------------------------
[INFO] Error for project: Maven Plugin Plugin (during install)
[INFO] ------------------------------------------------------------------------
[INFO] Error extracting plugin descriptor: 'No mojo definitions were found for plugin: org.apache.maven.plugins:maven-plugin-plugin.'

[INFO] ------------------------------------------------------------------------
[INFO] Trace
org.apache.maven.lifecycle.LifecycleExecutionException: Error extracting plugin descriptor:
'No mojo definitions were found for plugin: org.apache.maven.plugins:maven-plugin-plugin.'
	at org.apache.maven.lifecycle.DefaultLifecycleExecutor.executeGoals(DefaultLifecycleExecutor.java:719)
	at org.apache.maven.lifecycle.DefaultLifecycleExecutor.executeGoalWithLifecycle(DefaultLifecycleExecutor.java:556)
	at org.apache.maven.lifecycle.DefaultLifecycleExecutor.executeGoal(DefaultLifecycleExecutor.java:535)
	at org.apache.maven.lifecycle.DefaultLifecycleExecutor.executeGoalAndHandleFailures(DefaultLifecycleExecutor.java:387)
	at org.apache.maven.lifecycle.DefaultLifecycleExecutor.executeTaskSegments(DefaultLifecycleExecutor.java:348)
	at org.apache.maven.lifecycle.DefaultLifecycleExecutor.execute(DefaultLifecycleExecutor.java:180)
	at org.apache.maven.lifecycle.LifecycleExecutorInterceptor.execute(LifecycleExecutorInterceptor.java:65)
	at org.apache.maven.DefaultMaven.doExecute(DefaultMaven.java:328)
	at org.apache.maven.DefaultMaven.execute(DefaultMaven.java:138)
	at org.apache.maven.cli.MavenCli.main(MavenCli.java:362)
	at sun.reflect.NativeMethodAccessorImpl.invoke0(Native Method)
	at sun.reflect.NativeMethodAccessorImpl.invoke(NativeMethodAccessorImpl.java:39)
	at sun.reflect.DelegatingMethodAccessorImpl.invoke(DelegatingMethodAccessorImpl.java:25)
	at java.lang.reflect.Method.invoke(Method.java:597)
	at org.codehaus.classworlds.Launcher.launchEnhanced(Launcher.java:315)
	at org.codehaus.classworlds.Launcher.launch(Launcher.java:255)
	at hudson.maven.agent.Main.launch(Main.java:204)
	at hudson.maven.MavenBuilder.call(MavenBuilder.java:154)
	at hudson.maven.Maven2Builder.call(Maven2Builder.java:79)
	at hudson.maven.Maven2Builder.call(Maven2Builder.java:55)
	at hudson.remoting.UserRequest.perform(UserRequest.java:118)
	at hudson.remoting.UserRequest.perform(UserRequest.java:48)
	at hudson.remoting.Request$2.run(Request.java:328)
	at hudson.remoting.InterceptingExecutorService$1.call(InterceptingExecutorService.java:72)
	at java.util.concurrent.FutureTask$Sync.innerRun(FutureTask.java:303)
	at java.util.concurrent.FutureTask.run(FutureTask.java:138)
	at java.util.concurrent.ThreadPoolExecutor$Worker.runTask(ThreadPoolExecutor.java:895)
	at java.util.concurrent.ThreadPoolExecutor$Worker.run(ThreadPoolExecutor.java:918)
	at java.lang.Thread.run(Thread.java:662)
Caused by: org.apache.maven.plugin.MojoExecutionException: Error extracting plugin descriptor:
'No mojo definitions were found for plugin: org.apache.maven.plugins:maven-plugin-plugin.'
	at org.apache.maven.plugin.plugin.AbstractGeneratorMojo.execute(AbstractGeneratorMojo.java:255)
	at org.apache.maven.plugin.plugin.DescriptorGeneratorMojo.execute(DescriptorGeneratorMojo.java:90)
	at org.apache.maven.plugin.DefaultPluginManager.executeMojo(DefaultPluginManager.java:490)
	at hudson.maven.agent.PluginManagerInterceptor.executeMojo(PluginManagerInterceptor.java:182)
	at org.apache.maven.lifecycle.DefaultLifecycleExecutor.executeGoals(DefaultLifecycleExecutor.java:694)
	... 28 more
Caused by: org.apache.maven.plugin.descriptor.InvalidPluginDescriptorException: No mojo definitions
were found for plugin: org.apache.maven.plugins:maven-plugin-plugin.
	at org.apache.maven.tools.plugin.scanner.DefaultMojoScanner.populatePluginDescriptor(DefaultMojoScanner.java:114)
	at org.apache.maven.plugin.plugin.AbstractGeneratorMojo.execute(AbstractGeneratorMojo.java:243)
	... 32 more
[INFO] ------------------------------------------------------------------------
[INFO] BUILD ERRORS
[INFO] ------------------------------------------------------------------------
[INFO] Total time: 2 minutes 34 seconds
[INFO] Finished at: Mon Jun 02 18:46:56 UTC 2014
[INFO] Final Memory: 79M/367M
[INFO] ------------------------------------------------------------------------
Waiting for Jenkins to finish collecting data
[JENKINS] Archiving <https://builds.apache.org/job/maven-plugin-tools-m2/ws/maven-plugin-tools-api/pom.xml>
to org.apache.maven.plugin-tools/maven-plugin-tools-api/3.4-SNAPSHOT/maven-plugin-tools-api-3.4-SNAPSHOT.pom
[JENKINS] Archiving <https://builds.apache.org/job/maven-plugin-tools-m2/ws/maven-plugin-tools-api/target/maven-plugin-tools-api-3.4-SNAPSHOT.jar>
to org.apache.maven.plugin-tools/maven-plugin-tools-api/3.4-SNAPSHOT/maven-plugin-tools-api-3.4-SNAPSHOT.jar
[JENKINS] Archiving <https://builds.apache.org/job/maven-plugin-tools-m2/ws/maven-plugin-tools-generators/pom.xml>
to org.apache.maven.plugin-tools/maven-plugin-tools-generators/3.4-SNAPSHOT/maven-plugin-tools-generators-3.4-SNAPSHOT.pom
[JENKINS] Archiving <https://builds.apache.org/job/maven-plugin-tools-m2/ws/maven-plugin-tools-generators/target/maven-plugin-tools-generators-3.4-SNAPSHOT.jar>
to org.apache.maven.plugin-tools/maven-plugin-tools-generators/3.4-SNAPSHOT/maven-plugin-tools-generators-3.4-SNAPSHOT.jar
[JENKINS] Archiving <https://builds.apache.org/job/maven-plugin-tools-m2/ws/maven-plugin-annotations/pom.xml>
to org.apache.maven.plugin-tools/maven-plugin-annotations/3.4-SNAPSHOT/maven-plugin-annotations-3.4-SNAPSHOT.pom
[JENKINS] Archiving <https://builds.apache.org/job/maven-plugin-tools-m2/ws/maven-plugin-annotations/target/maven-plugin-annotations-3.4-SNAPSHOT.jar>
to org.apache.maven.plugin-tools/maven-plugin-annotations/3.4-SNAPSHOT/maven-plugin-annotations-3.4-SNAPSHOT.jar
[JENKINS] Archiving /home/jenkins/jenkins-slave/maven-repositories/1/org/apache/maven/plugin-tools/maven-script/3.4-SNAPSHOT/maven-script-3.4-SNAPSHOT.pom
to org.apache.maven.plugin-tools/maven-script/3.4-SNAPSHOT/maven-script-3.4-SNAPSHOT.pom
[JENKINS] Archiving <https://builds.apache.org/job/maven-plugin-tools-m2/ws/maven-script/target/maven-script-3.4-SNAPSHOT-site.xml>
to org.apache.maven.plugin-tools/maven-script/3.4-SNAPSHOT/maven-script-3.4-SNAPSHOT-site.xml
/home/jenkins/jenkins-slave/maven-repositories/1/org/apache/maven/plugin-tools/maven-script/3.4-SNAPSHOT/maven-script-3.4-SNAPSHOT.pom
is not inside <https://builds.apache.org/job/maven-plugin-tools-m2/ws/maven-script/;>
will archive in a separate pass
[JENKINS] Archiving <https://builds.apache.org/job/maven-plugin-tools-m2/ws/maven-plugin-plugin/pom.xml>
to org.apache.maven.plugins/maven-plugin-plugin/3.4-SNAPSHOT/maven-plugin-plugin-3.4-SNAPSHOT.pom
[JENKINS] Archiving /home/jenkins/jenkins-slave/maven-repositories/1/org/apache/maven/plugin-tools/maven-plugin-tools/3.4-SNAPSHOT/maven-plugin-tools-3.4-SNAPSHOT.pom
to org.apache.maven.plugin-tools/maven-plugin-tools/3.4-SNAPSHOT/maven-plugin-tools-3.4-SNAPSHOT.pom
[JENKINS] Archiving <https://builds.apache.org/job/maven-plugin-tools-m2/ws/target/maven-plugin-tools-3.4-SNAPSHOT-site.xml>
to org.apache.maven.plugin-tools/maven-plugin-tools/3.4-SNAPSHOT/maven-plugin-tools-3.4-SNAPSHOT-site.xml
/home/jenkins/jenkins-slave/maven-repositories/1/org/apache/maven/plugin-tools/maven-plugin-tools/3.4-SNAPSHOT/maven-plugin-tools-3.4-SNAPSHOT.pom
is not inside <https://builds.apache.org/job/maven-plugin-tools-m2/ws/;> will archive
in a separate pass
[JENKINS] Archiving <https://builds.apache.org/job/maven-plugin-tools-m2/ws/maven-plugin-tools-model/pom.xml>
to org.apache.maven.plugin-tools/maven-plugin-tools-model/3.4-SNAPSHOT/maven-plugin-tools-model-3.4-SNAPSHOT.pom
[JENKINS] Archiving <https://builds.apache.org/job/maven-plugin-tools-m2/ws/maven-plugin-tools-model/target/maven-plugin-tools-model-3.4-SNAPSHOT.jar>
to org.apache.maven.plugin-tools/maven-plugin-tools-model/3.4-SNAPSHOT/maven-plugin-tools-model-3.4-SNAPSHOT.jar
[JENKINS] Archiving <https://builds.apache.org/job/maven-plugin-tools-m2/ws/maven-plugin-tools-ant/pom.xml>
to org.apache.maven.plugin-tools/maven-plugin-tools-ant/3.4-SNAPSHOT/maven-plugin-tools-ant-3.4-SNAPSHOT.pom
[JENKINS] Archiving <https://builds.apache.org/job/maven-plugin-tools-m2/ws/maven-plugin-tools-ant/target/maven-plugin-tools-ant-3.4-SNAPSHOT.jar>
to org.apache.maven.plugin-tools/maven-plugin-tools-ant/3.4-SNAPSHOT/maven-plugin-tools-ant-3.4-SNAPSHOT.jar
[JENKINS] Archiving <https://builds.apache.org/job/maven-plugin-tools-m2/ws/maven-plugin-tools-annotations/pom.xml>
to org.apache.maven.plugin-tools/maven-plugin-tools-annotations/3.4-SNAPSHOT/maven-plugin-tools-annotations-3.4-SNAPSHOT.pom
[JENKINS] Archiving <https://builds.apache.org/job/maven-plugin-tools-m2/ws/maven-plugin-tools-annotations/target/maven-plugin-tools-annotations-3.4-SNAPSHOT.jar>
to org.apache.maven.plugin-tools/maven-plugin-tools-annotations/3.4-SNAPSHOT/maven-plugin-tools-annotations-3.4-SNAPSHOT.jar
[JENKINS] Archiving <https://builds.apache.org/job/maven-plugin-tools-m2/ws/maven-plugin-tools-annotations/target/maven-plugin-tools-annotations-3.4-SNAPSHOT-tests.jar>
to org.apache.maven.plugin-tools/maven-plugin-tools-annotations/3.4-SNAPSHOT/maven-plugin-tools-annotations-3.4-SNAPSHOT-tests.jar
[JENKINS] Archiving <https://builds.apache.org/job/maven-plugin-tools-m2/ws/maven-plugin-tools-annotations/target/maven-plugin-tools-annotations-3.4-SNAPSHOT-test-sources.jar>
to org.apache.maven.plugin-tools/maven-plugin-tools-annotations/3.4-SNAPSHOT/maven-plugin-tools-annotations-3.4-SNAPSHOT-test-sources.jar
[JENKINS] Archiving <https://builds.apache.org/job/maven-plugin-tools-m2/ws/maven-script/maven-script-ant/pom.xml>
to org.apache.maven.plugin-tools/maven-script-ant/3.4-SNAPSHOT/maven-script-ant-3.4-SNAPSHOT.pom
[JENKINS] Archiving <https://builds.apache.org/job/maven-plugin-tools-m2/ws/maven-script/maven-script-ant/target/maven-script-ant-3.4-SNAPSHOT.jar>
to org.apache.maven.plugin-tools/maven-script-ant/3.4-SNAPSHOT/maven-script-ant-3.4-SNAPSHOT.jar
[JENKINS] Archiving <https://builds.apache.org/job/maven-plugin-tools-m2/ws/maven-plugin-tools-beanshell/pom.xml>
to org.apache.maven.plugin-tools/maven-plugin-tools-beanshell/3.4-SNAPSHOT/maven-plugin-tools-beanshell-3.4-SNAPSHOT.pom
[JENKINS] Archiving <https://builds.apache.org/job/maven-plugin-tools-m2/ws/maven-plugin-tools-beanshell/target/maven-plugin-tools-beanshell-3.4-SNAPSHOT.jar>
to org.apache.maven.plugin-tools/maven-plugin-tools-beanshell/3.4-SNAPSHOT/maven-plugin-tools-beanshell-3.4-SNAPSHOT.jar
[JENKINS] Archiving <https://builds.apache.org/job/maven-plugin-tools-m2/ws/maven-plugin-tools-java/pom.xml>
to org.apache.maven.plugin-tools/maven-plugin-tools-java/3.4-SNAPSHOT/maven-plugin-tools-java-3.4-SNAPSHOT.pom
[JENKINS] Archiving <https://builds.apache.org/job/maven-plugin-tools-m2/ws/maven-plugin-tools-java/target/maven-plugin-tools-java-3.4-SNAPSHOT.jar>
to org.apache.maven.plugin-tools/maven-plugin-tools-java/3.4-SNAPSHOT/maven-plugin-tools-java-3.4-SNAPSHOT.jar
[JENKINS] Archiving <https://builds.apache.org/job/maven-plugin-tools-m2/ws/maven-script/maven-script-beanshell/pom.xml>
to org.apache.maven.plugin-tools/maven-script-beanshell/3.4-SNAPSHOT/maven-script-beanshell-3.4-SNAPSHOT.pom
[JENKINS] Archiving <https://builds.apache.org/job/maven-plugin-tools-m2/ws/maven-script/maven-script-beanshell/target/maven-script-beanshell-3.4-SNAPSHOT.jar>
to org.apache.maven.plugin-tools/maven-script-beanshell/3.4-SNAPSHOT/maven-script-beanshell-3.4-SNAPSHOT.jar
[JENKINS] Archiving <https://builds.apache.org/job/maven-plugin-tools-m2/ws/maven-plugin-tools-javadoc/pom.xml>
to org.apache.maven.plugin-tools/maven-plugin-tools-javadoc/3.4-SNAPSHOT/maven-plugin-tools-javadoc-3.4-SNAPSHOT.pom
[JENKINS] Archiving <https://builds.apache.org/job/maven-plugin-tools-m2/ws/maven-plugin-tools-javadoc/target/maven-plugin-tools-javadoc-3.4-SNAPSHOT.jar>
to org.apache.maven.plugin-tools/maven-plugin-tools-javadoc/3.4-SNAPSHOT/maven-plugin-tools-javadoc-3.4-SNAPSHOT.jar
channel stopped

Mime
View raw message