maven-notifications mailing list archives

Site index · List index
Message view « Date » · « Thread »
Top « Date » · « Thread »
From Apache Jenkins Server <jenk...@builds.apache.org>
Subject Build failed in Jenkins: doxia-tools » JDK 1.6 (latest),Ubuntu #55
Date Sat, 21 Jun 2014 16:29:21 GMT
See <https://builds.apache.org/job/doxia-tools/jdk=JDK%201.6%20(latest),label=Ubuntu/55/changes>

Changes:

[hboutemy] fix when decoration is null

[hboutemy] code simplification

[hboutemy] code simplification

[hboutemy] [DOXIATOOLS-48] don't read parent site.xml if inheritance not expected

[hboutemy] [DOXIATOOLS-47] removed encoding parameters from site descriptor methods

------------------------------------------
[...truncated 212 lines...]
[INFO] Excluding org.codehaus.plexus:plexus-component-annotations:jar:1.5.5 from the shaded
jar.
[INFO] Excluding org.apache.maven.shared:maven-doxia-tools:jar:1.4 from the shaded jar.
[INFO] Excluding org.apache.maven.reporting:maven-reporting-api:jar:3.0 from the shaded jar.
[INFO] Excluding commons-io:commons-io:jar:1.4 from the shaded jar.
[INFO] Excluding org.apache.maven:maven-artifact-manager:jar:2.2.1 from the shaded jar.
[INFO] Excluding org.apache.maven:maven-repository-metadata:jar:2.2.1 from the shaded jar.
[INFO] Excluding org.apache.maven.wagon:wagon-provider-api:jar:1.0-beta-6 from the shaded
jar.
[INFO] Excluding backport-util-concurrent:backport-util-concurrent:jar:3.1 from the shaded
jar.
[INFO] Excluding org.apache.maven:maven-model:jar:2.2.1 from the shaded jar.
[INFO] Excluding org.apache.maven:maven-project:jar:2.2.1 from the shaded jar.
[INFO] Excluding org.apache.maven:maven-settings:jar:2.2.1 from the shaded jar.
[INFO] Excluding org.codehaus.plexus:plexus-interpolation:jar:1.14 from the shaded jar.
[INFO] Excluding org.apache.maven:maven-profile:jar:2.2.1 from the shaded jar.
[INFO] Excluding org.apache.maven:maven-plugin-registry:jar:2.2.1 from the shaded jar.
[INFO] Excluding org.apache.maven.doxia:doxia-decoration-model:jar:1.2 from the shaded jar.
[INFO] Replacing original artifact with shaded artifact.
[INFO] Replacing /x1/jenkins/jenkins-slave/workspace/doxia-tools/jdk/JDK 1.6 (latest)/label/Ubuntu/doxia-book-maven-plugin/target/doxia-book-maven-plugin-1.3-SNAPSHOT.jar
with /x1/jenkins/jenkins-slave/workspace/doxia-tools/jdk/JDK 1.6 (latest)/label/Ubuntu/doxia-book-maven-plugin/target/doxia-book-maven-plugin-1.3-SNAPSHOT-shaded.jar
[INFO] [install:install {execution: default-install}]
[INFO] Installing /x1/jenkins/jenkins-slave/workspace/doxia-tools/jdk/JDK 1.6 (latest)/label/Ubuntu/doxia-book-maven-plugin/target/doxia-book-maven-plugin-1.3-SNAPSHOT.jar
to /home/jenkins/.m2/repository/org/apache/maven/doxia/doxia-book-maven-plugin/1.3-SNAPSHOT/doxia-book-maven-plugin-1.3-SNAPSHOT.jar
[INFO] ------------------------------------------------------------------------
[INFO] Building Doxia :: Converter
[INFO]    task-segment: [clean, install]
[INFO] ------------------------------------------------------------------------
[INFO] [clean:clean {execution: default-clean}]
[INFO] Deleting /x1/jenkins/jenkins-slave/workspace/doxia-tools/jdk/JDK 1.6 (latest)/label/Ubuntu/doxia-converter/target
[WARNING] The parameter expression: 'project.build.resources' used in mojo: 'process' has
been deprecated. Use 'project.resources' instead.
[INFO] [remote-resources:process {execution: default}]
[debug] execute contextualize
[INFO] [resources:resources {execution: default-resources}]
[INFO] Using 'UTF-8' encoding to copy filtered resources.
[INFO] Copying 1 resource
[INFO] Copying 3 resources
[INFO] [compiler:compile {execution: default-compile}]
[INFO] Compiling 13 source files to /x1/jenkins/jenkins-slave/workspace/doxia-tools/jdk/JDK
1.6 (latest)/label/Ubuntu/doxia-converter/target/classes
[INFO] [plexus-component-metadata:generate-metadata {execution: default}]
[debug] execute contextualize
[INFO] [resources:testResources {execution: default-testResources}]
[INFO] Using 'UTF-8' encoding to copy filtered resources.
[INFO] Copying 9 resources
[INFO] Copying 3 resources
[INFO] [compiler:testCompile {execution: default-testCompile}]
[INFO] Compiling 1 source file to /x1/jenkins/jenkins-slave/workspace/doxia-tools/jdk/JDK
1.6 (latest)/label/Ubuntu/doxia-converter/target/test-classes
[INFO] [surefire:test {execution: default-test}]
[INFO] Surefire report directory: /x1/jenkins/jenkins-slave/workspace/doxia-tools/jdk/JDK
1.6 (latest)/label/Ubuntu/doxia-converter/target/surefire-reports

-------------------------------------------------------
 T E S T S
-------------------------------------------------------
Running org.apache.maven.doxia.ConverterTest
[warn] [Apt Sink] Unknown Sink event: 'meta', ignoring!
[warn] [Apt Sink] Unknown Sink event: 'meta', ignoring!
[warn] [Apt Sink] Unknown Sink event: 'meta', ignoring!
[warn] [Docbook Sink] Unknown Sink event: 'meta', ignoring!
Tests run: 16, Failures: 0, Errors: 0, Skipped: 0, Time elapsed: 1.106 sec

Results :

Tests run: 16, Failures: 0, Errors: 0, Skipped: 0

[INFO] [jar:jar {execution: default-jar}]
[INFO] Building jar: /x1/jenkins/jenkins-slave/workspace/doxia-tools/jdk/JDK 1.6 (latest)/label/Ubuntu/doxia-converter/target/doxia-converter-1.3-SNAPSHOT.jar
[INFO] [assembly:single {execution: default}]
[INFO] Reading assembly descriptor: src/main/assembly/jar.xml
[INFO] Processing DependencySet (output=null)
[WARNING] The following patterns were never triggered in this artifact exclusion filter:
o  'junit-addons:junit-addons'
o  'javax.servlet:servlet-api'

[INFO] Building jar: /x1/jenkins/jenkins-slave/workspace/doxia-tools/jdk/JDK 1.6 (latest)/label/Ubuntu/doxia-converter/target/apache-doxia-1.3-SNAPSHOT-jar-with-dependencies.jar
[INFO] [install:install {execution: default-install}]
[INFO] Installing /x1/jenkins/jenkins-slave/workspace/doxia-tools/jdk/JDK 1.6 (latest)/label/Ubuntu/doxia-converter/target/doxia-converter-1.3-SNAPSHOT.jar
to /home/jenkins/.m2/repository/org/apache/maven/doxia/doxia-converter/1.3-SNAPSHOT/doxia-converter-1.3-SNAPSHOT.jar
[INFO] Installing /x1/jenkins/jenkins-slave/workspace/doxia-tools/jdk/JDK 1.6 (latest)/label/Ubuntu/doxia-converter/target/apache-doxia-1.3-SNAPSHOT-jar-with-dependencies.jar
to /home/jenkins/.m2/repository/org/apache/maven/doxia/doxia-converter/1.3-SNAPSHOT/doxia-converter-1.3-SNAPSHOT-jar-with-dependencies.jar
[INFO] ------------------------------------------------------------------------
[INFO] Building Doxia :: Integration Tools
[INFO]    task-segment: [clean, install]
[INFO] ------------------------------------------------------------------------
[INFO] [clean:clean {execution: default-clean}]
[INFO] Deleting /x1/jenkins/jenkins-slave/workspace/doxia-tools/jdk/JDK 1.6 (latest)/label/Ubuntu/doxia-integration-tools/target
[INFO] [enforcer:enforce {execution: enforce-bytecode-version}]
[INFO] snapshot org.apache.maven.doxia:doxia-logging-api:1.6-SNAPSHOT: checking for updates
from apache.snapshots
[INFO] snapshot org.apache.maven.doxia:doxia:1.6-SNAPSHOT: checking for updates from apache.snapshots
[INFO] snapshot org.apache.maven.doxia:doxia-decoration-model:1.6-SNAPSHOT: checking for updates
from apache.snapshots
[INFO] snapshot org.apache.maven.doxia:doxia-sitetools:1.6-SNAPSHOT: checking for updates
from apache.snapshots
[INFO] [enforcer:enforce {execution: ban-known-bad-maven-versions}]
[INFO] [remote-resources:process {execution: default}]
[INFO] [resources:resources {execution: default-resources}]
[INFO] Using 'UTF-8' encoding to copy filtered resources.
[INFO] Copying 26 resources
[INFO] Copying 3 resources
[INFO] [compiler:compile {execution: default-compile}]
[INFO] Changes detected - recompiling the module!
[INFO] Compiling 5 source files to /x1/jenkins/jenkins-slave/workspace/doxia-tools/jdk/JDK
1.6 (latest)/label/Ubuntu/doxia-integration-tools/target/classes
[WARNING] Note: /x1/jenkins/jenkins-slave/workspace/doxia-tools/jdk/JDK 1.6 (latest)/label/Ubuntu/doxia-integration-tools/src/main/java/org/apache/maven/doxia/tools/DefaultSiteTool.java
uses unchecked or unsafe operations.
[WARNING] Note: Recompile with -Xlint:unchecked for details.
[INFO] [plexus-component-metadata:generate-metadata {execution: default}]
[INFO] Discovered 1 component descriptors(s)
[INFO] [plexus-component-metadata:generate-metadata {execution: create-component-descriptor}]
[INFO] Discovered 1 component descriptors(s)
[INFO] [resources:testResources {execution: default-testResources}]
[INFO] Using 'UTF-8' encoding to copy filtered resources.
[INFO] Copying 3 resources
[INFO] Copying 3 resources
[INFO] [compiler:testCompile {execution: default-testCompile}]
[INFO] Changes detected - recompiling the module!
[INFO] Compiling 3 source files to /x1/jenkins/jenkins-slave/workspace/doxia-tools/jdk/JDK
1.6 (latest)/label/Ubuntu/doxia-integration-tools/target/test-classes
[INFO] -------------------------------------------------------------
[ERROR] COMPILATION ERROR : 
[INFO] -------------------------------------------------------------
[ERROR] /x1/jenkins/jenkins-slave/workspace/doxia-tools/jdk/JDK 1.6 (latest)/label/Ubuntu/doxia-integration-tools/src/test/java/org/apache/maven/doxia/tools/SiteToolTest.java:[261,17]
getDecorationModel(org.apache.maven.project.MavenProject,java.util.List<org.apache.maven.project.MavenProject>,org.apache.maven.artifact.repository.ArtifactRepository,java.util.List<org.apache.maven.artifact.repository.ArtifactRepository>,java.lang.String,java.util.Locale)
in org.apache.maven.doxia.tools.SiteTool cannot be applied to (org.apache.maven.doxia.tools.stubs.SiteToolMavenProjectStub,java.util.List<org.apache.maven.project.MavenProject>,org.apache.maven.artifact.repository.ArtifactRepository,java.util.List<org.apache.maven.artifact.repository.ArtifactRepository>,java.lang.String,java.util.Locale,java.lang.String,java.lang.String)
[ERROR] /x1/jenkins/jenkins-slave/workspace/doxia-tools/jdk/JDK 1.6 (latest)/label/Ubuntu/doxia-integration-tools/src/test/java/org/apache/maven/doxia/tools/SiteToolTest.java:[288,17]
getDecorationModel(org.apache.maven.project.MavenProject,java.util.List<org.apache.maven.project.MavenProject>,org.apache.maven.artifact.repository.ArtifactRepository,java.util.List<org.apache.maven.artifact.repository.ArtifactRepository>,java.lang.String,java.util.Locale)
in org.apache.maven.doxia.tools.SiteTool cannot be applied to (org.apache.maven.doxia.tools.stubs.SiteToolMavenProjectStub,java.util.List<org.apache.maven.project.MavenProject>,org.apache.maven.artifact.repository.ArtifactRepository,java.util.List<org.apache.maven.artifact.repository.ArtifactRepository>,java.lang.String,java.util.Locale,java.lang.String,java.lang.String)
[INFO] 2 errors 
[INFO] -------------------------------------------------------------
[INFO] ------------------------------------------------------------------------
[INFO] Building Doxia :: Linkcheck
[INFO]    task-segment: [clean, install]
[INFO] ------------------------------------------------------------------------
[INFO] [clean:clean {execution: default-clean}]
[INFO] Deleting /x1/jenkins/jenkins-slave/workspace/doxia-tools/jdk/JDK 1.6 (latest)/label/Ubuntu/doxia-linkcheck/target
[INFO] [modello:java {execution: linkcheck}]
[INFO] outputDirectory: /x1/jenkins/jenkins-slave/workspace/doxia-tools/jdk/JDK 1.6 (latest)/label/Ubuntu/doxia-linkcheck/target/generated-sources/modello
[INFO] Working on model: src/main/mdo/linkcheck.mdo
[INFO] Generating current version: 1.0.0
[INFO] [modello:xpp3-reader {execution: linkcheck}]
[INFO] outputDirectory: /x1/jenkins/jenkins-slave/workspace/doxia-tools/jdk/JDK 1.6 (latest)/label/Ubuntu/doxia-linkcheck/target/generated-sources/modello
[INFO] Working on model: src/main/mdo/linkcheck.mdo
[INFO] Generating current version: 1.0.0
[INFO] [modello:xpp3-writer {execution: linkcheck}]
[INFO] outputDirectory: /x1/jenkins/jenkins-slave/workspace/doxia-tools/jdk/JDK 1.6 (latest)/label/Ubuntu/doxia-linkcheck/target/generated-sources/modello
[INFO] Working on model: src/main/mdo/linkcheck.mdo
[INFO] Generating current version: 1.0.0
[INFO] [modello:java {execution: httpbean}]
[INFO] outputDirectory: /x1/jenkins/jenkins-slave/workspace/doxia-tools/jdk/JDK 1.6 (latest)/label/Ubuntu/doxia-linkcheck/target/generated-sources/modello
[INFO] Working on model: src/main/mdo/httpbean.mdo
[INFO] Generating current version: 1.0.0
[WARNING] The parameter expression: 'project.build.resources' used in mojo: 'process' has
been deprecated. Use 'project.resources' instead.
[INFO] [remote-resources:process {execution: default}]
[debug] execute contextualize
[INFO] [resources:resources {execution: default-resources}]
[INFO] Using 'UTF-8' encoding to copy filtered resources.
[INFO] Copying 1 resource
[INFO] Copying 3 resources
[INFO] [compiler:compile {execution: default-compile}]
[INFO] Compiling 21 source files to /x1/jenkins/jenkins-slave/workspace/doxia-tools/jdk/JDK
1.6 (latest)/label/Ubuntu/doxia-linkcheck/target/classes
[INFO] [plexus-component-metadata:generate-metadata {execution: default}]
[INFO] Discovered 1 component descriptors(s)
[debug] execute contextualize
[INFO] [resources:testResources {execution: default-testResources}]
[INFO] Using 'UTF-8' encoding to copy filtered resources.
[INFO] Copying 10 resources
[INFO] Copying 3 resources
[INFO] [compiler:testCompile {execution: default-testCompile}]
[INFO] Compiling 5 source files to /x1/jenkins/jenkins-slave/workspace/doxia-tools/jdk/JDK
1.6 (latest)/label/Ubuntu/doxia-linkcheck/target/test-classes
[INFO] [surefire:test {execution: default-test}]
[INFO] Surefire report directory: /x1/jenkins/jenkins-slave/workspace/doxia-tools/jdk/JDK
1.6 (latest)/label/Ubuntu/doxia-linkcheck/target/surefire-reports

-------------------------------------------------------
 T E S T S
-------------------------------------------------------
Running org.apache.maven.doxia.linkcheck.LinkCheckTest
[ INFO] Begin to check links in files...
[ WARN] Received: [302] for [http://commons.apache.org/jexl/] in page [/x1/jenkins/jenkins-slave/workspace/doxia-tools/jdk/JDK
1.6 (latest)/label/Ubuntu/doxia-linkcheck/src/test/resources/index-all.html]
[ INFO] Links checked.
Tests run: 1, Failures: 0, Errors: 0, Skipped: 0, Time elapsed: 0.836 sec
Running org.apache.maven.doxia.linkcheck.AnchorLinkTest
[ INFO] Begin to check links in files...
[ INFO] Links checked.
Tests run: 1, Failures: 0, Errors: 0, Skipped: 0, Time elapsed: 0.019 sec
Running org.apache.maven.doxia.linkcheck.validation.AnchorsTest
Tests run: 1, Failures: 0, Errors: 0, Skipped: 0, Time elapsed: 0 sec
Running org.apache.maven.doxia.linkcheck.validation.LinkValidatorManagerTest
Tests run: 1, Failures: 0, Errors: 0, Skipped: 0, Time elapsed: 0 sec
Running org.apache.maven.doxia.linkcheck.validation.HTTPLinkValidatorTest
Tests run: 1, Failures: 0, Errors: 0, Skipped: 0, Time elapsed: 0.688 sec

Results :

Tests run: 5, Failures: 0, Errors: 0, Skipped: 0

[INFO] [jar:jar {execution: default-jar}]
[INFO] Building jar: /x1/jenkins/jenkins-slave/workspace/doxia-tools/jdk/JDK 1.6 (latest)/label/Ubuntu/doxia-linkcheck/target/doxia-linkcheck-1.3-SNAPSHOT.jar
[INFO] [install:install {execution: default-install}]
[INFO] Installing /x1/jenkins/jenkins-slave/workspace/doxia-tools/jdk/JDK 1.6 (latest)/label/Ubuntu/doxia-linkcheck/target/doxia-linkcheck-1.3-SNAPSHOT.jar
to /home/jenkins/.m2/repository/org/apache/maven/doxia/doxia-linkcheck/1.3-SNAPSHOT/doxia-linkcheck-1.3-SNAPSHOT.jar
[INFO] ------------------------------------------------------------------------
[INFO] Building Doxia :: Tools Aggregator
[INFO]    task-segment: [clean, install]
[INFO] ------------------------------------------------------------------------
[INFO] [clean:clean {execution: default-clean}]
[INFO] Deleting /x1/jenkins/jenkins-slave/workspace/doxia-tools/jdk/JDK 1.6 (latest)/label/Ubuntu/target
[INFO] [enforcer:enforce {execution: enforce-bytecode-version}]
[INFO] [enforcer:enforce {execution: ban-known-bad-maven-versions}]
[INFO] [remote-resources:process {execution: default}]
[INFO] [site:attach-descriptor {execution: default-attach-descriptor}]
[INFO] [install:install {execution: default-install}]
[INFO] Installing /x1/jenkins/jenkins-slave/workspace/doxia-tools/jdk/JDK 1.6 (latest)/label/Ubuntu/pom.xml
to /home/jenkins/.m2/repository/org/apache/maven/doxia/doxia-tools-aggregator/1-SNAPSHOT/doxia-tools-aggregator-1-SNAPSHOT.pom
[INFO] 
[INFO] 
[INFO] ------------------------------------------------------------------------
[INFO] Reactor Summary:
[INFO] ------------------------------------------------------------------------
[INFO] Doxia :: Tools ........................................ SUCCESS [3.660s]
[INFO] Doxia :: Book Renderer ................................ SUCCESS [5.154s]
[INFO] Doxia :: Book Maven Plugin ............................ SUCCESS [3.727s]
[INFO] Doxia :: Converter .................................... SUCCESS [11.038s]
[INFO] Doxia :: Integration Tools ............................ FAILED [2.256s]
[INFO] Doxia :: Linkcheck .................................... SUCCESS [3.324s]
[INFO] Doxia :: Tools Aggregator ............................. SUCCESS [0.109s]
[INFO] ------------------------------------------------------------------------
[INFO] Error for project: Doxia :: Integration Tools (during install)
[INFO] ------------------------------------------------------------------------
[INFO] Compilation failure

/x1/jenkins/jenkins-slave/workspace/doxia-tools/jdk/JDK 1.6 (latest)/label/Ubuntu/doxia-integration-tools/src/test/java/org/apache/maven/doxia/tools/SiteToolTest.java:[261,17]
getDecorationModel(org.apache.maven.project.MavenProject,java.util.List<org.apache.maven.project.MavenProject>,org.apache.maven.artifact.repository.ArtifactRepository,java.util.List<org.apache.maven.artifact.repository.ArtifactRepository>,java.lang.String,java.util.Locale)
in org.apache.maven.doxia.tools.SiteTool cannot be applied to (org.apache.maven.doxia.tools.stubs.SiteToolMavenProjectStub,java.util.List<org.apache.maven.project.MavenProject>,org.apache.maven.artifact.repository.ArtifactRepository,java.util.List<org.apache.maven.artifact.repository.ArtifactRepository>,java.lang.String,java.util.Locale,java.lang.String,java.lang.String)
/x1/jenkins/jenkins-slave/workspace/doxia-tools/jdk/JDK 1.6 (latest)/label/Ubuntu/doxia-integration-tools/src/test/java/org/apache/maven/doxia/tools/SiteToolTest.java:[288,17]
getDecorationModel(org.apache.maven.project.MavenProject,java.util.List<org.apache.maven.project.MavenProject>,org.apache.maven.artifact.repository.ArtifactRepository,java.util.List<org.apache.maven.artifact.repository.ArtifactRepository>,java.lang.String,java.util.Locale)
in org.apache.maven.doxia.tools.SiteTool cannot be applied to (org.apache.maven.doxia.tools.stubs.SiteToolMavenProjectStub,java.util.List<org.apache.maven.project.MavenProject>,org.apache.maven.artifact.repository.ArtifactRepository,java.util.List<org.apache.maven.artifact.repository.ArtifactRepository>,java.lang.String,java.util.Locale,java.lang.String,java.lang.String)

[INFO] ------------------------------------------------------------------------
[INFO] Trace
org.apache.maven.BuildFailureException: Compilation failure
	at org.apache.maven.lifecycle.DefaultLifecycleExecutor.executeGoals(DefaultLifecycleExecutor.java:715)
	at org.apache.maven.lifecycle.DefaultLifecycleExecutor.executeGoalWithLifecycle(DefaultLifecycleExecutor.java:556)
	at org.apache.maven.lifecycle.DefaultLifecycleExecutor.executeGoal(DefaultLifecycleExecutor.java:535)
	at org.apache.maven.lifecycle.DefaultLifecycleExecutor.executeGoalAndHandleFailures(DefaultLifecycleExecutor.java:387)
	at org.apache.maven.lifecycle.DefaultLifecycleExecutor.executeTaskSegments(DefaultLifecycleExecutor.java:348)
	at org.apache.maven.lifecycle.DefaultLifecycleExecutor.execute(DefaultLifecycleExecutor.java:180)
	at org.apache.maven.DefaultMaven.doExecute(DefaultMaven.java:328)
	at org.apache.maven.DefaultMaven.execute(DefaultMaven.java:138)
	at org.apache.maven.cli.MavenCli.main(MavenCli.java:362)
	at org.apache.maven.cli.compat.CompatibleMain.main(CompatibleMain.java:60)
	at sun.reflect.NativeMethodAccessorImpl.invoke0(Native Method)
	at sun.reflect.NativeMethodAccessorImpl.invoke(NativeMethodAccessorImpl.java:39)
	at sun.reflect.DelegatingMethodAccessorImpl.invoke(DelegatingMethodAccessorImpl.java:25)
	at java.lang.reflect.Method.invoke(Method.java:597)
	at org.codehaus.classworlds.Launcher.launchEnhanced(Launcher.java:315)
	at org.codehaus.classworlds.Launcher.launch(Launcher.java:255)
	at org.codehaus.classworlds.Launcher.mainWithExitCode(Launcher.java:430)
	at org.codehaus.classworlds.Launcher.main(Launcher.java:375)
Caused by: org.apache.maven.plugin.compiler.CompilationFailureException: Compilation failure
	at org.apache.maven.plugin.compiler.AbstractCompilerMojo.execute(AbstractCompilerMojo.java:858)
	at org.apache.maven.plugin.compiler.TestCompilerMojo.execute(TestCompilerMojo.java:152)
	at org.apache.maven.plugin.DefaultPluginManager.executeMojo(DefaultPluginManager.java:490)
	at org.apache.maven.lifecycle.DefaultLifecycleExecutor.executeGoals(DefaultLifecycleExecutor.java:694)
	... 17 more
[INFO] ------------------------------------------------------------------------
[INFO] BUILD ERRORS
[INFO] ------------------------------------------------------------------------
[INFO] Total time: 29 seconds
[INFO] Finished at: Sat Jun 21 16:29:19 UTC 2014
[INFO] Final Memory: 90M/282M
[INFO] ------------------------------------------------------------------------
Build step 'Invoke top-level Maven targets' marked build as failure

Mime
View raw message