maven-notifications mailing list archives

Site index · List index
Message view « Date » · « Thread »
Top « Date » · « Thread »
From Apache Jenkins Server <jenk...@builds.apache.org>
Subject Build failed in Jenkins: maven-plugins-ITs-m2 #1536
Date Mon, 25 Aug 2014 00:36:36 GMT
See <https://builds.apache.org/job/maven-plugins-ITs-m2/1536/changes>

Changes:

[hboutemy] avoid failure on CI for an IT that is expected to fail at the moment

[hboutemy] Injection via @Parameter instead of @Component

[hboutemy] Injection via @Parameter instead of @Component

[hboutemy] Injection via @Parameter instead of @Component

[hboutemy] Injection via @Parameter instead of @Component

[hboutemy] Injection via @Parameter instead of @Component

[hboutemy] Injection via @Parameter instead of @Component

[hboutemy] Injection via @Parameter instead of @Component

[hboutemy] Injection via @Parameter instead of @Component

------------------------------------------
[...truncated 7442 lines...]
[INFO] ------------------------------------------------------------------------
[INFO] [clean:clean {execution: default-clean}]
[INFO] Deleting <https://builds.apache.org/job/maven-plugins-ITs-m2/ws/target>
[INFO] [enforcer:enforce {execution: enforce-bytecode-version}]
[INFO] [enforcer:enforce {execution: ban-known-bad-maven-versions}]
[INFO] [remote-resources:process {execution: default}]
[INFO] [site:attach-descriptor {execution: default-attach-descriptor}]
[INFO] [install:install {execution: default-install}]
[INFO] Installing <https://builds.apache.org/job/maven-plugins-ITs-m2/ws/pom.xml> to
/home/jenkins/.m2/repository/org/apache/maven/plugins/maven-plugins-aggregator/1-SNAPSHOT/maven-plugins-aggregator-1-SNAPSHOT.pom
[INFO] 
[INFO] 
[INFO] ------------------------------------------------------------------------
[INFO] Reactor Summary:
[INFO] ------------------------------------------------------------------------
[INFO] Apache Maven Plugins .................................. SUCCESS [16.731s]
[INFO] Apache Maven ACR Plugin ............................... SUCCESS [53.186s]
[INFO] Apache Maven Ant Plugin ............................... SUCCESS [2:32.724s]
[INFO] Apache Maven AntRun Plugin ............................ SUCCESS [1:27.987s]
[INFO] Apache Maven Eclipse Plugin ........................... SUCCESS [19:39.469s]
[INFO] Apache Maven Assembly Plugin .......................... SUCCESS [41:31.923s]
[INFO] Apache Maven Changelog Plugin ......................... SUCCESS [1:48.139s]
[INFO] Apache Maven Compiler Plugin .......................... FAILED [21.332s]
[INFO] Apache Maven Changes Plugin ........................... SKIPPED (dependency build failed
or was skipped)
[INFO] Apache Maven Checkstyle Plugin ........................ FAILED [39.787s]
[INFO] Apache Maven Clean Plugin ............................. FAILED [5.198s]
[INFO] Apache Maven Dependency Plugin ........................ FAILED [1:55.214s]
[INFO] Apache Maven Deploy Plugin ............................ FAILED [10.388s]
[INFO] Apache Maven DOAP Plugin .............................. FAILED [15.644s]
[INFO] Apache Maven Documentation Checker Plugin ............. FAILED [3.720s]
[INFO] Apache Maven EAR Plugin ............................... FAILED [14.418s]
[INFO] Apache Maven EJB Plugin ............................... FAILED [15.719s]
[INFO] Apache Maven Help Plugin .............................. FAILED [7.614s]
[INFO] Apache Maven Install Plugin ........................... FAILED [9.367s]
[INFO] Apache Maven JAR Plugin ............................... FAILED [8.327s]
[INFO] Apache Maven Jarsigner Plugin ......................... FAILED [5.432s]
[INFO] Apache Maven Javadoc Plugin ........................... FAILED [2:48.986s]
[INFO] Apache Maven Linkcheck Plugin ......................... FAILED [6.833s]
[INFO] Apache Maven Patch Plugin ............................. FAILED [1.795s]
[INFO] Apache Maven PDF Plugin ............................... FAILED [45.442s]
[INFO] Apache Maven RAR Plugin ............................... FAILED [8.426s]
[INFO] Apache Maven Repository Plugin ........................ FAILED [14.454s]
[INFO] Apache Maven Resources Plugin ......................... SKIPPED (dependency build failed
or was skipped)
[INFO] Apache Maven Site Plugin .............................. FAILED [29.808s]
[INFO] Apache Maven Source Plugin ............................ FAILED [12.115s]
[INFO] Apache Maven Stage Plugin ............................. FAILED [3.348s]
[INFO] Apache Maven Toolchains Plugin ........................ FAILED [2.933s]
[INFO] Apache Maven Verifier Plugin .......................... FAILED [2.872s]
[INFO] Apache Maven WAR Plugin ............................... FAILED [26.105s]
[INFO] Apache Maven PMD Plugin ............................... FAILED [48.742s]
[INFO] Apache Maven GPG Plugin ............................... FAILED [2.706s]
[INFO] Apache Maven Plugins Aggregator ....................... SUCCESS [0.106s]
[INFO] ------------------------------------------------------------------------
[INFO] Error for project: Apache Maven Compiler Plugin (during install)
[INFO] ------------------------------------------------------------------------
[INFO] There are test failures.

Please refer to <https://builds.apache.org/job/maven-plugins-ITs-m2/ws/maven-compiler-plugin/target/surefire-reports>
for the individual test results.
[INFO] ------------------------------------------------------------------------
[INFO] Error for project: Apache Maven Checkstyle Plugin (during install)
[INFO] ------------------------------------------------------------------------
[INFO] Failed to install project dependencies: MavenProject: org.apache.maven.plugins:maven-checkstyle-plugin:2.13-SNAPSHOT
@ <https://builds.apache.org/job/maven-plugins-ITs-m2/ws/maven-checkstyle-plugin/pom.xml>

Embedded error: Failed to install project artifacts: MavenProject: org.apache.maven.plugins:maven-compiler-plugin:3.2-SNAPSHOT
@ <https://builds.apache.org/job/maven-plugins-ITs-m2/ws/maven-compiler-plugin/pom.xml>
Artifact is not fully assembled: <https://builds.apache.org/job/maven-plugins-ITs-m2/ws/maven-compiler-plugin/target/classes>
[INFO] ------------------------------------------------------------------------
[INFO] Error for project: Apache Maven Clean Plugin (during install)
[INFO] ------------------------------------------------------------------------
[INFO] Failed to install project dependencies: MavenProject: org.apache.maven.plugins:maven-clean-plugin:2.6-SNAPSHOT
@ <https://builds.apache.org/job/maven-plugins-ITs-m2/ws/maven-clean-plugin/pom.xml>

Embedded error: Failed to install project artifacts: MavenProject: org.apache.maven.plugins:maven-compiler-plugin:3.2-SNAPSHOT
@ <https://builds.apache.org/job/maven-plugins-ITs-m2/ws/maven-compiler-plugin/pom.xml>
Artifact is not fully assembled: <https://builds.apache.org/job/maven-plugins-ITs-m2/ws/maven-compiler-plugin/target/classes>
[INFO] ------------------------------------------------------------------------
[INFO] Error for project: Apache Maven Dependency Plugin (during install)
[INFO] ------------------------------------------------------------------------
[INFO] Failed to install project dependencies: MavenProject: org.apache.maven.plugins:maven-dependency-plugin:2.9-SNAPSHOT
@ <https://builds.apache.org/job/maven-plugins-ITs-m2/ws/maven-dependency-plugin/pom.xml>

Embedded error: Failed to install project artifacts: MavenProject: org.apache.maven.plugins:maven-compiler-plugin:3.2-SNAPSHOT
@ <https://builds.apache.org/job/maven-plugins-ITs-m2/ws/maven-compiler-plugin/pom.xml>
Artifact is not fully assembled: <https://builds.apache.org/job/maven-plugins-ITs-m2/ws/maven-compiler-plugin/target/classes>
[INFO] ------------------------------------------------------------------------
[INFO] Error for project: Apache Maven Deploy Plugin (during install)
[INFO] ------------------------------------------------------------------------
[INFO] Failed to install project dependencies: MavenProject: org.apache.maven.plugins:maven-deploy-plugin:2.9-SNAPSHOT
@ <https://builds.apache.org/job/maven-plugins-ITs-m2/ws/maven-deploy-plugin/pom.xml>

Embedded error: Failed to install project artifacts: MavenProject: org.apache.maven.plugins:maven-compiler-plugin:3.2-SNAPSHOT
@ <https://builds.apache.org/job/maven-plugins-ITs-m2/ws/maven-compiler-plugin/pom.xml>
Artifact is not fully assembled: <https://builds.apache.org/job/maven-plugins-ITs-m2/ws/maven-compiler-plugin/target/classes>
[INFO] ------------------------------------------------------------------------
[INFO] Error for project: Apache Maven DOAP Plugin (during install)
[INFO] ------------------------------------------------------------------------
[INFO] Failed to install project dependencies: MavenProject: org.apache.maven.plugins:maven-doap-plugin:1.2-SNAPSHOT
@ <https://builds.apache.org/job/maven-plugins-ITs-m2/ws/maven-doap-plugin/pom.xml>

Embedded error: Failed to install project artifacts: MavenProject: org.apache.maven.plugins:maven-compiler-plugin:3.2-SNAPSHOT
@ <https://builds.apache.org/job/maven-plugins-ITs-m2/ws/maven-compiler-plugin/pom.xml>
Artifact is not fully assembled: <https://builds.apache.org/job/maven-plugins-ITs-m2/ws/maven-compiler-plugin/target/classes>
[INFO] ------------------------------------------------------------------------
[INFO] Error for project: Apache Maven Documentation Checker Plugin (during install)
[INFO] ------------------------------------------------------------------------
[INFO] Failed to install project dependencies: MavenProject: org.apache.maven.plugins:maven-docck-plugin:1.1-SNAPSHOT
@ <https://builds.apache.org/job/maven-plugins-ITs-m2/ws/maven-docck-plugin/pom.xml>

Embedded error: Failed to install project artifacts: MavenProject: org.apache.maven.plugins:maven-compiler-plugin:3.2-SNAPSHOT
@ <https://builds.apache.org/job/maven-plugins-ITs-m2/ws/maven-compiler-plugin/pom.xml>
Artifact is not fully assembled: <https://builds.apache.org/job/maven-plugins-ITs-m2/ws/maven-compiler-plugin/target/classes>
[INFO] ------------------------------------------------------------------------
[INFO] Error for project: Apache Maven EAR Plugin (during install)
[INFO] ------------------------------------------------------------------------
[INFO] Failed to install project dependencies: MavenProject: org.apache.maven.plugins:maven-ear-plugin:2.10-SNAPSHOT
@ <https://builds.apache.org/job/maven-plugins-ITs-m2/ws/maven-ear-plugin/pom.xml>

Embedded error: Failed to install project artifacts: MavenProject: org.apache.maven.plugins:maven-compiler-plugin:3.2-SNAPSHOT
@ <https://builds.apache.org/job/maven-plugins-ITs-m2/ws/maven-compiler-plugin/pom.xml>
Artifact is not fully assembled: <https://builds.apache.org/job/maven-plugins-ITs-m2/ws/maven-compiler-plugin/target/classes>
[INFO] ------------------------------------------------------------------------
[INFO] Error for project: Apache Maven EJB Plugin (during install)
[INFO] ------------------------------------------------------------------------
[INFO] Failed to install project dependencies: MavenProject: org.apache.maven.plugins:maven-ejb-plugin:2.5-SNAPSHOT
@ <https://builds.apache.org/job/maven-plugins-ITs-m2/ws/maven-ejb-plugin/pom.xml>

Embedded error: Failed to install project artifacts: MavenProject: org.apache.maven.plugins:maven-compiler-plugin:3.2-SNAPSHOT
@ <https://builds.apache.org/job/maven-plugins-ITs-m2/ws/maven-compiler-plugin/pom.xml>
Artifact is not fully assembled: <https://builds.apache.org/job/maven-plugins-ITs-m2/ws/maven-compiler-plugin/target/classes>
[INFO] ------------------------------------------------------------------------
[INFO] Error for project: Apache Maven Help Plugin (during install)
[INFO] ------------------------------------------------------------------------
[INFO] Failed to install project dependencies: MavenProject: org.apache.maven.plugins:maven-help-plugin:2.2.1-SNAPSHOT
@ <https://builds.apache.org/job/maven-plugins-ITs-m2/ws/maven-help-plugin/pom.xml>

Embedded error: Failed to install project artifacts: MavenProject: org.apache.maven.plugins:maven-compiler-plugin:3.2-SNAPSHOT
@ <https://builds.apache.org/job/maven-plugins-ITs-m2/ws/maven-compiler-plugin/pom.xml>
Artifact is not fully assembled: <https://builds.apache.org/job/maven-plugins-ITs-m2/ws/maven-compiler-plugin/target/classes>
[INFO] ------------------------------------------------------------------------
[INFO] Error for project: Apache Maven Install Plugin (during install)
[INFO] ------------------------------------------------------------------------
[INFO] Failed to install project dependencies: MavenProject: org.apache.maven.plugins:maven-install-plugin:2.6-SNAPSHOT
@ <https://builds.apache.org/job/maven-plugins-ITs-m2/ws/maven-install-plugin/pom.xml>

Embedded error: Failed to install project artifacts: MavenProject: org.apache.maven.plugins:maven-compiler-plugin:3.2-SNAPSHOT
@ <https://builds.apache.org/job/maven-plugins-ITs-m2/ws/maven-compiler-plugin/pom.xml>
Artifact is not fully assembled: <https://builds.apache.org/job/maven-plugins-ITs-m2/ws/maven-compiler-plugin/target/classes>
[INFO] ------------------------------------------------------------------------
[INFO] Error for project: Apache Maven JAR Plugin (during install)
[INFO] ------------------------------------------------------------------------
[INFO] Failed to install project dependencies: MavenProject: org.apache.maven.plugins:maven-jar-plugin:2.6-SNAPSHOT
@ <https://builds.apache.org/job/maven-plugins-ITs-m2/ws/maven-jar-plugin/pom.xml>

Embedded error: Failed to install project artifacts: MavenProject: org.apache.maven.plugins:maven-compiler-plugin:3.2-SNAPSHOT
@ <https://builds.apache.org/job/maven-plugins-ITs-m2/ws/maven-compiler-plugin/pom.xml>
Artifact is not fully assembled: <https://builds.apache.org/job/maven-plugins-ITs-m2/ws/maven-compiler-plugin/target/classes>
[INFO] ------------------------------------------------------------------------
[INFO] Error for project: Apache Maven Jarsigner Plugin (during install)
[INFO] ------------------------------------------------------------------------
[INFO] Failed to install project dependencies: MavenProject: org.apache.maven.plugins:maven-jarsigner-plugin:1.4-SNAPSHOT
@ <https://builds.apache.org/job/maven-plugins-ITs-m2/ws/maven-jarsigner-plugin/pom.xml>

Embedded error: Failed to install project artifacts: MavenProject: org.apache.maven.plugins:maven-compiler-plugin:3.2-SNAPSHOT
@ <https://builds.apache.org/job/maven-plugins-ITs-m2/ws/maven-compiler-plugin/pom.xml>
Artifact is not fully assembled: <https://builds.apache.org/job/maven-plugins-ITs-m2/ws/maven-compiler-plugin/target/classes>
[INFO] ------------------------------------------------------------------------
[INFO] Error for project: Apache Maven Javadoc Plugin (during install)
[INFO] ------------------------------------------------------------------------
[INFO] Failed to install project dependencies: MavenProject: org.apache.maven.plugins:maven-javadoc-plugin:2.9.2-SNAPSHOT
@ <https://builds.apache.org/job/maven-plugins-ITs-m2/ws/maven-javadoc-plugin/pom.xml>

Embedded error: Failed to install project artifacts: MavenProject: org.apache.maven.plugins:maven-compiler-plugin:3.2-SNAPSHOT
@ <https://builds.apache.org/job/maven-plugins-ITs-m2/ws/maven-compiler-plugin/pom.xml>
Artifact is not fully assembled: <https://builds.apache.org/job/maven-plugins-ITs-m2/ws/maven-compiler-plugin/target/classes>
[INFO] ------------------------------------------------------------------------
[INFO] Error for project: Apache Maven Linkcheck Plugin (during install)
[INFO] ------------------------------------------------------------------------
[INFO] Failed to install project dependencies: MavenProject: org.apache.maven.plugins:maven-linkcheck-plugin:1.2-SNAPSHOT
@ <https://builds.apache.org/job/maven-plugins-ITs-m2/ws/maven-linkcheck-plugin/pom.xml>

Embedded error: Failed to install project artifacts: MavenProject: org.apache.maven.plugins:maven-compiler-plugin:3.2-SNAPSHOT
@ <https://builds.apache.org/job/maven-plugins-ITs-m2/ws/maven-compiler-plugin/pom.xml>
Artifact is not fully assembled: <https://builds.apache.org/job/maven-plugins-ITs-m2/ws/maven-compiler-plugin/target/classes>
[INFO] ------------------------------------------------------------------------
[INFO] Error for project: Apache Maven Patch Plugin (during install)
[INFO] ------------------------------------------------------------------------
[INFO] Failed to install project dependencies: MavenProject: org.apache.maven.plugins:maven-patch-plugin:1.2-SNAPSHOT
@ <https://builds.apache.org/job/maven-plugins-ITs-m2/ws/maven-patch-plugin/pom.xml>

Embedded error: Failed to install project artifacts: MavenProject: org.apache.maven.plugins:maven-compiler-plugin:3.2-SNAPSHOT
@ <https://builds.apache.org/job/maven-plugins-ITs-m2/ws/maven-compiler-plugin/pom.xml>
Artifact is not fully assembled: <https://builds.apache.org/job/maven-plugins-ITs-m2/ws/maven-compiler-plugin/target/classes>
[INFO] ------------------------------------------------------------------------
[INFO] Error for project: Apache Maven PDF Plugin (during install)
[INFO] ------------------------------------------------------------------------
[INFO] Failed to install project dependencies: MavenProject: org.apache.maven.plugins:maven-pdf-plugin:1.3-SNAPSHOT
@ <https://builds.apache.org/job/maven-plugins-ITs-m2/ws/maven-pdf-plugin/pom.xml>

Embedded error: Failed to install project artifacts: MavenProject: org.apache.maven.plugins:maven-compiler-plugin:3.2-SNAPSHOT
@ <https://builds.apache.org/job/maven-plugins-ITs-m2/ws/maven-compiler-plugin/pom.xml>
Artifact is not fully assembled: <https://builds.apache.org/job/maven-plugins-ITs-m2/ws/maven-compiler-plugin/target/classes>
[INFO] ------------------------------------------------------------------------
[INFO] Error for project: Apache Maven RAR Plugin (during install)
[INFO] ------------------------------------------------------------------------
[INFO] Failed to install project dependencies: MavenProject: org.apache.maven.plugins:maven-rar-plugin:2.4-SNAPSHOT
@ <https://builds.apache.org/job/maven-plugins-ITs-m2/ws/maven-rar-plugin/pom.xml>

Embedded error: Failed to install project artifacts: MavenProject: org.apache.maven.plugins:maven-compiler-plugin:3.2-SNAPSHOT
@ <https://builds.apache.org/job/maven-plugins-ITs-m2/ws/maven-compiler-plugin/pom.xml>
Artifact is not fully assembled: <https://builds.apache.org/job/maven-plugins-ITs-m2/ws/maven-compiler-plugin/target/classes>
[INFO] ------------------------------------------------------------------------
[INFO] Error for project: Apache Maven Repository Plugin (during install)
[INFO] ------------------------------------------------------------------------
[INFO] Failed to install project dependencies: MavenProject: org.apache.maven.plugins:maven-repository-plugin:2.3.2-SNAPSHOT
@ <https://builds.apache.org/job/maven-plugins-ITs-m2/ws/maven-repository-plugin/pom.xml>

Embedded error: Failed to install project artifacts: MavenProject: org.apache.maven.plugins:maven-compiler-plugin:3.2-SNAPSHOT
@ <https://builds.apache.org/job/maven-plugins-ITs-m2/ws/maven-compiler-plugin/pom.xml>
Artifact is not fully assembled: <https://builds.apache.org/job/maven-plugins-ITs-m2/ws/maven-compiler-plugin/target/classes>
[INFO] ------------------------------------------------------------------------
[INFO] Error for project: Apache Maven Site Plugin (during install)
[INFO] ------------------------------------------------------------------------
[INFO] Failed to install project dependencies: MavenProject: org.apache.maven.plugins:maven-site-plugin:3.4.1-SNAPSHOT
@ <https://builds.apache.org/job/maven-plugins-ITs-m2/ws/maven-site-plugin/dependency-reduced-pom.xml>

Embedded error: Failed to install project artifacts: MavenProject: org.apache.maven.plugins:maven-compiler-plugin:3.2-SNAPSHOT
@ <https://builds.apache.org/job/maven-plugins-ITs-m2/ws/maven-compiler-plugin/pom.xml>
Artifact is not fully assembled: <https://builds.apache.org/job/maven-plugins-ITs-m2/ws/maven-compiler-plugin/target/classes>
[INFO] ------------------------------------------------------------------------
[INFO] Error for project: Apache Maven Source Plugin (during install)
[INFO] ------------------------------------------------------------------------
[INFO] Failed to install project dependencies: MavenProject: org.apache.maven.plugins:maven-source-plugin:2.4-SNAPSHOT
@ <https://builds.apache.org/job/maven-plugins-ITs-m2/ws/maven-source-plugin/pom.xml>

Embedded error: Failed to install project artifacts: MavenProject: org.apache.maven.plugins:maven-compiler-plugin:3.2-SNAPSHOT
@ <https://builds.apache.org/job/maven-plugins-ITs-m2/ws/maven-compiler-plugin/pom.xml>
Artifact is not fully assembled: <https://builds.apache.org/job/maven-plugins-ITs-m2/ws/maven-compiler-plugin/target/classes>
[INFO] ------------------------------------------------------------------------
[INFO] Error for project: Apache Maven Stage Plugin (during install)
[INFO] ------------------------------------------------------------------------
[INFO] Failed to install project dependencies: MavenProject: org.apache.maven.plugins:maven-stage-plugin:1.0-SNAPSHOT
@ <https://builds.apache.org/job/maven-plugins-ITs-m2/ws/maven-stage-plugin/pom.xml>

Embedded error: Failed to install project artifacts: MavenProject: org.apache.maven.plugins:maven-compiler-plugin:3.2-SNAPSHOT
@ <https://builds.apache.org/job/maven-plugins-ITs-m2/ws/maven-compiler-plugin/pom.xml>
Artifact is not fully assembled: <https://builds.apache.org/job/maven-plugins-ITs-m2/ws/maven-compiler-plugin/target/classes>
[INFO] ------------------------------------------------------------------------
[INFO] Error for project: Apache Maven Toolchains Plugin (during install)
[INFO] ------------------------------------------------------------------------
[INFO] Failed to install project dependencies: MavenProject: org.apache.maven.plugins:maven-toolchains-plugin:1.1-SNAPSHOT
@ <https://builds.apache.org/job/maven-plugins-ITs-m2/ws/maven-toolchains-plugin/pom.xml>

Embedded error: Failed to install project artifacts: MavenProject: org.apache.maven.plugins:maven-compiler-plugin:3.2-SNAPSHOT
@ <https://builds.apache.org/job/maven-plugins-ITs-m2/ws/maven-compiler-plugin/pom.xml>
Artifact is not fully assembled: <https://builds.apache.org/job/maven-plugins-ITs-m2/ws/maven-compiler-plugin/target/classes>
[INFO] ------------------------------------------------------------------------
[INFO] Error for project: Apache Maven Verifier Plugin (during install)
[INFO] ------------------------------------------------------------------------
[INFO] Failed to install project dependencies: MavenProject: org.apache.maven.plugins:maven-verifier-plugin:1.1-SNAPSHOT
@ <https://builds.apache.org/job/maven-plugins-ITs-m2/ws/maven-verifier-plugin/pom.xml>

Embedded error: Failed to install project artifacts: MavenProject: org.apache.maven.plugins:maven-compiler-plugin:3.2-SNAPSHOT
@ <https://builds.apache.org/job/maven-plugins-ITs-m2/ws/maven-compiler-plugin/pom.xml>
Artifact is not fully assembled: <https://builds.apache.org/job/maven-plugins-ITs-m2/ws/maven-compiler-plugin/target/classes>
[INFO] ------------------------------------------------------------------------
[INFO] Error for project: Apache Maven WAR Plugin (during install)
[INFO] ------------------------------------------------------------------------
[INFO] Failed to install project dependencies: MavenProject: org.apache.maven.plugins:maven-war-plugin:2.5-SNAPSHOT
@ <https://builds.apache.org/job/maven-plugins-ITs-m2/ws/maven-war-plugin/pom.xml>

Embedded error: Failed to install project artifacts: MavenProject: org.apache.maven.plugins:maven-compiler-plugin:3.2-SNAPSHOT
@ <https://builds.apache.org/job/maven-plugins-ITs-m2/ws/maven-compiler-plugin/pom.xml>
Artifact is not fully assembled: <https://builds.apache.org/job/maven-plugins-ITs-m2/ws/maven-compiler-plugin/target/classes>
[INFO] ------------------------------------------------------------------------
[INFO] Error for project: Apache Maven PMD Plugin (during install)
[INFO] ------------------------------------------------------------------------
[INFO] Failed to install project dependencies: MavenProject: org.apache.maven.plugins:maven-pmd-plugin:3.3-SNAPSHOT
@ <https://builds.apache.org/job/maven-plugins-ITs-m2/ws/maven-pmd-plugin/pom.xml>

Embedded error: Failed to install project artifacts: MavenProject: org.apache.maven.plugins:maven-compiler-plugin:3.2-SNAPSHOT
@ <https://builds.apache.org/job/maven-plugins-ITs-m2/ws/maven-compiler-plugin/pom.xml>
Artifact is not fully assembled: <https://builds.apache.org/job/maven-plugins-ITs-m2/ws/maven-compiler-plugin/target/classes>
[INFO] ------------------------------------------------------------------------
[INFO] Error for project: Apache Maven GPG Plugin (during install)
[INFO] ------------------------------------------------------------------------
[INFO] Failed to install project dependencies: MavenProject: org.apache.maven.plugins:maven-gpg-plugin:1.6-SNAPSHOT
@ <https://builds.apache.org/job/maven-plugins-ITs-m2/ws/maven-gpg-plugin/pom.xml>

Embedded error: Failed to install project artifacts: MavenProject: org.apache.maven.plugins:maven-compiler-plugin:3.2-SNAPSHOT
@ <https://builds.apache.org/job/maven-plugins-ITs-m2/ws/maven-compiler-plugin/pom.xml>
Artifact is not fully assembled: <https://builds.apache.org/job/maven-plugins-ITs-m2/ws/maven-compiler-plugin/target/classes>
[INFO] ------------------------------------------------------------------------
[INFO] For more information, run Maven with the -e switch
[INFO] ------------------------------------------------------------------------
[INFO] BUILD ERRORS
[INFO] ------------------------------------------------------------------------
[INFO] Total time: 79 minutes 
[INFO] Finished at: Mon Aug 25 00:35:07 UTC 2014
[INFO] Final Memory: 246M/613M
[INFO] ------------------------------------------------------------------------
Build step 'Invoke top-level Maven targets' marked build as failure

Mime
View raw message