maven-notifications mailing list archives

Site index · List index
Message view « Date » · « Thread »
Top « Date » · « Thread »
From Apache Jenkins Server <jenk...@builds.apache.org>
Subject Build failed in Jenkins: core-it-maven-3-win #616
Date Fri, 08 Aug 2014 19:46:26 GMT
See <https://builds.apache.org/job/core-it-maven-3-win/616/changes>

Changes:

[igor] MNG-5677 hooks to allow fine-grained cache management

------------------------------------------
[...truncated 16644 lines...]
  MavenITmng2103PluginExecutionInheritanceTest>AbstractMavenIntegrationTestCase.runTest:220->testit:55
» Verification
  MavenITmng2098VersionRangeSatisfiedFromWrongRepoTest>AbstractMavenIntegrationTestCase.runTest:220->testit:58
» Verification
  MavenITmng2068ReactorRelativeParentsTest>AbstractMavenIntegrationTestCase.runTest:220->testitInheritedIdFields:58
» Verification
  MavenITmng2068ReactorRelativeParentsTest>AbstractMavenIntegrationTestCase.runTest:220->testitExplicitIdFields:75
» Verification
  MavenITmng2068ReactorRelativeParentsTest>AbstractMavenIntegrationTestCase.runTest:220->testitComplex:92
» Verification
  MavenITmng2054PluginExecutionInheritanceTest>AbstractMavenIntegrationTestCase.runTest:220->testitMNG2054:53
» Verification
  MavenITmng2052InterpolateWithSettingsProfilePropertiesTest>AbstractMavenIntegrationTestCase.runTest:220->testitMNG2052:54
» Verification
  MavenITmng2045testJarDependenciesBrokenInReactorTest>AbstractMavenIntegrationTestCase.runTest:220->testitMNG2045:55
» Verification
  MavenITmng2006ChildPathAwareUrlInheritanceTest>AbstractMavenIntegrationTestCase.runTest:220->testitMNG2006:55
» Verification
  MavenITmng1995InterpolateBooleanModelElementsTest>AbstractMavenIntegrationTestCase.runTest:220->testitMNG1995:54
» Verification
  MavenITmng1992SystemPropOverridesPomPropTest>AbstractMavenIntegrationTestCase.runTest:220->testitMNG1992:57
» Verification
  MavenITmng1957JdkActivationWithVersionRangeTest>AbstractMavenIntegrationTestCase.runTest:220->testitMNG1957:54
» Verification
  MavenITmng1895ScopeConflictResolutionTest>AbstractMavenIntegrationTestCase.runTest:220->testitDirectVsIndirect:59
» Verification
  MavenITmng1895ScopeConflictResolutionTest>AbstractMavenIntegrationTestCase.runTest:220->testitCompileVsRuntime:88->run:227
» Verification
  MavenITmng1895ScopeConflictResolutionTest>AbstractMavenIntegrationTestCase.runTest:220->testitCompileVsTest:109->run:227
» Verification
  MavenITmng1895ScopeConflictResolutionTest>AbstractMavenIntegrationTestCase.runTest:220->testitCompileVsProvided:130->run:227
» Verification
  MavenITmng1895ScopeConflictResolutionTest>AbstractMavenIntegrationTestCase.runTest:220->testitRuntimeVsTest:151->run:227
» Verification
  MavenITmng1895ScopeConflictResolutionTest>AbstractMavenIntegrationTestCase.runTest:220->testitRuntimeVsProvided:172->run:227
» Verification
  MavenITmng1895ScopeConflictResolutionTest>AbstractMavenIntegrationTestCase.runTest:220->testitProvidedVsTest:195->run:227
» Verification
  MavenITmng1751ForcedMetadataUpdateDuringDeploymentTest>AbstractMavenIntegrationTestCase.runTest:220->testit:58
» Verification
  MavenITmng1703PluginMgmtDepInheritanceTest>AbstractMavenIntegrationTestCase.runTest:220->testitMNG1703:59
» Verification
  MavenITmng1701DuplicatePluginTest>AbstractMavenIntegrationTestCase.runTest:220->testit:51
» Verification
  MavenITmng1493NonStandardModulePomNamesTest>AbstractMavenIntegrationTestCase.runTest:220->testitMNG1493:50
» Verification
  MavenITmng1415QuotedSystemPropertiesTest>AbstractMavenIntegrationTestCase.runTest:220->testitMNG1415:53
» Verification
  MavenITmng1412DependenciesOrderTest>AbstractMavenIntegrationTestCase.runTest:220->testitMNG1412:56
» Verification
  MavenITmng1349ChecksumFormatsTest>AbstractMavenIntegrationTestCase.runTest:220->testitMNG1349:56
» Verification
  MavenITmng1323AntrunDependenciesTest>AbstractMavenIntegrationTestCase.runTest:220->testitMNG1323:62
» Verification
  MavenITmng1233WarDepWithProvidedScopeTest>AbstractMavenIntegrationTestCase.runTest:220->testitMNG1233:57
» Verification
  MavenITmng1144MultipleDefaultGoalsTest>AbstractMavenIntegrationTestCase.runTest:220->testit:53
» Verification
  MavenITmng1142VersionRangeIntersectionTest>AbstractMavenIntegrationTestCase.runTest:220->testitAB:49->testit:74
» Verification
  MavenITmng1142VersionRangeIntersectionTest>AbstractMavenIntegrationTestCase.runTest:220->testitBA:59->testit:74
» Verification
  MavenITmng1088ReactorPluginResolutionTest>AbstractMavenIntegrationTestCase.runTest:220->testitMNG1088:60
» Verification
  MavenITmng1073AggregatorForksReactorTest>AbstractMavenIntegrationTestCase.runTest:220->testitForkLifecycle:58
» Verification
  MavenITmng1073AggregatorForksReactorTest>AbstractMavenIntegrationTestCase.runTest:220->testitForkGoal:81
» Verification
  MavenITmng1052PluginMngtConfigTest>AbstractMavenIntegrationTestCase.runTest:220->testitMNG1052:53
» Verification
  MavenITmng1021EqualAttachmentBuildNumberTest>AbstractMavenIntegrationTestCase.runTest:220->testitMNG1021:53
» Verification
  MavenITmng0985NonExecutedPluginMngtGoalsTest>AbstractMavenIntegrationTestCase.runTest:220->testitMNG0985:53
» Verification
  MavenITmng0956ComponentInjectionViaProjectLevelPluginDepTest>AbstractMavenIntegrationTestCase.runTest:220->testitMNG0956:56
» Verification
  MavenITmng0947OptionalDependencyTest>AbstractMavenIntegrationTestCase.runTest:220->testit:58
» Verification
  MavenITmng0870ReactorAwarePluginDiscoveryTest>AbstractMavenIntegrationTestCase.runTest:220->testitMNG0870:58
» Verification
  MavenITmng0866EvaluateDefaultValueTest>AbstractMavenIntegrationTestCase.runTest:220->testitMNG866:55
» Verification
  MavenITmng0848SystemPropOverridesDefaultValueTest>AbstractMavenIntegrationTestCase.runTest:220->testitMNG848:55
» Verification
  MavenITmng0823MojoContextPassingTest>AbstractMavenIntegrationTestCase.runTest:220->testitMNG0823:56
» Verification
  MavenITmng0820ConflictResolutionTest>AbstractMavenIntegrationTestCase.runTest:220->testitMNG0820:57
» Verification
  MavenITmng0818WarDepsNotTransitiveTest>AbstractMavenIntegrationTestCase.runTest:220->testitMNG0818:58
» Verification
  MavenITmng0814ExplicitProfileActivationTest>AbstractMavenIntegrationTestCase.runTest:220->testitMNG814:55
» Verification
  MavenITmng0786ProfileAwareReactorTest>AbstractMavenIntegrationTestCase.runTest:220->testitMNG0786:56
» Verification
  MavenITmng0781PluginConfigVsExecConfigTest>AbstractMavenIntegrationTestCase.runTest:220->testitMNG0781:53
» Verification
  MavenITmng0773SettingsProfileReactorPollutionTest>AbstractMavenIntegrationTestCase.runTest:220->testitMNG773:53
» Verification
  MavenITmng0768OfflineModeTest>AbstractMavenIntegrationTestCase.runTest:220->testitMNG768:121
» Verification
  MavenITmng0761MissingSnapshotDistRepoTest>AbstractMavenIntegrationTestCase.runTest:220->testitMNG761:55
» Verification
  MavenITmng0680ParentBasedirTest>AbstractMavenIntegrationTestCase.runTest:220->testitMNG680:57
» Verification
  MavenITmng0674PluginParameterAliasTest>AbstractMavenIntegrationTestCase.runTest:220->testitLifecycle:56
» Verification
  MavenITmng0674PluginParameterAliasTest>AbstractMavenIntegrationTestCase.runTest:220->testitCli:78
» Verification
  MavenITmng0522InheritedPluginMgmtConfigTest>AbstractMavenIntegrationTestCase.runTest:220->testitMNG522:52
» Verification
  MavenITmng0507ArtifactRelocationTest>AbstractMavenIntegrationTestCase.runTest:220->testitMNG507:57
» Verification
  MavenITmng0505VersionRangeTest>AbstractMavenIntegrationTestCase.runTest:220->testitMNG505:61
» Verification
  MavenITmng0496IgnoreUnknownPluginParametersTest>AbstractMavenIntegrationTestCase.runTest:220->testitMNG496:53
» Verification
  MavenITmng0479OverrideCentralRepoTest>AbstractMavenIntegrationTestCase.runTest:220->testitModel:56
» Verification
  MavenITmng0479OverrideCentralRepoTest>AbstractMavenIntegrationTestCase.runTest:220->testitResolution:131
» Verification
  MavenITmng0471CustomLifecycleTest>AbstractMavenIntegrationTestCase.runTest:220->testitMNG471:56
» Verification
  MavenITmng0469ReportConfigTest>AbstractMavenIntegrationTestCase.runTest:220->testitBuildConfigDominantDuringBuild:75
» Verification
  MavenITmng0469ReportConfigTest>AbstractMavenIntegrationTestCase.runTest:220->testitBuildConfigIrrelevantForReports:100
» Verification
  MavenITmng0461TolerateMissingDependencyPomTest>AbstractMavenIntegrationTestCase.runTest:220->testit:57
» Verification
  MavenITmng0449PluginVersionResolutionTest>AbstractMavenIntegrationTestCase.runTest:220->testitLifecycleInvocation:66
» Verification
  MavenITmng0449PluginVersionResolutionTest>AbstractMavenIntegrationTestCase.runTest:220->testitCliInvocation:108
» Verification
  MavenITmng0377PluginLookupFromPrefixTest>AbstractMavenIntegrationTestCase.runTest:220->testitMNG377:58
» Verification
  MavenITmng0294MergeGlobalAndUserSettingsTest>AbstractMavenIntegrationTestCase.runTest:220->testitMNG294:65
» Verification
  MavenITmng0282NonReactorExecWhenProjectIndependentTest>AbstractMavenIntegrationTestCase.runTest:220->testitMNG282:53
» Verification
  MavenITmng0249ResolveDepsFromReactorTest>AbstractMavenIntegrationTestCase.runTest:220->testitMNG0249:52
» Verification
  MavenITmng0187CollectedProjectsTest>AbstractMavenIntegrationTestCase.runTest:220->testit:61
» Verification
  MavenITmng0095ReactorFailureBehaviorTest>AbstractMavenIntegrationTestCase.runTest:220->testitFailNever:92
» Verification
  MavenIT0144LifecycleExecutionOrderTest>AbstractMavenIntegrationTestCase.runTest:220->testit0144:55
» Verification
  MavenIT0143TransitiveDependencyScopesTest>AbstractMavenIntegrationTestCase.runTest:220->testitCompileScope:54->run:246
» Verification
  MavenIT0143TransitiveDependencyScopesTest>AbstractMavenIntegrationTestCase.runTest:220->testitProvidedScope:108->run:246
» Verification
  MavenIT0143TransitiveDependencyScopesTest>AbstractMavenIntegrationTestCase.runTest:220->testitRuntimeScope:153->run:246
» Verification
  MavenIT0143TransitiveDependencyScopesTest>AbstractMavenIntegrationTestCase.runTest:220->testitTestScope:198->run:246
» Verification
  MavenIT0142DirectDependencyScopesTest>AbstractMavenIntegrationTestCase.runTest:220->testit0142:64
» Verification
  MavenIT0140InterpolationWithPomPrefixTest>AbstractMavenIntegrationTestCase.runTest:220->testit0140:53
» Verification
  MavenIT0139InterpolationWithProjectPrefixTest>AbstractMavenIntegrationTestCase.runTest:220->testit0139:53
» Verification
  MavenIT0138PluginLifecycleTest>AbstractMavenIntegrationTestCase.runTest:220->testit0138:52
» Verification
  MavenIT0137EarLifecycleTest>AbstractMavenIntegrationTestCase.runTest:220->testit0137:52
» Verification
  MavenIT0136RarLifecycleTest>AbstractMavenIntegrationTestCase.runTest:220->testit0136:52
» Verification
  MavenIT0135EjbLifecycleTest>AbstractMavenIntegrationTestCase.runTest:220->testit0135:52
» Verification
  MavenIT0134WarLifecycleTest>AbstractMavenIntegrationTestCase.runTest:220->testit0134:52
» Verification
  MavenIT0133JarLifecycleTest>AbstractMavenIntegrationTestCase.runTest:220->testit0133:52
» Verification
  MavenIT0132PomLifecycleTest>AbstractMavenIntegrationTestCase.runTest:220->testit0132:52
» Verification
  MavenIT0131SiteLifecycleTest>AbstractMavenIntegrationTestCase.runTest:220->testit0131:52
» Verification
  MavenIT0130CleanLifecycleTest>AbstractMavenIntegrationTestCase.runTest:220->testit0130:52
» Verification
  MavenIT0113ServerAuthzAvailableToWagonMgrInPluginTest>AbstractMavenIntegrationTestCase.runTest:220->testit0113:50
» Verification
  MavenIT0090EnvVarInterpolationTest>AbstractMavenIntegrationTestCase.runTest:220->testit0090:52
» Verification
  MavenIT0087PluginRealmWithProjectLevelDepsTest>AbstractMavenIntegrationTestCase.runTest:220->testit0087:58
» Verification
  MavenIT0086PluginRealmTest>AbstractMavenIntegrationTestCase.runTest:220->testit0086:54
» Verification
  MavenIT0085TransitiveSystemScopeTest>AbstractMavenIntegrationTestCase.runTest:220->testit0085:55
» Verification
  MavenIT0072InterpolationWithDottedPropertyTest>AbstractMavenIntegrationTestCase.runTest:220->testit0072:54
» Verification
  MavenIT0071PluginConfigWithDottedPropertyTest>AbstractMavenIntegrationTestCase.runTest:220->testit0071:53
» Verification
  MavenIT0064MojoConfigViaSettersTest>AbstractMavenIntegrationTestCase.runTest:220->testit0064:47
» Verification
  MavenIT0063SystemScopeDependencyTest>AbstractMavenIntegrationTestCase.runTest:220->testit0063:48
» Verification
  MavenIT0056MultipleGoalExecutionsTest>AbstractMavenIntegrationTestCase.runTest:220->testit0056:47
» Verification
  MavenIT0052ReleaseProfileTest>AbstractMavenIntegrationTestCase.runTest:220->testit0052:47
» Verification
  MavenIT0051ReleaseProfileTest>AbstractMavenIntegrationTestCase.runTest:220->testit0051:48
» Verification
  MavenIT0041ArtifactTypeFromPluginExtensionTest>AbstractMavenIntegrationTestCase.runTest:220->testit0041:54
» Verification
  MavenIT0040PackagingFromPluginExtensionTest>AbstractMavenIntegrationTestCase.runTest:220->testit0040:53
» Verification
  MavenIT0038AlternatePomFileDifferentDirTest>AbstractMavenIntegrationTestCase.runTest:220->testit0038:54
» Verification
  MavenIT0037AlternatePomFileSameDirTest>AbstractMavenIntegrationTestCase.runTest:220->testit0037:54
» Verification
  MavenIT0032MavenPrerequisiteTest>AbstractMavenIntegrationTestCase.runTest:220->testit0032:45
» Verification
  MavenIT0030DepPomDepMngtInheritanceTest>AbstractMavenIntegrationTestCase.runTest:220->testit0030:48
» Verification
  MavenIT0025MultipleExecutionLevelConfigsTest>AbstractMavenIntegrationTestCase.runTest:220->testit0025:52
» Verification
  MavenIT0024MultipleGoalExecutionsTest>AbstractMavenIntegrationTestCase.runTest:220->testit0024:53
» Verification
  MavenIT0023SettingsProfileTest>AbstractMavenIntegrationTestCase.runTest:220->testit0023:49
» Verification
  MavenIT0021PomProfileTest>AbstractMavenIntegrationTestCase.runTest:220->testit0021:52
» Verification
  MavenIT0019PluginVersionMngtBySuperPomTest>AbstractMavenIntegrationTestCase.runTest:220->testit0019:45
» Verification
  MavenIT0018DependencyManagementTest>AbstractMavenIntegrationTestCase.runTest:220->testit0018:50
» Verification
  MavenIT0012PomInterpolationTest>AbstractMavenIntegrationTestCase.runTest:220->testit0012:46
» Verification
  MavenIT0011DefaultVersionByDependencyManagementTest>AbstractMavenIntegrationTestCase.runTest:220->testit0011:50
» Verification
  MavenIT0010DependencyClosureResolutionTest>AbstractMavenIntegrationTestCase.runTest:220->testit0010:53
» Verification
  MavenIT0009GoalConfigurationTest>AbstractMavenIntegrationTestCase.runTest:220->testit0009:50
» Verification
  MavenIT0008SimplePluginTest>AbstractMavenIntegrationTestCase.runTest:220->testit0008:50
» Verification

Tests run: 750, Failures: 20, Errors: 631, Skipped: 0

[INFO] ------------------------------------------------------------------------
[INFO] Reactor Summary:
[INFO] 
[INFO] Maven Core ITs .................................... SUCCESS [34.858s]
[INFO] Maven IT Support .................................. SUCCESS [0.089s]
[INFO] Maven IT :: Plugins ............................... SUCCESS [0.094s]
[INFO] Maven IT Plugin :: Active Collection .............. SUCCESS [18.376s]
[INFO] Maven IT Plugin :: Ant-Based ...................... SUCCESS [6.841s]
[INFO] Maven IT Plugin :: Artifact ....................... SUCCESS [2.262s]
[INFO] Maven IT Plugin :: Class Loader :: Dependency A ... SUCCESS [0.340s]
[INFO] Maven IT Plugin :: Class Loader :: Dependency B ... SUCCESS [0.200s]
[INFO] Maven IT Plugin :: Class Loader :: Dependency C ... SUCCESS [0.109s]
[INFO] Maven IT Plugin :: Class Loader ................... SUCCESS [7.001s]
[INFO] Maven IT Plugin :: Class Loader :: Aggregator ..... SUCCESS [0.070s]
[INFO] Maven IT Plugin :: Configuration .................. SUCCESS [1.634s]
[INFO] Maven IT Plugin :: Context Passing ................ SUCCESS [0.371s]
[INFO] Maven ITs :: Core Plugin Stubs .................... SUCCESS [0.105s]
[INFO] Maven IT Clean Plugin Stub ........................ SUCCESS [0.341s]
[INFO] Maven IT Compiler Plugin Stub ..................... SUCCESS [0.514s]
[INFO] Maven IT Deploy Plugin Stub ....................... SUCCESS [0.668s]
[INFO] Maven IT EAR Plugin Stub .......................... SUCCESS [0.489s]
[INFO] Maven IT EJB Plugin Stub .......................... SUCCESS [0.523s]
[INFO] Maven IT Install Plugin Stub ...................... SUCCESS [0.552s]
[INFO] Maven IT JAR Plugin Stub .......................... SUCCESS [0.697s]
[INFO] Maven IT Javadoc Plugin Stub ...................... SUCCESS [0.862s]
[INFO] Maven IT Plugin Plugin Stub ....................... SUCCESS [0.455s]
[INFO] Maven IT RAR Plugin Stub .......................... SUCCESS [0.360s]
[INFO] Maven IT Resources Plugin Stub .................... SUCCESS [0.428s]
[INFO] Maven IT Site Plugin Stub ......................... SUCCESS [0.452s]
[INFO] Maven IT Source Plugin Stub ....................... SUCCESS [1.464s]
[INFO] Maven IT Surefire Plugin Stub ..................... SUCCESS [0.765s]
[INFO] Maven IT WAR Plugin Stub .......................... SUCCESS [1.178s]
[INFO] Maven IT Plugin :: Dependency Collection .......... SUCCESS [0.618s]
[INFO] Maven IT Plugin :: Dependency Resolution .......... SUCCESS [9.033s]
[INFO] Maven IT Plugin :: Expression ..................... SUCCESS [0.755s]
[INFO] Maven IT Plugin :: Error Mojos .................... SUCCESS [13.907s]
[INFO] Maven IT Component ................................ SUCCESS [0.203s]
[INFO] Maven IT Plugin :: Extension Consumer ............. SUCCESS [0.258s]
[INFO] Maven IT Plugin :: Extension Provider ............. SUCCESS [0.199s]
[INFO] Maven IT Plugin :: Fork ........................... SUCCESS [0.334s]
[INFO] Maven IT Plugin :: Invalid Descriptor ............. SUCCESS [0.171s]
[INFO] Maven IT Plugin :: Log File ....................... SUCCESS [0.237s]
[INFO] Maven IT Helper Library ........................... SUCCESS [2.640s]
[INFO] Maven IT Plugin :: Model Interpolation ............ SUCCESS [0.578s]
[INFO] Maven IT Plugin :: No Default Component ........... SUCCESS [0.314s]
[INFO] Maven IT Plugin :: No Project ..................... SUCCESS [0.180s]
[INFO] Maven IT Plugin :: Online ......................... SUCCESS [0.197s]
[INFO] Maven IT Plugin :: Optional Mojos ................. SUCCESS [0.865s]
[INFO] Maven IT Plugin :: Packaging ...................... SUCCESS [0.286s]
[INFO] Maven IT Plugin :: Parameter Implementation ....... SUCCESS [0.192s]
[INFO] Maven IT Plugin :: Plugin Dependency .............. SUCCESS [0.347s]
[INFO] Maven IT Plugin :: Project ........................ SUCCESS [0.401s]
[INFO] Maven IT Plugin :: Project Interpolation .......... SUCCESS [0.441s]
[INFO] Maven IT Plugin :: Setter ......................... SUCCESS [0.359s]
[INFO] Maven IT Plugin :: Singleton Component ............ SUCCESS [0.327s]
[INFO] Maven IT Plugin :: Site ........................... SUCCESS [1.910s]
[INFO] Maven IT Plugin :: Toolchain ...................... SUCCESS [6.580s]
[INFO] Maven IT Plugin :: Touch .......................... SUCCESS [1.005s]
[INFO] Maven IT Plugin :: Uses Properties Plugin ......... SUCCESS [0.290s]
[INFO] Maven IT Plugin :: Uses Wagon Plugin .............. SUCCESS [1.870s]
[INFO] Maven IT Plugin :: This plugin should contain the mojos needed by all tests.  SUCCESS
[0.356s]
[INFO] Maven IT Plugin :: Plexus Utils 1.1 ............... SUCCESS [0.557s]
[INFO] Maven IT Plugin :: Plexus Utils New ............... SUCCESS [0.352s]
[INFO] Maven IT Plugin :: Plexus Component API ........... SUCCESS [1.065s]
[INFO] Maven IT Plugin :: Log4J Client ................... SUCCESS [0.598s]
[INFO] Maven IT Plugin :: Extension 1 .................... SUCCESS [0.288s]
[INFO] Maven IT Plugin :: Extension 2 .................... SUCCESS [0.294s]
[INFO] Maven IT Plugin :: Plexus Lifecycle ............... SUCCESS [2.562s]
[INFO] Maven IT Plugin :: Settings ....................... SUCCESS [0.465s]
[INFO] Maven IT Toolchain ................................ SUCCESS [0.651s]
[INFO] Maven IT Wagon .................................... SUCCESS [0.310s]
[INFO] Maven IT Support Artifacts ........................ SUCCESS [2.918s]
[INFO] Maven IT Extension ................................ SUCCESS [0.273s]
[INFO] Maven ITs ......................................... FAILURE [3:57.866s]
[INFO] ------------------------------------------------------------------------
[INFO] BUILD FAILURE
[INFO] ------------------------------------------------------------------------
[INFO] Total time: 6:20.284s
[INFO] Finished at: Fri Aug 08 20:45:51 BST 2014
[INFO] Final Memory: 41M/766M
[INFO] ------------------------------------------------------------------------
[ERROR] Failed to execute goal org.apache.maven.plugins:maven-surefire-plugin:2.13:test (default-test)
on project core-it-suite: There are test failures.
[ERROR] 
[ERROR] Please refer to F:\ws\m3-its\core-integration-testing-trunk\core-it-suite\target\surefire-reports
for the individual test results.
[ERROR] -> [Help 1]
org.apache.maven.lifecycle.LifecycleExecutionException: Failed to execute goal org.apache.maven.plugins:maven-surefire-plugin:2.13:test
(default-test) on project core-it-suite: There are test failures.

Please refer to F:\ws\m3-its\core-integration-testing-trunk\core-it-suite\target\surefire-reports
for the individual test results.
	at org.apache.maven.lifecycle.internal.MojoExecutor.execute(MojoExecutor.java:213)
	at org.apache.maven.lifecycle.internal.MojoExecutor.execute(MojoExecutor.java:153)
	at org.apache.maven.lifecycle.internal.MojoExecutor.execute(MojoExecutor.java:145)
	at org.apache.maven.lifecycle.internal.LifecycleModuleBuilder.buildProject(LifecycleModuleBuilder.java:84)
	at org.apache.maven.lifecycle.internal.LifecycleModuleBuilder.buildProject(LifecycleModuleBuilder.java:59)
	at org.apache.maven.lifecycle.internal.LifecycleStarter.singleThreadedBuild(LifecycleStarter.java:183)
	at org.apache.maven.lifecycle.internal.LifecycleStarter.execute(LifecycleStarter.java:161)
	at org.apache.maven.DefaultMaven.doExecute(DefaultMaven.java:320)
	at org.apache.maven.DefaultMaven.execute(DefaultMaven.java:156)
	at org.apache.maven.cli.MavenCli.execute(MavenCli.java:537)
	at org.apache.maven.cli.MavenCli.doMain(MavenCli.java:196)
	at org.apache.maven.cli.MavenCli.main(MavenCli.java:141)
	at sun.reflect.NativeMethodAccessorImpl.invoke0(Native Method)
	at sun.reflect.NativeMethodAccessorImpl.invoke(NativeMethodAccessorImpl.java:39)
	at sun.reflect.DelegatingMethodAccessorImpl.invoke(DelegatingMethodAccessorImpl.java:25)
	at java.lang.reflect.Method.invoke(Method.java:597)
	at org.codehaus.plexus.classworlds.launcher.Launcher.launchEnhanced(Launcher.java:290)
	at org.codehaus.plexus.classworlds.launcher.Launcher.launch(Launcher.java:230)
	at org.codehaus.plexus.classworlds.launcher.Launcher.mainWithExitCode(Launcher.java:409)
	at org.codehaus.plexus.classworlds.launcher.Launcher.main(Launcher.java:352)
Caused by: org.apache.maven.plugin.MojoFailureException: There are test failures.

Please refer to F:\ws\m3-its\core-integration-testing-trunk\core-it-suite\target\surefire-reports
for the individual test results.
	at org.apache.maven.plugin.surefire.SurefireHelper.reportExecution(SurefireHelper.java:82)
	at org.apache.maven.plugin.surefire.SurefirePlugin.handleSummary(SurefirePlugin.java:151)
	at org.apache.maven.plugin.surefire.AbstractSurefireMojo.executeAfterPreconditionsChecked(AbstractSurefireMojo.java:721)
	at org.apache.maven.plugin.surefire.AbstractSurefireMojo.execute(AbstractSurefireMojo.java:620)
	at org.apache.maven.plugin.DefaultBuildPluginManager.executeMojo(DefaultBuildPluginManager.java:101)
	at org.apache.maven.lifecycle.internal.MojoExecutor.execute(MojoExecutor.java:209)
	... 19 more
[ERROR] 
[ERROR] Re-run Maven using the -X switch to enable full debug logging.
[ERROR] 
[ERROR] For more information about the errors and possible solutions, please read the following
articles:
[ERROR] [Help 1] http://cwiki.apache.org/confluence/display/MAVEN/MojoFailureException
[ERROR] 
[ERROR] After correcting the problems, you can resume the build with the command
[ERROR]   mvn <goals> -rf :core-it-suite
Build step 'Invoke top-level Maven targets' marked build as failure
Recording test results

Mime
View raw message