maven-notifications mailing list archives

Site index · List index
Message view « Date » · « Thread »
Top « Date » · « Thread »
From Apache Jenkins Server <jenk...@builds.apache.org>
Subject Build failed in Jenkins: maven-plugins-ITs-m2 #1511
Date Fri, 08 Aug 2014 19:56:04 GMT
See <https://builds.apache.org/job/maven-plugins-ITs-m2/1511/changes>

Changes:

[Robert Scholte] [MDEP-453] Change Maven prerequisite to 2.2.1

[Robert Scholte] Upgrade maven-invoker-plugin to 1.9
replace maven-antrun-plugin with invokers cloneClean property

[khmarbaise] - Reformatted the whole code.

[khmarbaise] [MEJB-58]
 - Added the ejb-jar.xml file as a parameter which can
   be changed if needed. This also implies the documentation
   of where it will be get from.

[Robert Scholte] Fix formatting
Prefer File.getPath() over File.toString()

------------------------------------------
[...truncated 11134 lines...]
[INFO] Installing <https://builds.apache.org/job/maven-plugins-ITs-m2/ws/maven-ant-plugin/target/maven-ant-plugin-2.4-SNAPSHOT.jar>
to <https://builds.apache.org/job/maven-plugins-ITs-m2/ws/maven-gpg-plugin/target/local-repo/org/apache/maven/plugins/maven-ant-plugin/2.4-SNAPSHOT/maven-ant-plugin-2.4-SNAPSHOT.jar>
[INFO] Installing <https://builds.apache.org/job/maven-plugins-ITs-m2/ws/maven-antrun-plugin/pom.xml>
to <https://builds.apache.org/job/maven-plugins-ITs-m2/ws/maven-gpg-plugin/target/local-repo/org/apache/maven/plugins/maven-antrun-plugin/1.8-SNAPSHOT/maven-antrun-plugin-1.8-SNAPSHOT.pom>
[INFO] Installing <https://builds.apache.org/job/maven-plugins-ITs-m2/ws/maven-antrun-plugin/target/maven-antrun-plugin-1.8-SNAPSHOT.jar>
to <https://builds.apache.org/job/maven-plugins-ITs-m2/ws/maven-gpg-plugin/target/local-repo/org/apache/maven/plugins/maven-antrun-plugin/1.8-SNAPSHOT/maven-antrun-plugin-1.8-SNAPSHOT.jar>
[INFO] Installing <https://builds.apache.org/job/maven-plugins-ITs-m2/ws/maven-eclipse-plugin/pom.xml>
to <https://builds.apache.org/job/maven-plugins-ITs-m2/ws/maven-gpg-plugin/target/local-repo/org/apache/maven/plugins/maven-eclipse-plugin/2.10-SNAPSHOT/maven-eclipse-plugin-2.10-SNAPSHOT.pom>
[INFO] Installing <https://builds.apache.org/job/maven-plugins-ITs-m2/ws/maven-eclipse-plugin/target/maven-eclipse-plugin-2.10-SNAPSHOT.jar>
to <https://builds.apache.org/job/maven-plugins-ITs-m2/ws/maven-gpg-plugin/target/local-repo/org/apache/maven/plugins/maven-eclipse-plugin/2.10-SNAPSHOT/maven-eclipse-plugin-2.10-SNAPSHOT.jar>
[INFO] Installing <https://builds.apache.org/job/maven-plugins-ITs-m2/ws/maven-assembly-plugin/pom.xml>
to <https://builds.apache.org/job/maven-plugins-ITs-m2/ws/maven-gpg-plugin/target/local-repo/org/apache/maven/plugins/maven-assembly-plugin/2.4.2-SNAPSHOT/maven-assembly-plugin-2.4.2-SNAPSHOT.pom>
[INFO] Installing <https://builds.apache.org/job/maven-plugins-ITs-m2/ws/maven-assembly-plugin/target/maven-assembly-plugin-2.4.2-SNAPSHOT.jar>
to <https://builds.apache.org/job/maven-plugins-ITs-m2/ws/maven-gpg-plugin/target/local-repo/org/apache/maven/plugins/maven-assembly-plugin/2.4.2-SNAPSHOT/maven-assembly-plugin-2.4.2-SNAPSHOT.jar>
[INFO] Installing <https://builds.apache.org/job/maven-plugins-ITs-m2/ws/maven-changelog-plugin/pom.xml>
to <https://builds.apache.org/job/maven-plugins-ITs-m2/ws/maven-gpg-plugin/target/local-repo/org/apache/maven/plugins/maven-changelog-plugin/2.4-SNAPSHOT/maven-changelog-plugin-2.4-SNAPSHOT.pom>
[INFO] Installing <https://builds.apache.org/job/maven-plugins-ITs-m2/ws/maven-changelog-plugin/target/maven-changelog-plugin-2.4-SNAPSHOT.jar>
to <https://builds.apache.org/job/maven-plugins-ITs-m2/ws/maven-gpg-plugin/target/local-repo/org/apache/maven/plugins/maven-changelog-plugin/2.4-SNAPSHOT/maven-changelog-plugin-2.4-SNAPSHOT.jar>
[INFO] Installing <https://builds.apache.org/job/maven-plugins-ITs-m2/ws/maven-compiler-plugin/pom.xml>
to <https://builds.apache.org/job/maven-plugins-ITs-m2/ws/maven-gpg-plugin/target/local-repo/org/apache/maven/plugins/maven-compiler-plugin/3.2-SNAPSHOT/maven-compiler-plugin-3.2-SNAPSHOT.pom>
[INFO] Installing <https://builds.apache.org/job/maven-plugins-ITs-m2/ws/maven-compiler-plugin/target/maven-compiler-plugin-3.2-SNAPSHOT.jar>
to <https://builds.apache.org/job/maven-plugins-ITs-m2/ws/maven-gpg-plugin/target/local-repo/org/apache/maven/plugins/maven-compiler-plugin/3.2-SNAPSHOT/maven-compiler-plugin-3.2-SNAPSHOT.jar>
[INFO] Installing <https://builds.apache.org/job/maven-plugins-ITs-m2/ws/maven-changes-plugin/pom.xml>
to <https://builds.apache.org/job/maven-plugins-ITs-m2/ws/maven-gpg-plugin/target/local-repo/org/apache/maven/plugins/maven-changes-plugin/2.11-SNAPSHOT/maven-changes-plugin-2.11-SNAPSHOT.pom>
[INFO] Installing <https://builds.apache.org/job/maven-plugins-ITs-m2/ws/maven-changes-plugin/target/maven-changes-plugin-2.11-SNAPSHOT.jar>
to <https://builds.apache.org/job/maven-plugins-ITs-m2/ws/maven-gpg-plugin/target/local-repo/org/apache/maven/plugins/maven-changes-plugin/2.11-SNAPSHOT/maven-changes-plugin-2.11-SNAPSHOT.jar>
[INFO] Installing <https://builds.apache.org/job/maven-plugins-ITs-m2/ws/maven-checkstyle-plugin/pom.xml>
to <https://builds.apache.org/job/maven-plugins-ITs-m2/ws/maven-gpg-plugin/target/local-repo/org/apache/maven/plugins/maven-checkstyle-plugin/2.13-SNAPSHOT/maven-checkstyle-plugin-2.13-SNAPSHOT.pom>
[INFO] Installing <https://builds.apache.org/job/maven-plugins-ITs-m2/ws/maven-checkstyle-plugin/target/maven-checkstyle-plugin-2.13-SNAPSHOT.jar>
to <https://builds.apache.org/job/maven-plugins-ITs-m2/ws/maven-gpg-plugin/target/local-repo/org/apache/maven/plugins/maven-checkstyle-plugin/2.13-SNAPSHOT/maven-checkstyle-plugin-2.13-SNAPSHOT.jar>
[INFO] Installing <https://builds.apache.org/job/maven-plugins-ITs-m2/ws/maven-clean-plugin/pom.xml>
to <https://builds.apache.org/job/maven-plugins-ITs-m2/ws/maven-gpg-plugin/target/local-repo/org/apache/maven/plugins/maven-clean-plugin/2.6-SNAPSHOT/maven-clean-plugin-2.6-SNAPSHOT.pom>
[INFO] Installing <https://builds.apache.org/job/maven-plugins-ITs-m2/ws/maven-clean-plugin/target/maven-clean-plugin-2.6-SNAPSHOT.jar>
to <https://builds.apache.org/job/maven-plugins-ITs-m2/ws/maven-gpg-plugin/target/local-repo/org/apache/maven/plugins/maven-clean-plugin/2.6-SNAPSHOT/maven-clean-plugin-2.6-SNAPSHOT.jar>
[INFO] Installing <https://builds.apache.org/job/maven-plugins-ITs-m2/ws/maven-dependency-plugin/pom.xml>
to <https://builds.apache.org/job/maven-plugins-ITs-m2/ws/maven-gpg-plugin/target/local-repo/org/apache/maven/plugins/maven-dependency-plugin/2.9-SNAPSHOT/maven-dependency-plugin-2.9-SNAPSHOT.pom>
[INFO] ------------------------------------------------------------------------
[INFO] Building Apache Maven Plugins Aggregator
[INFO]    task-segment: [clean, install]
[INFO] ------------------------------------------------------------------------
[INFO] [clean:clean {execution: default-clean}]
[INFO] Deleting <https://builds.apache.org/job/maven-plugins-ITs-m2/ws/target>
[INFO] [enforcer:enforce {execution: enforce-bytecode-version}]
[INFO] [enforcer:enforce {execution: ban-known-bad-maven-versions}]
[INFO] [remote-resources:process {execution: default}]
[INFO] [site:attach-descriptor {execution: default-attach-descriptor}]
[INFO] [install:install {execution: default-install}]
[INFO] Installing <https://builds.apache.org/job/maven-plugins-ITs-m2/ws/pom.xml> to
/home/jenkins/.m2/repository/org/apache/maven/plugins/maven-plugins-aggregator/1-SNAPSHOT/maven-plugins-aggregator-1-SNAPSHOT.pom
[INFO] 
[INFO] 
[INFO] ------------------------------------------------------------------------
[INFO] Reactor Summary:
[INFO] ------------------------------------------------------------------------
[INFO] Apache Maven Plugins .................................. SUCCESS [6.109s]
[INFO] Apache Maven ACR Plugin ............................... SUCCESS [20.710s]
[INFO] Apache Maven Ant Plugin ............................... SUCCESS [1:10.852s]
[INFO] Apache Maven AntRun Plugin ............................ SUCCESS [45.616s]
[INFO] Apache Maven Eclipse Plugin ........................... SUCCESS [6:42.381s]
[INFO] Apache Maven Assembly Plugin .......................... SUCCESS [10:13.061s]
[INFO] Apache Maven Changelog Plugin ......................... SUCCESS [47.561s]
[INFO] Apache Maven Compiler Plugin .......................... SUCCESS [1:34.776s]
[INFO] Apache Maven Changes Plugin ........................... SUCCESS [1:16.018s]
[INFO] Apache Maven Checkstyle Plugin ........................ SUCCESS [3:23.696s]
[INFO] Apache Maven Clean Plugin ............................. SUCCESS [12.612s]
[INFO] Apache Maven Dependency Plugin ........................ FAILED [43.847s]
[INFO] Apache Maven Deploy Plugin ............................ FAILED [2.894s]
[INFO] Apache Maven DOAP Plugin .............................. FAILED [6.207s]
[INFO] Apache Maven Documentation Checker Plugin ............. FAILED [1.023s]
[INFO] Apache Maven EAR Plugin ............................... FAILED [3.281s]
[INFO] Apache Maven EJB Plugin ............................... FAILED [3.417s]
[INFO] Apache Maven Help Plugin .............................. FAILED [2.698s]
[INFO] Apache Maven Install Plugin ........................... FAILED [2.471s]
[INFO] Apache Maven JAR Plugin ............................... FAILED [2.011s]
[INFO] Apache Maven Jarsigner Plugin ......................... FAILED [1.527s]
[INFO] Apache Maven Javadoc Plugin ........................... FAILED [1:18.451s]
[INFO] Apache Maven Linkcheck Plugin ......................... FAILED [2.439s]
[INFO] Apache Maven Patch Plugin ............................. FAILED [0.451s]
[INFO] Apache Maven PDF Plugin ............................... FAILED [12.204s]
[INFO] Apache Maven RAR Plugin ............................... FAILED [2.172s]
[INFO] Apache Maven Repository Plugin ........................ FAILED [3.116s]
[INFO] Apache Maven Resources Plugin ......................... SKIPPED (dependency build failed
or was skipped)
[INFO] Apache Maven Site Plugin .............................. FAILED [11.207s]
[INFO] Apache Maven Source Plugin ............................ FAILED [3.302s]
[INFO] Apache Maven Stage Plugin ............................. FAILED [1.097s]
[INFO] Apache Maven Toolchains Plugin ........................ FAILED [0.911s]
[INFO] Apache Maven Verifier Plugin .......................... FAILED [0.887s]
[INFO] Apache Maven WAR Plugin ............................... FAILED [7.586s]
[INFO] Apache Maven PMD Plugin ............................... FAILED [22.933s]
[INFO] Apache Maven GPG Plugin ............................... FAILED [0.785s]
[INFO] Apache Maven Plugins Aggregator ....................... SUCCESS [0.033s]
[INFO] ------------------------------------------------------------------------
[INFO] Error for project: Apache Maven Dependency Plugin (during install)
[INFO] ------------------------------------------------------------------------
[INFO] There are test failures.

Please refer to <https://builds.apache.org/job/maven-plugins-ITs-m2/ws/maven-dependency-plugin/target/surefire-reports>
for the individual test results.
[INFO] ------------------------------------------------------------------------
[INFO] Error for project: Apache Maven Deploy Plugin (during install)
[INFO] ------------------------------------------------------------------------
[INFO] Failed to install project dependencies: MavenProject: org.apache.maven.plugins:maven-deploy-plugin:2.9-SNAPSHOT
@ <https://builds.apache.org/job/maven-plugins-ITs-m2/ws/maven-deploy-plugin/pom.xml>

Embedded error: Failed to install project artifacts: MavenProject: org.apache.maven.plugins:maven-dependency-plugin:2.9-SNAPSHOT
@ <https://builds.apache.org/job/maven-plugins-ITs-m2/ws/maven-dependency-plugin/pom.xml>
Artifact is not fully assembled: <https://builds.apache.org/job/maven-plugins-ITs-m2/ws/maven-dependency-plugin/target/classes>
[INFO] ------------------------------------------------------------------------
[INFO] Error for project: Apache Maven DOAP Plugin (during install)
[INFO] ------------------------------------------------------------------------
[INFO] Failed to install project dependencies: MavenProject: org.apache.maven.plugins:maven-doap-plugin:1.2-SNAPSHOT
@ <https://builds.apache.org/job/maven-plugins-ITs-m2/ws/maven-doap-plugin/pom.xml>

Embedded error: Failed to install project artifacts: MavenProject: org.apache.maven.plugins:maven-dependency-plugin:2.9-SNAPSHOT
@ <https://builds.apache.org/job/maven-plugins-ITs-m2/ws/maven-dependency-plugin/pom.xml>
Artifact is not fully assembled: <https://builds.apache.org/job/maven-plugins-ITs-m2/ws/maven-dependency-plugin/target/classes>
[INFO] ------------------------------------------------------------------------
[INFO] Error for project: Apache Maven Documentation Checker Plugin (during install)
[INFO] ------------------------------------------------------------------------
[INFO] Failed to install project dependencies: MavenProject: org.apache.maven.plugins:maven-docck-plugin:1.1-SNAPSHOT
@ <https://builds.apache.org/job/maven-plugins-ITs-m2/ws/maven-docck-plugin/pom.xml>

Embedded error: Failed to install project artifacts: MavenProject: org.apache.maven.plugins:maven-dependency-plugin:2.9-SNAPSHOT
@ <https://builds.apache.org/job/maven-plugins-ITs-m2/ws/maven-dependency-plugin/pom.xml>
Artifact is not fully assembled: <https://builds.apache.org/job/maven-plugins-ITs-m2/ws/maven-dependency-plugin/target/classes>
[INFO] ------------------------------------------------------------------------
[INFO] Error for project: Apache Maven EAR Plugin (during install)
[INFO] ------------------------------------------------------------------------
[INFO] Failed to install project dependencies: MavenProject: org.apache.maven.plugins:maven-ear-plugin:2.10-SNAPSHOT
@ <https://builds.apache.org/job/maven-plugins-ITs-m2/ws/maven-ear-plugin/pom.xml>

Embedded error: Failed to install project artifacts: MavenProject: org.apache.maven.plugins:maven-dependency-plugin:2.9-SNAPSHOT
@ <https://builds.apache.org/job/maven-plugins-ITs-m2/ws/maven-dependency-plugin/pom.xml>
Artifact is not fully assembled: <https://builds.apache.org/job/maven-plugins-ITs-m2/ws/maven-dependency-plugin/target/classes>
[INFO] ------------------------------------------------------------------------
[INFO] Error for project: Apache Maven EJB Plugin (during install)
[INFO] ------------------------------------------------------------------------
[INFO] Failed to install project dependencies: MavenProject: org.apache.maven.plugins:maven-ejb-plugin:2.4-SNAPSHOT
@ <https://builds.apache.org/job/maven-plugins-ITs-m2/ws/maven-ejb-plugin/pom.xml>

Embedded error: Failed to install project artifacts: MavenProject: org.apache.maven.plugins:maven-dependency-plugin:2.9-SNAPSHOT
@ <https://builds.apache.org/job/maven-plugins-ITs-m2/ws/maven-dependency-plugin/pom.xml>
Artifact is not fully assembled: <https://builds.apache.org/job/maven-plugins-ITs-m2/ws/maven-dependency-plugin/target/classes>
[INFO] ------------------------------------------------------------------------
[INFO] Error for project: Apache Maven Help Plugin (during install)
[INFO] ------------------------------------------------------------------------
[INFO] Failed to install project dependencies: MavenProject: org.apache.maven.plugins:maven-help-plugin:2.2.1-SNAPSHOT
@ <https://builds.apache.org/job/maven-plugins-ITs-m2/ws/maven-help-plugin/pom.xml>

Embedded error: Failed to install project artifacts: MavenProject: org.apache.maven.plugins:maven-dependency-plugin:2.9-SNAPSHOT
@ <https://builds.apache.org/job/maven-plugins-ITs-m2/ws/maven-dependency-plugin/pom.xml>
Artifact is not fully assembled: <https://builds.apache.org/job/maven-plugins-ITs-m2/ws/maven-dependency-plugin/target/classes>
[INFO] ------------------------------------------------------------------------
[INFO] Error for project: Apache Maven Install Plugin (during install)
[INFO] ------------------------------------------------------------------------
[INFO] Failed to install project dependencies: MavenProject: org.apache.maven.plugins:maven-install-plugin:2.6-SNAPSHOT
@ <https://builds.apache.org/job/maven-plugins-ITs-m2/ws/maven-install-plugin/pom.xml>

Embedded error: Failed to install project artifacts: MavenProject: org.apache.maven.plugins:maven-dependency-plugin:2.9-SNAPSHOT
@ <https://builds.apache.org/job/maven-plugins-ITs-m2/ws/maven-dependency-plugin/pom.xml>
Artifact is not fully assembled: <https://builds.apache.org/job/maven-plugins-ITs-m2/ws/maven-dependency-plugin/target/classes>
[INFO] ------------------------------------------------------------------------
[INFO] Error for project: Apache Maven JAR Plugin (during install)
[INFO] ------------------------------------------------------------------------
[INFO] Failed to install project dependencies: MavenProject: org.apache.maven.plugins:maven-jar-plugin:2.6-SNAPSHOT
@ <https://builds.apache.org/job/maven-plugins-ITs-m2/ws/maven-jar-plugin/pom.xml>

Embedded error: Failed to install project artifacts: MavenProject: org.apache.maven.plugins:maven-dependency-plugin:2.9-SNAPSHOT
@ <https://builds.apache.org/job/maven-plugins-ITs-m2/ws/maven-dependency-plugin/pom.xml>
Artifact is not fully assembled: <https://builds.apache.org/job/maven-plugins-ITs-m2/ws/maven-dependency-plugin/target/classes>
[INFO] ------------------------------------------------------------------------
[INFO] Error for project: Apache Maven Jarsigner Plugin (during install)
[INFO] ------------------------------------------------------------------------
[INFO] Failed to install project dependencies: MavenProject: org.apache.maven.plugins:maven-jarsigner-plugin:1.4-SNAPSHOT
@ <https://builds.apache.org/job/maven-plugins-ITs-m2/ws/maven-jarsigner-plugin/pom.xml>

Embedded error: Failed to install project artifacts: MavenProject: org.apache.maven.plugins:maven-dependency-plugin:2.9-SNAPSHOT
@ <https://builds.apache.org/job/maven-plugins-ITs-m2/ws/maven-dependency-plugin/pom.xml>
Artifact is not fully assembled: <https://builds.apache.org/job/maven-plugins-ITs-m2/ws/maven-dependency-plugin/target/classes>
[INFO] ------------------------------------------------------------------------
[INFO] Error for project: Apache Maven Javadoc Plugin (during install)
[INFO] ------------------------------------------------------------------------
[INFO] Failed to install project dependencies: MavenProject: org.apache.maven.plugins:maven-javadoc-plugin:2.9.2-SNAPSHOT
@ <https://builds.apache.org/job/maven-plugins-ITs-m2/ws/maven-javadoc-plugin/pom.xml>

Embedded error: Failed to install project artifacts: MavenProject: org.apache.maven.plugins:maven-dependency-plugin:2.9-SNAPSHOT
@ <https://builds.apache.org/job/maven-plugins-ITs-m2/ws/maven-dependency-plugin/pom.xml>
Artifact is not fully assembled: <https://builds.apache.org/job/maven-plugins-ITs-m2/ws/maven-dependency-plugin/target/classes>
[INFO] ------------------------------------------------------------------------
[INFO] Error for project: Apache Maven Linkcheck Plugin (during install)
[INFO] ------------------------------------------------------------------------
[INFO] Failed to install project dependencies: MavenProject: org.apache.maven.plugins:maven-linkcheck-plugin:1.2-SNAPSHOT
@ <https://builds.apache.org/job/maven-plugins-ITs-m2/ws/maven-linkcheck-plugin/pom.xml>

Embedded error: Failed to install project artifacts: MavenProject: org.apache.maven.plugins:maven-dependency-plugin:2.9-SNAPSHOT
@ <https://builds.apache.org/job/maven-plugins-ITs-m2/ws/maven-dependency-plugin/pom.xml>
Artifact is not fully assembled: <https://builds.apache.org/job/maven-plugins-ITs-m2/ws/maven-dependency-plugin/target/classes>
[INFO] ------------------------------------------------------------------------
[INFO] Error for project: Apache Maven Patch Plugin (during install)
[INFO] ------------------------------------------------------------------------
[INFO] Failed to install project dependencies: MavenProject: org.apache.maven.plugins:maven-patch-plugin:1.2-SNAPSHOT
@ <https://builds.apache.org/job/maven-plugins-ITs-m2/ws/maven-patch-plugin/pom.xml>

Embedded error: Failed to install project artifacts: MavenProject: org.apache.maven.plugins:maven-dependency-plugin:2.9-SNAPSHOT
@ <https://builds.apache.org/job/maven-plugins-ITs-m2/ws/maven-dependency-plugin/pom.xml>
Artifact is not fully assembled: <https://builds.apache.org/job/maven-plugins-ITs-m2/ws/maven-dependency-plugin/target/classes>
[INFO] ------------------------------------------------------------------------
[INFO] Error for project: Apache Maven PDF Plugin (during install)
[INFO] ------------------------------------------------------------------------
[INFO] Failed to install project dependencies: MavenProject: org.apache.maven.plugins:maven-pdf-plugin:1.3-SNAPSHOT
@ <https://builds.apache.org/job/maven-plugins-ITs-m2/ws/maven-pdf-plugin/pom.xml>

Embedded error: Failed to install project artifacts: MavenProject: org.apache.maven.plugins:maven-dependency-plugin:2.9-SNAPSHOT
@ <https://builds.apache.org/job/maven-plugins-ITs-m2/ws/maven-dependency-plugin/pom.xml>
Artifact is not fully assembled: <https://builds.apache.org/job/maven-plugins-ITs-m2/ws/maven-dependency-plugin/target/classes>
[INFO] ------------------------------------------------------------------------
[INFO] Error for project: Apache Maven RAR Plugin (during install)
[INFO] ------------------------------------------------------------------------
[INFO] Failed to install project dependencies: MavenProject: org.apache.maven.plugins:maven-rar-plugin:2.4-SNAPSHOT
@ <https://builds.apache.org/job/maven-plugins-ITs-m2/ws/maven-rar-plugin/pom.xml>

Embedded error: Failed to install project artifacts: MavenProject: org.apache.maven.plugins:maven-dependency-plugin:2.9-SNAPSHOT
@ <https://builds.apache.org/job/maven-plugins-ITs-m2/ws/maven-dependency-plugin/pom.xml>
Artifact is not fully assembled: <https://builds.apache.org/job/maven-plugins-ITs-m2/ws/maven-dependency-plugin/target/classes>
[INFO] ------------------------------------------------------------------------
[INFO] Error for project: Apache Maven Repository Plugin (during install)
[INFO] ------------------------------------------------------------------------
[INFO] Failed to install project dependencies: MavenProject: org.apache.maven.plugins:maven-repository-plugin:2.3.2-SNAPSHOT
@ <https://builds.apache.org/job/maven-plugins-ITs-m2/ws/maven-repository-plugin/pom.xml>

Embedded error: Failed to install project artifacts: MavenProject: org.apache.maven.plugins:maven-dependency-plugin:2.9-SNAPSHOT
@ <https://builds.apache.org/job/maven-plugins-ITs-m2/ws/maven-dependency-plugin/pom.xml>
Artifact is not fully assembled: <https://builds.apache.org/job/maven-plugins-ITs-m2/ws/maven-dependency-plugin/target/classes>
[INFO] ------------------------------------------------------------------------
[INFO] Error for project: Apache Maven Site Plugin (during install)
[INFO] ------------------------------------------------------------------------
[INFO] Failed to install project dependencies: MavenProject: org.apache.maven.plugins:maven-site-plugin:3.4.1-SNAPSHOT
@ <https://builds.apache.org/job/maven-plugins-ITs-m2/ws/maven-site-plugin/dependency-reduced-pom.xml>

Embedded error: Failed to install project artifacts: MavenProject: org.apache.maven.plugins:maven-dependency-plugin:2.9-SNAPSHOT
@ <https://builds.apache.org/job/maven-plugins-ITs-m2/ws/maven-dependency-plugin/pom.xml>
Artifact is not fully assembled: <https://builds.apache.org/job/maven-plugins-ITs-m2/ws/maven-dependency-plugin/target/classes>
[INFO] ------------------------------------------------------------------------
[INFO] Error for project: Apache Maven Source Plugin (during install)
[INFO] ------------------------------------------------------------------------
[INFO] Failed to install project dependencies: MavenProject: org.apache.maven.plugins:maven-source-plugin:2.4-SNAPSHOT
@ <https://builds.apache.org/job/maven-plugins-ITs-m2/ws/maven-source-plugin/pom.xml>

Embedded error: Failed to install project artifacts: MavenProject: org.apache.maven.plugins:maven-dependency-plugin:2.9-SNAPSHOT
@ <https://builds.apache.org/job/maven-plugins-ITs-m2/ws/maven-dependency-plugin/pom.xml>
Artifact is not fully assembled: <https://builds.apache.org/job/maven-plugins-ITs-m2/ws/maven-dependency-plugin/target/classes>
[INFO] ------------------------------------------------------------------------
[INFO] Error for project: Apache Maven Stage Plugin (during install)
[INFO] ------------------------------------------------------------------------
[INFO] Failed to install project dependencies: MavenProject: org.apache.maven.plugins:maven-stage-plugin:1.0-SNAPSHOT
@ <https://builds.apache.org/job/maven-plugins-ITs-m2/ws/maven-stage-plugin/pom.xml>

Embedded error: Failed to install project artifacts: MavenProject: org.apache.maven.plugins:maven-dependency-plugin:2.9-SNAPSHOT
@ <https://builds.apache.org/job/maven-plugins-ITs-m2/ws/maven-dependency-plugin/pom.xml>
Artifact is not fully assembled: <https://builds.apache.org/job/maven-plugins-ITs-m2/ws/maven-dependency-plugin/target/classes>
[INFO] ------------------------------------------------------------------------
[INFO] Error for project: Apache Maven Toolchains Plugin (during install)
[INFO] ------------------------------------------------------------------------
[INFO] Failed to install project dependencies: MavenProject: org.apache.maven.plugins:maven-toolchains-plugin:1.1-SNAPSHOT
@ <https://builds.apache.org/job/maven-plugins-ITs-m2/ws/maven-toolchains-plugin/pom.xml>

Embedded error: Failed to install project artifacts: MavenProject: org.apache.maven.plugins:maven-dependency-plugin:2.9-SNAPSHOT
@ <https://builds.apache.org/job/maven-plugins-ITs-m2/ws/maven-dependency-plugin/pom.xml>
Artifact is not fully assembled: <https://builds.apache.org/job/maven-plugins-ITs-m2/ws/maven-dependency-plugin/target/classes>
[INFO] ------------------------------------------------------------------------
[INFO] Error for project: Apache Maven Verifier Plugin (during install)
[INFO] ------------------------------------------------------------------------
[INFO] Failed to install project dependencies: MavenProject: org.apache.maven.plugins:maven-verifier-plugin:1.1-SNAPSHOT
@ <https://builds.apache.org/job/maven-plugins-ITs-m2/ws/maven-verifier-plugin/pom.xml>

Embedded error: Failed to install project artifacts: MavenProject: org.apache.maven.plugins:maven-dependency-plugin:2.9-SNAPSHOT
@ <https://builds.apache.org/job/maven-plugins-ITs-m2/ws/maven-dependency-plugin/pom.xml>
Artifact is not fully assembled: <https://builds.apache.org/job/maven-plugins-ITs-m2/ws/maven-dependency-plugin/target/classes>
[INFO] ------------------------------------------------------------------------
[INFO] Error for project: Apache Maven WAR Plugin (during install)
[INFO] ------------------------------------------------------------------------
[INFO] Failed to install project dependencies: MavenProject: org.apache.maven.plugins:maven-war-plugin:2.5-SNAPSHOT
@ <https://builds.apache.org/job/maven-plugins-ITs-m2/ws/maven-war-plugin/pom.xml>

Embedded error: Failed to install project artifacts: MavenProject: org.apache.maven.plugins:maven-dependency-plugin:2.9-SNAPSHOT
@ <https://builds.apache.org/job/maven-plugins-ITs-m2/ws/maven-dependency-plugin/pom.xml>
Artifact is not fully assembled: <https://builds.apache.org/job/maven-plugins-ITs-m2/ws/maven-dependency-plugin/target/classes>
[INFO] ------------------------------------------------------------------------
[INFO] Error for project: Apache Maven PMD Plugin (during install)
[INFO] ------------------------------------------------------------------------
[INFO] Failed to install project dependencies: MavenProject: org.apache.maven.plugins:maven-pmd-plugin:3.3-SNAPSHOT
@ <https://builds.apache.org/job/maven-plugins-ITs-m2/ws/maven-pmd-plugin/pom.xml>

Embedded error: Failed to install project artifacts: MavenProject: org.apache.maven.plugins:maven-dependency-plugin:2.9-SNAPSHOT
@ <https://builds.apache.org/job/maven-plugins-ITs-m2/ws/maven-dependency-plugin/pom.xml>
Artifact is not fully assembled: <https://builds.apache.org/job/maven-plugins-ITs-m2/ws/maven-dependency-plugin/target/classes>
[INFO] ------------------------------------------------------------------------
[INFO] Error for project: Apache Maven GPG Plugin (during install)
[INFO] ------------------------------------------------------------------------
[INFO] Failed to install project dependencies: MavenProject: org.apache.maven.plugins:maven-gpg-plugin:1.6-SNAPSHOT
@ <https://builds.apache.org/job/maven-plugins-ITs-m2/ws/maven-gpg-plugin/pom.xml>

Embedded error: Failed to install project artifacts: MavenProject: org.apache.maven.plugins:maven-dependency-plugin:2.9-SNAPSHOT
@ <https://builds.apache.org/job/maven-plugins-ITs-m2/ws/maven-dependency-plugin/pom.xml>
Artifact is not fully assembled: <https://builds.apache.org/job/maven-plugins-ITs-m2/ws/maven-dependency-plugin/target/classes>
[INFO] ------------------------------------------------------------------------
[INFO] For more information, run Maven with the -e switch
[INFO] ------------------------------------------------------------------------
[INFO] BUILD ERRORS
[INFO] ------------------------------------------------------------------------
[INFO] Total time: 30 minutes 11 seconds
[INFO] Finished at: Fri Aug 08 19:57:05 UTC 2014
[INFO] Final Memory: 262M/652M
[INFO] ------------------------------------------------------------------------
Build step 'Invoke top-level Maven targets' marked build as failure

Mime
View raw message