maven-notifications mailing list archives

Site index · List index
Message view « Date » · « Thread »
Top « Date » · « Thread »
From Apache Jenkins Server <jenk...@builds.apache.org>
Subject Build failed in Jenkins: dist-tool-plugin #557
Date Mon, 18 Aug 2014 10:34:43 GMT
See <https://builds.apache.org/job/dist-tool-plugin/557/>

------------------------------------------
[...truncated 2996 lines...]
Downloading: http://repo.maven.apache.org/maven2/org/apache/maven/apache-maven/3.0.5/apache-maven-3.0.5.pom
Downloaded: http://repo.maven.apache.org/maven2/org/apache/maven/apache-maven/3.0.5/apache-maven-3.0.5.pom
(6 KB at 100.4 KB/sec)
Downloading: http://repo.maven.apache.org/maven2/org/apache/maven/maven/3.0.5/maven-3.0.5.pom
Downloaded: http://repo.maven.apache.org/maven2/org/apache/maven/maven/3.0.5/maven-3.0.5.pom
(22 KB at 288.0 KB/sec)
Downloading: http://repo.maven.apache.org/maven2/org/apache/maven/apache-maven/3.1.1/apache-maven-3.1.1.pom
Downloaded: http://repo.maven.apache.org/maven2/org/apache/maven/apache-maven/3.1.1/apache-maven-3.1.1.pom
(7 KB at 122.9 KB/sec)
Downloading: http://repo.maven.apache.org/maven2/org/apache/maven/maven/3.1.1/maven-3.1.1.pom
Downloaded: http://repo.maven.apache.org/maven2/org/apache/maven/maven/3.1.1/maven-3.1.1.pom
(22 KB at 283.9 KB/sec)
Downloading: http://repo.maven.apache.org/maven2/org/apache/maven/apache-maven/3.2.3/apache-maven-3.2.3.pom
Downloaded: http://repo.maven.apache.org/maven2/org/apache/maven/apache-maven/3.2.3/apache-maven-3.2.3.pom
(7 KB at 120.7 KB/sec)
Downloading: http://repo.maven.apache.org/maven2/org/apache/maven/maven/3.2.3/maven-3.2.3.pom
Downloaded: http://repo.maven.apache.org/maven2/org/apache/maven/maven/3.2.3/maven-3.2.3.pom
(23 KB at 292.9 KB/sec)
Downloading: http://repo.maven.apache.org/maven2/org/apache/maven/plugin-testing/maven-plugin-testing/3.2.0/maven-plugin-testing-3.2.0.pom
Downloaded: http://repo.maven.apache.org/maven2/org/apache/maven/plugin-testing/maven-plugin-testing/3.2.0/maven-plugin-testing-3.2.0.pom
(11 KB at 192.1 KB/sec)
Downloading: http://repo.maven.apache.org/maven2/org/apache/maven/plugin-tools/maven-plugin-tools/3.3/maven-plugin-tools-3.3.pom
Downloaded: http://repo.maven.apache.org/maven2/org/apache/maven/plugin-tools/maven-plugin-tools/3.3/maven-plugin-tools-3.3.pom
(13 KB at 224.6 KB/sec)
Downloading: http://repo.maven.apache.org/maven2/org/apache/maven/plugins/maven-acr-plugin/1.0/maven-acr-plugin-1.0.pom
Downloaded: http://repo.maven.apache.org/maven2/org/apache/maven/plugins/maven-acr-plugin/1.0/maven-acr-plugin-1.0.pom
(6 KB at 96.4 KB/sec)
Downloading: http://repo.maven.apache.org/maven2/org/apache/maven/plugins/maven-plugins/19/maven-plugins-19.pom
Downloaded: http://repo.maven.apache.org/maven2/org/apache/maven/plugins/maven-plugins/19/maven-plugins-19.pom
(11 KB at 202.8 KB/sec)
Downloading: http://repo.maven.apache.org/maven2/org/apache/maven/plugins/maven-ant-plugin/2.3/maven-ant-plugin-2.3.pom
Downloaded: http://repo.maven.apache.org/maven2/org/apache/maven/plugins/maven-ant-plugin/2.3/maven-ant-plugin-2.3.pom
(6 KB at 109.9 KB/sec)
Downloading: http://repo.maven.apache.org/maven2/org/apache/maven/plugins/maven-plugins/16/maven-plugins-16.pom
Downloaded: http://repo.maven.apache.org/maven2/org/apache/maven/plugins/maven-plugins/16/maven-plugins-16.pom
(13 KB at 234.2 KB/sec)
Downloading: http://repo.maven.apache.org/maven2/org/apache/maven/plugins/maven-assembly-plugin/2.4.1/maven-assembly-plugin-2.4.1.pom
Downloaded: http://repo.maven.apache.org/maven2/org/apache/maven/plugins/maven-assembly-plugin/2.4.1/maven-assembly-plugin-2.4.1.pom
(17 KB at 297.6 KB/sec)
Downloading: http://repo.maven.apache.org/maven2/org/apache/maven/plugins/maven-changelog-plugin/2.3/maven-changelog-plugin-2.3.pom
Downloaded: http://repo.maven.apache.org/maven2/org/apache/maven/plugins/maven-changelog-plugin/2.3/maven-changelog-plugin-2.3.pom
(14 KB at 241.0 KB/sec)
Downloading: http://repo.maven.apache.org/maven2/org/apache/maven/plugins/maven-changes-plugin/2.10/maven-changes-plugin-2.10.pom
Downloaded: http://repo.maven.apache.org/maven2/org/apache/maven/plugins/maven-changes-plugin/2.10/maven-changes-plugin-2.10.pom
(20 KB at 357.3 KB/sec)
Downloading: http://repo.maven.apache.org/maven2/org/apache/maven/plugins/maven-checkstyle-plugin/2.12.1/maven-checkstyle-plugin-2.12.1.pom
Downloaded: http://repo.maven.apache.org/maven2/org/apache/maven/plugins/maven-checkstyle-plugin/2.12.1/maven-checkstyle-plugin-2.12.1.pom
(13 KB at 230.4 KB/sec)
Downloading: http://repo.maven.apache.org/maven2/org/apache/maven/plugins/maven-doap-plugin/1.1/maven-doap-plugin-1.1.pom
Downloaded: http://repo.maven.apache.org/maven2/org/apache/maven/plugins/maven-doap-plugin/1.1/maven-doap-plugin-1.1.pom
(9 KB at 168.0 KB/sec)
Downloading: http://repo.maven.apache.org/maven2/org/apache/maven/plugins/maven-plugins/18/maven-plugins-18.pom
Downloaded: http://repo.maven.apache.org/maven2/org/apache/maven/plugins/maven-plugins/18/maven-plugins-18.pom
(13 KB at 244.2 KB/sec)
Downloading: http://repo.maven.apache.org/maven2/org/apache/maven/plugins/maven-ear-plugin/2.9.1/maven-ear-plugin-2.9.1.pom
Downloaded: http://repo.maven.apache.org/maven2/org/apache/maven/plugins/maven-ear-plugin/2.9.1/maven-ear-plugin-2.9.1.pom
(11 KB at 184.6 KB/sec)
Downloading: http://repo.maven.apache.org/maven2/org/apache/maven/plugins/maven-eclipse-plugin/2.9/maven-eclipse-plugin-2.9.pom
Downloaded: http://repo.maven.apache.org/maven2/org/apache/maven/plugins/maven-eclipse-plugin/2.9/maven-eclipse-plugin-2.9.pom
(15 KB at 268.0 KB/sec)
Downloading: http://repo.maven.apache.org/maven2/org/apache/maven/plugins/maven-ejb-plugin/2.3/maven-ejb-plugin-2.3.pom
Downloaded: http://repo.maven.apache.org/maven2/org/apache/maven/plugins/maven-ejb-plugin/2.3/maven-ejb-plugin-2.3.pom
(6 KB at 93.6 KB/sec)
Downloading: http://repo.maven.apache.org/maven2/org/apache/maven/plugins/maven-gpg-plugin/1.5/maven-gpg-plugin-1.5.pom
Downloaded: http://repo.maven.apache.org/maven2/org/apache/maven/plugins/maven-gpg-plugin/1.5/maven-gpg-plugin-1.5.pom
(7 KB at 119.4 KB/sec)
Downloading: http://repo.maven.apache.org/maven2/org/apache/maven/plugins/maven-help-plugin/2.2/maven-help-plugin-2.2.pom
Downloaded: http://repo.maven.apache.org/maven2/org/apache/maven/plugins/maven-help-plugin/2.2/maven-help-plugin-2.2.pom
(9 KB at 154.8 KB/sec)
Downloading: http://repo.maven.apache.org/maven2/org/apache/maven/plugins/maven-idea-plugin/2.2.1/maven-idea-plugin-2.2.1.pom
Downloaded: http://repo.maven.apache.org/maven2/org/apache/maven/plugins/maven-idea-plugin/2.2.1/maven-idea-plugin-2.2.1.pom
(7 KB at 116.4 KB/sec)
Downloading: http://repo.maven.apache.org/maven2/org/apache/maven/plugins/maven-invoker-plugin/1.9/maven-invoker-plugin-1.9.pom
Downloaded: http://repo.maven.apache.org/maven2/org/apache/maven/plugins/maven-invoker-plugin/1.9/maven-invoker-plugin-1.9.pom
(11 KB at 193.5 KB/sec)
Downloading: http://repo.maven.apache.org/maven2/org/apache/maven/plugins/maven-jar-plugin/2.5/maven-jar-plugin-2.5.pom
Downloaded: http://repo.maven.apache.org/maven2/org/apache/maven/plugins/maven-jar-plugin/2.5/maven-jar-plugin-2.5.pom
(8 KB at 130.9 KB/sec)
Downloading: http://repo.maven.apache.org/maven2/org/apache/maven/plugins/maven-jarsigner-plugin/1.3.2/maven-jarsigner-plugin-1.3.2.pom
Downloaded: http://repo.maven.apache.org/maven2/org/apache/maven/plugins/maven-jarsigner-plugin/1.3.2/maven-jarsigner-plugin-1.3.2.pom
(8 KB at 148.7 KB/sec)
Downloading: http://repo.maven.apache.org/maven2/org/apache/maven/plugins/maven-linkcheck-plugin/1.1/maven-linkcheck-plugin-1.1.pom
Downloaded: http://repo.maven.apache.org/maven2/org/apache/maven/plugins/maven-linkcheck-plugin/1.1/maven-linkcheck-plugin-1.1.pom
(7 KB at 123.7 KB/sec)
Downloading: http://repo.maven.apache.org/maven2/org/apache/maven/plugins/maven-one-plugin/1.3/maven-one-plugin-1.3.pom
Downloaded: http://repo.maven.apache.org/maven2/org/apache/maven/plugins/maven-one-plugin/1.3/maven-one-plugin-1.3.pom
(6 KB at 96.2 KB/sec)
Downloading: http://repo.maven.apache.org/maven2/org/apache/maven/plugins/maven-patch-plugin/1.1.1/maven-patch-plugin-1.1.1.pom
Downloaded: http://repo.maven.apache.org/maven2/org/apache/maven/plugins/maven-patch-plugin/1.1.1/maven-patch-plugin-1.1.1.pom
(4 KB at 72.5 KB/sec)
Downloading: http://repo.maven.apache.org/maven2/org/apache/maven/plugins/maven-pdf-plugin/1.2/maven-pdf-plugin-1.2.pom
Downloaded: http://repo.maven.apache.org/maven2/org/apache/maven/plugins/maven-pdf-plugin/1.2/maven-pdf-plugin-1.2.pom
(17 KB at 317.5 KB/sec)
Downloading: http://repo.maven.apache.org/maven2/org/apache/maven/plugins/maven-pmd-plugin/3.2/maven-pmd-plugin-3.2.pom
Downloaded: http://repo.maven.apache.org/maven2/org/apache/maven/plugins/maven-pmd-plugin/3.2/maven-pmd-plugin-3.2.pom
(12 KB at 200.0 KB/sec)
Downloading: http://repo.maven.apache.org/maven2/org/apache/maven/plugins/maven-rar-plugin/2.3/maven-rar-plugin-2.3.pom
Downloaded: http://repo.maven.apache.org/maven2/org/apache/maven/plugins/maven-rar-plugin/2.3/maven-rar-plugin-2.3.pom
(6 KB at 107.3 KB/sec)
Downloading: http://repo.maven.apache.org/maven2/org/apache/maven/plugins/maven-repository-plugin/2.3.1/maven-repository-plugin-2.3.1.pom
Downloaded: http://repo.maven.apache.org/maven2/org/apache/maven/plugins/maven-repository-plugin/2.3.1/maven-repository-plugin-2.3.1.pom
(9 KB at 165.5 KB/sec)
Downloading: http://repo.maven.apache.org/maven2/org/apache/maven/plugins/maven-scm-publish-plugin/1.1/maven-scm-publish-plugin-1.1.pom
Downloaded: http://repo.maven.apache.org/maven2/org/apache/maven/plugins/maven-scm-publish-plugin/1.1/maven-scm-publish-plugin-1.1.pom
(7 KB at 110.5 KB/sec)
Downloading: http://repo.maven.apache.org/maven2/org/apache/maven/plugins/maven-shade-plugin/2.3/maven-shade-plugin-2.3.pom
Downloaded: http://repo.maven.apache.org/maven2/org/apache/maven/plugins/maven-shade-plugin/2.3/maven-shade-plugin-2.3.pom
(8 KB at 130.3 KB/sec)
Downloading: http://repo.maven.apache.org/maven2/org/apache/maven/plugins/maven-source-plugin/2.3/maven-source-plugin-2.3.pom
Downloaded: http://repo.maven.apache.org/maven2/org/apache/maven/plugins/maven-source-plugin/2.3/maven-source-plugin-2.3.pom
(7 KB at 122.4 KB/sec)
Downloading: http://repo.maven.apache.org/maven2/org/apache/maven/plugins/maven-stage-plugin/1.0-alpha-2/maven-stage-plugin-1.0-alpha-2.pom
Downloaded: http://repo.maven.apache.org/maven2/org/apache/maven/plugins/maven-stage-plugin/1.0-alpha-2/maven-stage-plugin-1.0-alpha-2.pom
(8 KB at 139.9 KB/sec)
Downloading: http://repo.maven.apache.org/maven2/org/apache/maven/plugins/maven-plugins/13/maven-plugins-13.pom
Downloaded: http://repo.maven.apache.org/maven2/org/apache/maven/plugins/maven-plugins/13/maven-plugins-13.pom
(12 KB at 217.1 KB/sec)
Downloading: http://repo.maven.apache.org/maven2/org/apache/maven/plugins/maven-toolchains-plugin/1.0/maven-toolchains-plugin-1.0.pom
Downloaded: http://repo.maven.apache.org/maven2/org/apache/maven/plugins/maven-toolchains-plugin/1.0/maven-toolchains-plugin-1.0.pom
(4 KB at 65.1 KB/sec)
Downloading: http://repo.maven.apache.org/maven2/org/apache/maven/plugins/maven-plugins/14/maven-plugins-14.pom
Downloaded: http://repo.maven.apache.org/maven2/org/apache/maven/plugins/maven-plugins/14/maven-plugins-14.pom
(13 KB at 226.7 KB/sec)
Downloading: http://repo.maven.apache.org/maven2/org/apache/maven/plugins/maven-verifier-plugin/1.0/maven-verifier-plugin-1.0.pom
Downloaded: http://repo.maven.apache.org/maven2/org/apache/maven/plugins/maven-verifier-plugin/1.0/maven-verifier-plugin-1.0.pom
(5 KB at 74.5 KB/sec)
Downloading: http://repo.maven.apache.org/maven2/org/apache/maven/plugins/maven-war-plugin/2.4/maven-war-plugin-2.4.pom
Downloaded: http://repo.maven.apache.org/maven2/org/apache/maven/plugins/maven-war-plugin/2.4/maven-war-plugin-2.4.pom
(10 KB at 163.8 KB/sec)
Downloading: http://repo.maven.apache.org/maven2/org/apache/apache/resources/apache-resource-bundles/4/apache-resource-bundles-4.pom
Downloaded: http://repo.maven.apache.org/maven2/org/apache/apache/resources/apache-resource-bundles/4/apache-resource-bundles-4.pom
(3 KB at 48.1 KB/sec)
Downloading: http://repo.maven.apache.org/maven2/org/apache/apache/resources/apache-source-release-assembly-descriptor/1.0.4/apache-source-release-assembly-descriptor-1.0.4.pom
Downloaded: http://repo.maven.apache.org/maven2/org/apache/apache/resources/apache-source-release-assembly-descriptor/1.0.4/apache-source-release-assembly-descriptor-1.0.4.pom
(8 KB at 134.6 KB/sec)
Downloading: http://repo.maven.apache.org/maven2/org/apache/apache-incubator-disclaimer-resource-bundle/1.1/apache-incubator-disclaimer-resource-bundle-1.1.pom
[WARNING] Checksum validation failed, expected da39a3ee5e6b4b0d3255bfef95601890afd80709 but
is 6e0b74ff3d2da9bfe1126608f7e937537e628a5f for http://repo.maven.apache.org/maven2/org/apache/apache-incubator-disclaimer-resource-bundle/1.1/apache-incubator-disclaimer-resource-bundle-1.1.pom
[WARNING] Checksum validation failed, expected da39a3ee5e6b4b0d3255bfef95601890afd80709 but
is 6e0b74ff3d2da9bfe1126608f7e937537e628a5f for http://repo.maven.apache.org/maven2/org/apache/apache-incubator-disclaimer-resource-bundle/1.1/apache-incubator-disclaimer-resource-bundle-1.1.pom
Downloaded: http://repo.maven.apache.org/maven2/org/apache/apache-incubator-disclaimer-resource-bundle/1.1/apache-incubator-disclaimer-resource-bundle-1.1.pom
(722 B at 3.9 KB/sec)
Downloading: http://repo.maven.apache.org/maven2/org/apache/apache-resource-bundles/2/apache-resource-bundles-2.pom
[WARNING] Checksum validation failed, expected da39a3ee5e6b4b0d3255bfef95601890afd80709 but
is bfadc7db5b215805d531144732c80692de9780e1 for http://repo.maven.apache.org/maven2/org/apache/apache-resource-bundles/2/apache-resource-bundles-2.pom
[WARNING] Checksum validation failed, expected da39a3ee5e6b4b0d3255bfef95601890afd80709 but
is bfadc7db5b215805d531144732c80692de9780e1 for http://repo.maven.apache.org/maven2/org/apache/apache-resource-bundles/2/apache-resource-bundles-2.pom
Downloaded: http://repo.maven.apache.org/maven2/org/apache/apache-resource-bundles/2/apache-resource-bundles-2.pom
(2 KB at 18.5 KB/sec)
Downloading: http://repo.maven.apache.org/maven2/org/apache/apache-jar-resource-bundle/1.4/apache-jar-resource-bundle-1.4.pom
Downloaded: http://repo.maven.apache.org/maven2/org/apache/apache-jar-resource-bundle/1.4/apache-jar-resource-bundle-1.4.pom
(2 KB at 8.6 KB/sec)
Downloading: http://repo.maven.apache.org/maven2/org/apache/apache-license-header-resource-bundle/1.1/apache-license-header-resource-bundle-1.1.pom
[WARNING] Checksum validation failed, expected da39a3ee5e6b4b0d3255bfef95601890afd80709 but
is 923c05b225d7a5a8a614b5fca846b1776e18b98a for http://repo.maven.apache.org/maven2/org/apache/apache-license-header-resource-bundle/1.1/apache-license-header-resource-bundle-1.1.pom
[WARNING] Checksum validation failed, expected da39a3ee5e6b4b0d3255bfef95601890afd80709 but
is 923c05b225d7a5a8a614b5fca846b1776e18b98a for http://repo.maven.apache.org/maven2/org/apache/apache-license-header-resource-bundle/1.1/apache-license-header-resource-bundle-1.1.pom
Downloaded: http://repo.maven.apache.org/maven2/org/apache/apache-license-header-resource-bundle/1.1/apache-license-header-resource-bundle-1.1.pom
(694 B at 3.7 KB/sec)
Downloading: http://repo.maven.apache.org/maven2/org/apache/maven/scm/maven-scm/1.9.1/maven-scm-1.9.1.pom
Downloaded: http://repo.maven.apache.org/maven2/org/apache/maven/scm/maven-scm/1.9.1/maven-scm-1.9.1.pom
(22 KB at 412.1 KB/sec)
Downloading: http://repo.maven.apache.org/maven2/org/apache/maven/shared/maven-filtering/1.2/maven-filtering-1.2.pom
Downloaded: http://repo.maven.apache.org/maven2/org/apache/maven/shared/maven-filtering/1.2/maven-filtering-1.2.pom
(7 KB at 117.7 KB/sec)
Downloading: http://repo.maven.apache.org/maven2/org/apache/maven/shared/maven-invoker/2.1.1/maven-invoker-2.1.1.pom
Downloaded: http://repo.maven.apache.org/maven2/org/apache/maven/shared/maven-invoker/2.1.1/maven-invoker-2.1.1.pom
(6 KB at 102.5 KB/sec)
Downloading: http://repo.maven.apache.org/maven2/org/apache/maven/shared/maven-jarsigner/1.3.2/maven-jarsigner-1.3.2.pom
Downloaded: http://repo.maven.apache.org/maven2/org/apache/maven/shared/maven-jarsigner/1.3.2/maven-jarsigner-1.3.2.pom
(6 KB at 95.6 KB/sec)
Downloading: http://repo.maven.apache.org/maven2/org/apache/maven/shared/maven-mapping/1.0/maven-mapping-1.0.pom
Downloaded: http://repo.maven.apache.org/maven2/org/apache/maven/shared/maven-mapping/1.0/maven-mapping-1.0.pom
(5 KB at 80.6 KB/sec)
Downloading: http://repo.maven.apache.org/maven2/org/apache/maven/shared/maven-model-converter/2.3/maven-model-converter-2.3.pom
Downloaded: http://repo.maven.apache.org/maven2/org/apache/maven/shared/maven-model-converter/2.3/maven-model-converter-2.3.pom
(5 KB at 47.9 KB/sec)
Downloading: http://repo.maven.apache.org/maven2/org/apache/maven/shared/maven-repository-builder/1.0-alpha-2/maven-repository-builder-1.0-alpha-2.pom
Downloaded: http://repo.maven.apache.org/maven2/org/apache/maven/shared/maven-repository-builder/1.0-alpha-2/maven-repository-builder-1.0-alpha-2.pom
(4 KB at 58.4 KB/sec)
Downloading: http://repo.maven.apache.org/maven2/org/apache/maven/shared/maven-runtime/1.0-alpha-3/maven-runtime-1.0-alpha-3.pom
Downloaded: http://repo.maven.apache.org/maven2/org/apache/maven/shared/maven-runtime/1.0-alpha-3/maven-runtime-1.0-alpha-3.pom
(6 KB at 98.6 KB/sec)
Downloading: http://repo.maven.apache.org/maven2/org/apache/maven/shared/maven-script-interpreter/1.1/maven-script-interpreter-1.1.pom
Downloaded: http://repo.maven.apache.org/maven2/org/apache/maven/shared/maven-script-interpreter/1.1/maven-script-interpreter-1.1.pom
(4 KB at 65.9 KB/sec)
Downloading: http://repo.maven.apache.org/maven2/org/apache/maven/shared/maven-shared-resources/1/maven-shared-resources-1.pom
Downloaded: http://repo.maven.apache.org/maven2/org/apache/maven/shared/maven-shared-resources/1/maven-shared-resources-1.pom
(3 KB at 39.5 KB/sec)
Downloading: http://repo.maven.apache.org/maven2/org/apache/maven/shared/maven-shared-utils/0.6/maven-shared-utils-0.6.pom
Downloaded: http://repo.maven.apache.org/maven2/org/apache/maven/shared/maven-shared-utils/0.6/maven-shared-utils-0.6.pom
(5 KB at 82.1 KB/sec)
Downloading: http://repo.maven.apache.org/maven2/org/apache/maven/shared/maven-verifier/1.5/maven-verifier-1.5.pom
Downloaded: http://repo.maven.apache.org/maven2/org/apache/maven/shared/maven-verifier/1.5/maven-verifier-1.5.pom
(4 KB at 59.2 KB/sec)
Downloading: http://repo.maven.apache.org/maven2/org/apache/maven/skins/maven-skins/9/maven-skins-9.pom
Downloaded: http://repo.maven.apache.org/maven2/org/apache/maven/skins/maven-skins/9/maven-skins-9.pom
(4 KB at 57.3 KB/sec)
Downloading: http://repo.maven.apache.org/maven2/org/apache/maven/skins/maven-application-skin/1.0/maven-application-skin-1.0.pom
Downloaded: http://repo.maven.apache.org/maven2/org/apache/maven/skins/maven-application-skin/1.0/maven-application-skin-1.0.pom
(5 KB at 88.1 KB/sec)
Downloading: http://repo.maven.apache.org/maven2/org/apache/maven/skins/maven-skins/6/maven-skins-6.pom
Downloaded: http://repo.maven.apache.org/maven2/org/apache/maven/skins/maven-skins/6/maven-skins-6.pom
(4 KB at 57.7 KB/sec)
Downloading: http://repo.maven.apache.org/maven2/org/apache/maven/skins/maven-classic-skin/1.1/maven-classic-skin-1.1.pom
Downloaded: http://repo.maven.apache.org/maven2/org/apache/maven/skins/maven-classic-skin/1.1/maven-classic-skin-1.1.pom
(5 KB at 36.0 KB/sec)
Downloading: http://repo.maven.apache.org/maven2/org/apache/maven/skins/maven-default-skin/1.1/maven-default-skin-1.1.pom
Downloaded: http://repo.maven.apache.org/maven2/org/apache/maven/skins/maven-default-skin/1.1/maven-default-skin-1.1.pom
(5 KB at 81.5 KB/sec)
Downloading: http://repo.maven.apache.org/maven2/org/apache/maven/skins/maven-fluido-skin/1.3.1/maven-fluido-skin-1.3.1.pom
Downloaded: http://repo.maven.apache.org/maven2/org/apache/maven/skins/maven-fluido-skin/1.3.1/maven-fluido-skin-1.3.1.pom
(28 KB at 350.9 KB/sec)
Downloading: http://repo.maven.apache.org/maven2/org/apache/maven/skins/maven-skins/8/maven-skins-8.pom
Downloaded: http://repo.maven.apache.org/maven2/org/apache/maven/skins/maven-skins/8/maven-skins-8.pom
(5 KB at 74.6 KB/sec)
Downloading: http://repo.maven.apache.org/maven2/org/apache/maven/skins/maven-stylus-skin/1.5/maven-stylus-skin-1.5.pom
Downloaded: http://repo.maven.apache.org/maven2/org/apache/maven/skins/maven-stylus-skin/1.5/maven-stylus-skin-1.5.pom
(6 KB at 43.3 KB/sec)
Downloading: http://repo.maven.apache.org/maven2/org/apache/maven/surefire/surefire/2.17/surefire-2.17.pom
Downloaded: http://repo.maven.apache.org/maven2/org/apache/maven/surefire/surefire/2.17/surefire-2.17.pom
(17 KB at 318.9 KB/sec)
Downloading: http://repo.maven.apache.org/maven2/org/apache/maven/wagon/wagon/2.6/wagon-2.6.pom
Downloaded: http://repo.maven.apache.org/maven2/org/apache/maven/wagon/wagon/2.6/wagon-2.6.pom
(20 KB at 361.9 KB/sec)
[INFO] Generating "Dist Tool> Source Release" report --- dist-tool-plugin:1.0-SNAPSHOT:check-source-release
[WARNING] Missing file for doxia-linkcheck in http://repo.maven.apache.org/maven2/org/apache/maven/doxia/doxia-linkcheck/1.2
[WARNING]  > doxia-linkcheck-1.2-source-release.zip <
[WARNING]  > doxia-linkcheck-1.2-source-release.zip.asc <
[WARNING]  > doxia-linkcheck-1.2-source-release.zip.md5 <
[WARNING] Missing file for doxia-linkcheck in http://www.apache.org/dist/maven/doxia
[WARNING]  > doxia-linkcheck-1.2-source-release.zip <
[WARNING]  > doxia-linkcheck-1.2-source-release.zip.asc <
[WARNING]  > doxia-linkcheck-1.2-source-release.zip.md5 <
[JENKINS] Archiving site from <https://builds.apache.org/job/dist-tool-plugin/ws/target/site>
to /x1/jenkins/jenkins-home/jobs/dist-tool-plugin/site
[INFO] ------------------------------------------------------------------------
[INFO] BUILD FAILURE
[INFO] ------------------------------------------------------------------------
[INFO] Total time: 3:43.780s
[INFO] Finished at: Mon Aug 18 10:34:42 UTC 2014
[INFO] Final Memory: 57M/369M
[INFO] ------------------------------------------------------------------------
Waiting for Jenkins to finish collecting data
[ERROR] Failed to execute goal org.apache.maven.plugins:maven-site-plugin:3.4:site (default-site)
on project dist-tool-plugin: Error generating dist-tool-plugin:1.0-SNAPSHOT:check-source-release:
IOException while reading http://repo.maven.apache.org/maven2/org/apache/maven/apache-maven/3.2.3:
HTTP error fetching URL -> [Help 1]
org.apache.maven.lifecycle.LifecycleExecutionException: Failed to execute goal org.apache.maven.plugins:maven-site-plugin:3.4:site
(default-site) on project dist-tool-plugin: Error generating dist-tool-plugin:1.0-SNAPSHOT:check-source-release:
IOException while reading http://repo.maven.apache.org/maven2/org/apache/maven/apache-maven/3.2.3
	at org.apache.maven.lifecycle.internal.MojoExecutor.execute(MojoExecutor.java:217)
	at org.apache.maven.lifecycle.internal.MojoExecutor.execute(MojoExecutor.java:153)
	at org.apache.maven.lifecycle.internal.MojoExecutor.execute(MojoExecutor.java:145)
	at org.apache.maven.lifecycle.internal.LifecycleModuleBuilder.buildProject(LifecycleModuleBuilder.java:84)
	at org.apache.maven.lifecycle.internal.LifecycleModuleBuilder.buildProject(LifecycleModuleBuilder.java:59)
	at org.apache.maven.lifecycle.internal.LifecycleStarter.singleThreadedBuild(LifecycleStarter.java:183)
	at org.apache.maven.lifecycle.internal.LifecycleStarter.execute(LifecycleStarter.java:161)
	at org.apache.maven.DefaultMaven.doExecute(DefaultMaven.java:320)
	at org.apache.maven.DefaultMaven.execute(DefaultMaven.java:156)
	at org.jvnet.hudson.maven3.launcher.Maven3Launcher.main(Maven3Launcher.java:117)
	at sun.reflect.NativeMethodAccessorImpl.invoke0(Native Method)
	at sun.reflect.NativeMethodAccessorImpl.invoke(NativeMethodAccessorImpl.java:57)
	at sun.reflect.DelegatingMethodAccessorImpl.invoke(DelegatingMethodAccessorImpl.java:43)
	at java.lang.reflect.Method.invoke(Method.java:606)
	at org.codehaus.plexus.classworlds.launcher.Launcher.launchStandard(Launcher.java:329)
	at org.codehaus.plexus.classworlds.launcher.Launcher.launch(Launcher.java:239)
	at org.jvnet.hudson.maven3.agent.Maven3Main.launch(Maven3Main.java:178)
	at sun.reflect.NativeMethodAccessorImpl.invoke0(Native Method)
	at sun.reflect.NativeMethodAccessorImpl.invoke(NativeMethodAccessorImpl.java:57)
	at sun.reflect.DelegatingMethodAccessorImpl.invoke(DelegatingMethodAccessorImpl.java:43)
	at java.lang.reflect.Method.invoke(Method.java:606)
	at hudson.maven.Maven3Builder.call(Maven3Builder.java:134)
	at hudson.maven.Maven3Builder.call(Maven3Builder.java:69)
	at hudson.remoting.UserRequest.perform(UserRequest.java:118)
	at hudson.remoting.UserRequest.perform(UserRequest.java:48)
	at hudson.remoting.Request$2.run(Request.java:328)
	at hudson.remoting.InterceptingExecutorService$1.call(InterceptingExecutorService.java:72)
	at java.util.concurrent.FutureTask$Sync.innerRun(FutureTask.java:334)
	at java.util.concurrent.FutureTask.run(FutureTask.java:166)
	at java.util.concurrent.ThreadPoolExecutor.runWorker(ThreadPoolExecutor.java:1145)
	at java.util.concurrent.ThreadPoolExecutor$Worker.run(ThreadPoolExecutor.java:615)
	at java.lang.Thread.run(Thread.java:724)
Caused by: org.apache.maven.plugin.MojoExecutionException: Error generating dist-tool-plugin:1.0-SNAPSHOT:check-source-release:
IOException while reading http://repo.maven.apache.org/maven2/org/apache/maven/apache-maven/3.2.3
	at org.apache.maven.plugins.site.render.SiteMojo.execute(SiteMojo.java:146)
	at org.apache.maven.plugin.DefaultBuildPluginManager.executeMojo(DefaultBuildPluginManager.java:101)
	at org.apache.maven.lifecycle.internal.MojoExecutor.execute(MojoExecutor.java:209)
	... 31 more
Caused by: org.apache.maven.doxia.siterenderer.RendererException: Error generating dist-tool-plugin:1.0-SNAPSHOT:check-source-release:
IOException while reading http://repo.maven.apache.org/maven2/org/apache/maven/apache-maven/3.2.3
	at org.apache.maven.plugins.site.render.ReportDocumentRenderer.renderDocument(ReportDocumentRenderer.java:239)
	at org.apache.maven.doxia.siterenderer.DefaultSiteRenderer.renderModule(DefaultSiteRenderer.java:311)
	at org.apache.maven.doxia.siterenderer.DefaultSiteRenderer.render(DefaultSiteRenderer.java:129)
	at org.apache.maven.plugins.site.render.SiteMojo.renderLocale(SiteMojo.java:182)
	at org.apache.maven.plugins.site.render.SiteMojo.execute(SiteMojo.java:141)
	... 33 more
Caused by: org.apache.maven.reporting.MavenReportException: IOException while reading http://repo.maven.apache.org/maven2/org/apache/maven/apache-maven/3.2.3
	at org.apache.maven.dist.tools.DistCheckSourceReleaseMojo.executeReport(DistCheckSourceReleaseMojo.java:281)
	at org.apache.maven.reporting.AbstractMavenReport.generate(AbstractMavenReport.java:196)
	at org.apache.maven.plugins.site.render.ReportDocumentRenderer.renderDocument(ReportDocumentRenderer.java:224)
	... 37 more
Caused by: org.apache.maven.plugin.MojoExecutionException: IOException while reading http://repo.maven.apache.org/maven2/org/apache/maven/apache-maven/3.2.3
	at org.apache.maven.dist.tools.DistCheckSourceReleaseMojo.checkArtifact(DistCheckSourceReleaseMojo.java:560)
	at org.apache.maven.dist.tools.AbstractDistCheckMojo.execute(AbstractDistCheckMojo.java:298)
	at org.apache.maven.dist.tools.DistCheckSourceReleaseMojo.executeReport(DistCheckSourceReleaseMojo.java:277)
	... 39 more
Caused by: java.io.IOException: IOException while reading http://repo.maven.apache.org/maven2/org/apache/maven/apache-maven/3.2.3
	at org.apache.maven.dist.tools.DistCheckSourceReleaseMojo.selectLinks(DistCheckSourceReleaseMojo.java:458)
	at org.apache.maven.dist.tools.DistCheckSourceReleaseMojo.checkDirectoryIndex(DistCheckSourceReleaseMojo.java:508)
	at org.apache.maven.dist.tools.DistCheckSourceReleaseMojo.checkArtifact(DistCheckSourceReleaseMojo.java:544)
	... 41 more
Caused by: org.jsoup.HttpStatusException: HTTP error fetching URL. Status=404, URL=http://repo.maven.apache.org/maven2/org/apache/maven/apache-maven/3.2.3
	at org.jsoup.helper.HttpConnection$Response.execute(HttpConnection.java:435)
	at org.jsoup.helper.HttpConnection$Response.execute(HttpConnection.java:410)
	at org.jsoup.helper.HttpConnection.execute(HttpConnection.java:164)
	at org.jsoup.helper.HttpConnection.get(HttpConnection.java:153)
	at org.apache.maven.dist.tools.DistCheckSourceReleaseMojo.read(DistCheckSourceReleaseMojo.java:445)
	at org.apache.maven.dist.tools.DistCheckSourceReleaseMojo.selectLinks(DistCheckSourceReleaseMojo.java:454)
	... 43 more
[ERROR] 
[ERROR] Re-run Maven using the -X switch to enable full debug logging.
[ERROR] 
[ERROR] For more information about the errors and possible solutions, please read the following
articles:
[ERROR] [Help 1] http://cwiki.apache.org/confluence/display/MAVEN/MojoExecutionException
[JENKINS] Archiving <https://builds.apache.org/job/dist-tool-plugin/ws/pom.xml> to org.apache.maven.dist.tools/dist-tool-plugin/1.0-SNAPSHOT/dist-tool-plugin-1.0-SNAPSHOT.pom
[JENKINS] Archiving <https://builds.apache.org/job/dist-tool-plugin/ws/target/dist-tool-plugin-1.0-SNAPSHOT.jar>
to org.apache.maven.dist.tools/dist-tool-plugin/1.0-SNAPSHOT/dist-tool-plugin-1.0-SNAPSHOT.jar
Sending artifact delta relative to dist-tool-plugin ? dist-tool-plugin #554
Archived 2 artifacts
Archive block size is 32768
Received 0 blocks and 73201 bytes
Compression is 0.0%
Took 24 ms
channel stopped

Mime
View raw message