maven-notifications mailing list archives

Site index · List index
Message view « Date » · « Thread »
Top « Date » · « Thread »
From Apache Jenkins Server <jenk...@builds.apache.org>
Subject Build failed in Jenkins: maven-plugins-ITs-m2 #1537
Date Mon, 25 Aug 2014 18:42:12 GMT
See <https://builds.apache.org/job/maven-plugins-ITs-m2/1537/changes>

Changes:

[khmarbaise] [MDOAP-40]
 - Upgrade scm to 1.9.1.

------------------------------------------
[...truncated 7422 lines...]
[INFO] ------------------------------------------------------------------------
[INFO] [clean:clean {execution: default-clean}]
[INFO] Deleting <https://builds.apache.org/job/maven-plugins-ITs-m2/ws/target>
[INFO] [enforcer:enforce {execution: enforce-bytecode-version}]
[INFO] [enforcer:enforce {execution: ban-known-bad-maven-versions}]
[INFO] [remote-resources:process {execution: default}]
[INFO] [site:attach-descriptor {execution: default-attach-descriptor}]
[INFO] [install:install {execution: default-install}]
[INFO] Installing <https://builds.apache.org/job/maven-plugins-ITs-m2/ws/pom.xml> to
/home/jenkins/.m2/repository/org/apache/maven/plugins/maven-plugins-aggregator/1-SNAPSHOT/maven-plugins-aggregator-1-SNAPSHOT.pom
[INFO] 
[INFO] 
[INFO] ------------------------------------------------------------------------
[INFO] Reactor Summary:
[INFO] ------------------------------------------------------------------------
[INFO] Apache Maven Plugins .................................. SUCCESS [6.216s]
[INFO] Apache Maven ACR Plugin ............................... SUCCESS [22.307s]
[INFO] Apache Maven Ant Plugin ............................... SUCCESS [1:08.916s]
[INFO] Apache Maven AntRun Plugin ............................ SUCCESS [47.851s]
[INFO] Apache Maven Eclipse Plugin ........................... SUCCESS [7:30.304s]
[INFO] Apache Maven Assembly Plugin .......................... SUCCESS [10:47.654s]
[INFO] Apache Maven Changelog Plugin ......................... SUCCESS [47.565s]
[INFO] Apache Maven Compiler Plugin .......................... FAILED [8.227s]
[INFO] Apache Maven Changes Plugin ........................... SKIPPED (dependency build failed
or was skipped)
[INFO] Apache Maven Checkstyle Plugin ........................ FAILED [16.473s]
[INFO] Apache Maven Clean Plugin ............................. FAILED [1.480s]
[INFO] Apache Maven Dependency Plugin ........................ FAILED [43.153s]
[INFO] Apache Maven Deploy Plugin ............................ FAILED [2.849s]
[INFO] Apache Maven DOAP Plugin .............................. FAILED [5.735s]
[INFO] Apache Maven Documentation Checker Plugin ............. FAILED [1.092s]
[INFO] Apache Maven EAR Plugin ............................... FAILED [3.597s]
[INFO] Apache Maven EJB Plugin ............................... FAILED [3.425s]
[INFO] Apache Maven Help Plugin .............................. FAILED [2.548s]
[INFO] Apache Maven Install Plugin ........................... FAILED [2.705s]
[INFO] Apache Maven JAR Plugin ............................... FAILED [2.104s]
[INFO] Apache Maven Jarsigner Plugin ......................... FAILED [1.582s]
[INFO] Apache Maven Javadoc Plugin ........................... FAILED [1:20.918s]
[INFO] Apache Maven Linkcheck Plugin ......................... FAILED [2.651s]
[INFO] Apache Maven Patch Plugin ............................. FAILED [0.404s]
[INFO] Apache Maven PDF Plugin ............................... FAILED [13.024s]
[INFO] Apache Maven RAR Plugin ............................... FAILED [2.979s]
[INFO] Apache Maven Repository Plugin ........................ FAILED [4.186s]
[INFO] Apache Maven Resources Plugin ......................... SKIPPED (dependency build failed
or was skipped)
[INFO] Apache Maven Site Plugin .............................. FAILED [10.305s]
[INFO] Apache Maven Source Plugin ............................ FAILED [14.432s]
[INFO] Apache Maven Stage Plugin ............................. FAILED [2.451s]
[INFO] Apache Maven Toolchains Plugin ........................ FAILED [1.503s]
[INFO] Apache Maven Verifier Plugin .......................... FAILED [2.744s]
[INFO] Apache Maven WAR Plugin ............................... FAILED [13.564s]
[INFO] Apache Maven PMD Plugin ............................... FAILED [22.147s]
[INFO] Apache Maven GPG Plugin ............................... FAILED [0.853s]
[INFO] Apache Maven Plugins Aggregator ....................... SUCCESS [0.017s]
[INFO] ------------------------------------------------------------------------
[INFO] Error for project: Apache Maven Compiler Plugin (during install)
[INFO] ------------------------------------------------------------------------
[INFO] There are test failures.

Please refer to <https://builds.apache.org/job/maven-plugins-ITs-m2/ws/maven-compiler-plugin/target/surefire-reports>
for the individual test results.
[INFO] ------------------------------------------------------------------------
[INFO] Error for project: Apache Maven Checkstyle Plugin (during install)
[INFO] ------------------------------------------------------------------------
[INFO] Failed to install project dependencies: MavenProject: org.apache.maven.plugins:maven-checkstyle-plugin:2.13-SNAPSHOT
@ <https://builds.apache.org/job/maven-plugins-ITs-m2/ws/maven-checkstyle-plugin/pom.xml>

Embedded error: Failed to install project artifacts: MavenProject: org.apache.maven.plugins:maven-compiler-plugin:3.2-SNAPSHOT
@ <https://builds.apache.org/job/maven-plugins-ITs-m2/ws/maven-compiler-plugin/pom.xml>
Artifact is not fully assembled: <https://builds.apache.org/job/maven-plugins-ITs-m2/ws/maven-compiler-plugin/target/classes>
[INFO] ------------------------------------------------------------------------
[INFO] Error for project: Apache Maven Clean Plugin (during install)
[INFO] ------------------------------------------------------------------------
[INFO] Failed to install project dependencies: MavenProject: org.apache.maven.plugins:maven-clean-plugin:2.6-SNAPSHOT
@ <https://builds.apache.org/job/maven-plugins-ITs-m2/ws/maven-clean-plugin/pom.xml>

Embedded error: Failed to install project artifacts: MavenProject: org.apache.maven.plugins:maven-compiler-plugin:3.2-SNAPSHOT
@ <https://builds.apache.org/job/maven-plugins-ITs-m2/ws/maven-compiler-plugin/pom.xml>
Artifact is not fully assembled: <https://builds.apache.org/job/maven-plugins-ITs-m2/ws/maven-compiler-plugin/target/classes>
[INFO] ------------------------------------------------------------------------
[INFO] Error for project: Apache Maven Dependency Plugin (during install)
[INFO] ------------------------------------------------------------------------
[INFO] Failed to install project dependencies: MavenProject: org.apache.maven.plugins:maven-dependency-plugin:2.9-SNAPSHOT
@ <https://builds.apache.org/job/maven-plugins-ITs-m2/ws/maven-dependency-plugin/pom.xml>

Embedded error: Failed to install project artifacts: MavenProject: org.apache.maven.plugins:maven-compiler-plugin:3.2-SNAPSHOT
@ <https://builds.apache.org/job/maven-plugins-ITs-m2/ws/maven-compiler-plugin/pom.xml>
Artifact is not fully assembled: <https://builds.apache.org/job/maven-plugins-ITs-m2/ws/maven-compiler-plugin/target/classes>
[INFO] ------------------------------------------------------------------------
[INFO] Error for project: Apache Maven Deploy Plugin (during install)
[INFO] ------------------------------------------------------------------------
[INFO] Failed to install project dependencies: MavenProject: org.apache.maven.plugins:maven-deploy-plugin:2.9-SNAPSHOT
@ <https://builds.apache.org/job/maven-plugins-ITs-m2/ws/maven-deploy-plugin/pom.xml>

Embedded error: Failed to install project artifacts: MavenProject: org.apache.maven.plugins:maven-compiler-plugin:3.2-SNAPSHOT
@ <https://builds.apache.org/job/maven-plugins-ITs-m2/ws/maven-compiler-plugin/pom.xml>
Artifact is not fully assembled: <https://builds.apache.org/job/maven-plugins-ITs-m2/ws/maven-compiler-plugin/target/classes>
[INFO] ------------------------------------------------------------------------
[INFO] Error for project: Apache Maven DOAP Plugin (during install)
[INFO] ------------------------------------------------------------------------
[INFO] Failed to install project dependencies: MavenProject: org.apache.maven.plugins:maven-doap-plugin:1.2-SNAPSHOT
@ <https://builds.apache.org/job/maven-plugins-ITs-m2/ws/maven-doap-plugin/pom.xml>

Embedded error: Failed to install project artifacts: MavenProject: org.apache.maven.plugins:maven-compiler-plugin:3.2-SNAPSHOT
@ <https://builds.apache.org/job/maven-plugins-ITs-m2/ws/maven-compiler-plugin/pom.xml>
Artifact is not fully assembled: <https://builds.apache.org/job/maven-plugins-ITs-m2/ws/maven-compiler-plugin/target/classes>
[INFO] ------------------------------------------------------------------------
[INFO] Error for project: Apache Maven Documentation Checker Plugin (during install)
[INFO] ------------------------------------------------------------------------
[INFO] Failed to install project dependencies: MavenProject: org.apache.maven.plugins:maven-docck-plugin:1.1-SNAPSHOT
@ <https://builds.apache.org/job/maven-plugins-ITs-m2/ws/maven-docck-plugin/pom.xml>

Embedded error: Failed to install project artifacts: MavenProject: org.apache.maven.plugins:maven-compiler-plugin:3.2-SNAPSHOT
@ <https://builds.apache.org/job/maven-plugins-ITs-m2/ws/maven-compiler-plugin/pom.xml>
Artifact is not fully assembled: <https://builds.apache.org/job/maven-plugins-ITs-m2/ws/maven-compiler-plugin/target/classes>
[INFO] ------------------------------------------------------------------------
[INFO] Error for project: Apache Maven EAR Plugin (during install)
[INFO] ------------------------------------------------------------------------
[INFO] Failed to install project dependencies: MavenProject: org.apache.maven.plugins:maven-ear-plugin:2.10-SNAPSHOT
@ <https://builds.apache.org/job/maven-plugins-ITs-m2/ws/maven-ear-plugin/pom.xml>

Embedded error: Failed to install project artifacts: MavenProject: org.apache.maven.plugins:maven-compiler-plugin:3.2-SNAPSHOT
@ <https://builds.apache.org/job/maven-plugins-ITs-m2/ws/maven-compiler-plugin/pom.xml>
Artifact is not fully assembled: <https://builds.apache.org/job/maven-plugins-ITs-m2/ws/maven-compiler-plugin/target/classes>
[INFO] ------------------------------------------------------------------------
[INFO] Error for project: Apache Maven EJB Plugin (during install)
[INFO] ------------------------------------------------------------------------
[INFO] Failed to install project dependencies: MavenProject: org.apache.maven.plugins:maven-ejb-plugin:2.5-SNAPSHOT
@ <https://builds.apache.org/job/maven-plugins-ITs-m2/ws/maven-ejb-plugin/pom.xml>

Embedded error: Failed to install project artifacts: MavenProject: org.apache.maven.plugins:maven-compiler-plugin:3.2-SNAPSHOT
@ <https://builds.apache.org/job/maven-plugins-ITs-m2/ws/maven-compiler-plugin/pom.xml>
Artifact is not fully assembled: <https://builds.apache.org/job/maven-plugins-ITs-m2/ws/maven-compiler-plugin/target/classes>
[INFO] ------------------------------------------------------------------------
[INFO] Error for project: Apache Maven Help Plugin (during install)
[INFO] ------------------------------------------------------------------------
[INFO] Failed to install project dependencies: MavenProject: org.apache.maven.plugins:maven-help-plugin:2.2.1-SNAPSHOT
@ <https://builds.apache.org/job/maven-plugins-ITs-m2/ws/maven-help-plugin/pom.xml>

Embedded error: Failed to install project artifacts: MavenProject: org.apache.maven.plugins:maven-compiler-plugin:3.2-SNAPSHOT
@ <https://builds.apache.org/job/maven-plugins-ITs-m2/ws/maven-compiler-plugin/pom.xml>
Artifact is not fully assembled: <https://builds.apache.org/job/maven-plugins-ITs-m2/ws/maven-compiler-plugin/target/classes>
[INFO] ------------------------------------------------------------------------
[INFO] Error for project: Apache Maven Install Plugin (during install)
[INFO] ------------------------------------------------------------------------
[INFO] Failed to install project dependencies: MavenProject: org.apache.maven.plugins:maven-install-plugin:2.6-SNAPSHOT
@ <https://builds.apache.org/job/maven-plugins-ITs-m2/ws/maven-install-plugin/pom.xml>

Embedded error: Failed to install project artifacts: MavenProject: org.apache.maven.plugins:maven-compiler-plugin:3.2-SNAPSHOT
@ <https://builds.apache.org/job/maven-plugins-ITs-m2/ws/maven-compiler-plugin/pom.xml>
Artifact is not fully assembled: <https://builds.apache.org/job/maven-plugins-ITs-m2/ws/maven-compiler-plugin/target/classes>
[INFO] ------------------------------------------------------------------------
[INFO] Error for project: Apache Maven JAR Plugin (during install)
[INFO] ------------------------------------------------------------------------
[INFO] Failed to install project dependencies: MavenProject: org.apache.maven.plugins:maven-jar-plugin:2.6-SNAPSHOT
@ <https://builds.apache.org/job/maven-plugins-ITs-m2/ws/maven-jar-plugin/pom.xml>

Embedded error: Failed to install project artifacts: MavenProject: org.apache.maven.plugins:maven-compiler-plugin:3.2-SNAPSHOT
@ <https://builds.apache.org/job/maven-plugins-ITs-m2/ws/maven-compiler-plugin/pom.xml>
Artifact is not fully assembled: <https://builds.apache.org/job/maven-plugins-ITs-m2/ws/maven-compiler-plugin/target/classes>
[INFO] ------------------------------------------------------------------------
[INFO] Error for project: Apache Maven Jarsigner Plugin (during install)
[INFO] ------------------------------------------------------------------------
[INFO] Failed to install project dependencies: MavenProject: org.apache.maven.plugins:maven-jarsigner-plugin:1.4-SNAPSHOT
@ <https://builds.apache.org/job/maven-plugins-ITs-m2/ws/maven-jarsigner-plugin/pom.xml>

Embedded error: Failed to install project artifacts: MavenProject: org.apache.maven.plugins:maven-compiler-plugin:3.2-SNAPSHOT
@ <https://builds.apache.org/job/maven-plugins-ITs-m2/ws/maven-compiler-plugin/pom.xml>
Artifact is not fully assembled: <https://builds.apache.org/job/maven-plugins-ITs-m2/ws/maven-compiler-plugin/target/classes>
[INFO] ------------------------------------------------------------------------
[INFO] Error for project: Apache Maven Javadoc Plugin (during install)
[INFO] ------------------------------------------------------------------------
[INFO] Failed to install project dependencies: MavenProject: org.apache.maven.plugins:maven-javadoc-plugin:2.9.2-SNAPSHOT
@ <https://builds.apache.org/job/maven-plugins-ITs-m2/ws/maven-javadoc-plugin/pom.xml>

Embedded error: Failed to install project artifacts: MavenProject: org.apache.maven.plugins:maven-compiler-plugin:3.2-SNAPSHOT
@ <https://builds.apache.org/job/maven-plugins-ITs-m2/ws/maven-compiler-plugin/pom.xml>
Artifact is not fully assembled: <https://builds.apache.org/job/maven-plugins-ITs-m2/ws/maven-compiler-plugin/target/classes>
[INFO] ------------------------------------------------------------------------
[INFO] Error for project: Apache Maven Linkcheck Plugin (during install)
[INFO] ------------------------------------------------------------------------
[INFO] Failed to install project dependencies: MavenProject: org.apache.maven.plugins:maven-linkcheck-plugin:1.2-SNAPSHOT
@ <https://builds.apache.org/job/maven-plugins-ITs-m2/ws/maven-linkcheck-plugin/pom.xml>

Embedded error: Failed to install project artifacts: MavenProject: org.apache.maven.plugins:maven-compiler-plugin:3.2-SNAPSHOT
@ <https://builds.apache.org/job/maven-plugins-ITs-m2/ws/maven-compiler-plugin/pom.xml>
Artifact is not fully assembled: <https://builds.apache.org/job/maven-plugins-ITs-m2/ws/maven-compiler-plugin/target/classes>
[INFO] ------------------------------------------------------------------------
[INFO] Error for project: Apache Maven Patch Plugin (during install)
[INFO] ------------------------------------------------------------------------
[INFO] Failed to install project dependencies: MavenProject: org.apache.maven.plugins:maven-patch-plugin:1.2-SNAPSHOT
@ <https://builds.apache.org/job/maven-plugins-ITs-m2/ws/maven-patch-plugin/pom.xml>

Embedded error: Failed to install project artifacts: MavenProject: org.apache.maven.plugins:maven-compiler-plugin:3.2-SNAPSHOT
@ <https://builds.apache.org/job/maven-plugins-ITs-m2/ws/maven-compiler-plugin/pom.xml>
Artifact is not fully assembled: <https://builds.apache.org/job/maven-plugins-ITs-m2/ws/maven-compiler-plugin/target/classes>
[INFO] ------------------------------------------------------------------------
[INFO] Error for project: Apache Maven PDF Plugin (during install)
[INFO] ------------------------------------------------------------------------
[INFO] Failed to install project dependencies: MavenProject: org.apache.maven.plugins:maven-pdf-plugin:1.3-SNAPSHOT
@ <https://builds.apache.org/job/maven-plugins-ITs-m2/ws/maven-pdf-plugin/pom.xml>

Embedded error: Failed to install project artifacts: MavenProject: org.apache.maven.plugins:maven-compiler-plugin:3.2-SNAPSHOT
@ <https://builds.apache.org/job/maven-plugins-ITs-m2/ws/maven-compiler-plugin/pom.xml>
Artifact is not fully assembled: <https://builds.apache.org/job/maven-plugins-ITs-m2/ws/maven-compiler-plugin/target/classes>
[INFO] ------------------------------------------------------------------------
[INFO] Error for project: Apache Maven RAR Plugin (during install)
[INFO] ------------------------------------------------------------------------
[INFO] Failed to install project dependencies: MavenProject: org.apache.maven.plugins:maven-rar-plugin:2.4-SNAPSHOT
@ <https://builds.apache.org/job/maven-plugins-ITs-m2/ws/maven-rar-plugin/pom.xml>

Embedded error: Failed to install project artifacts: MavenProject: org.apache.maven.plugins:maven-compiler-plugin:3.2-SNAPSHOT
@ <https://builds.apache.org/job/maven-plugins-ITs-m2/ws/maven-compiler-plugin/pom.xml>
Artifact is not fully assembled: <https://builds.apache.org/job/maven-plugins-ITs-m2/ws/maven-compiler-plugin/target/classes>
[INFO] ------------------------------------------------------------------------
[INFO] Error for project: Apache Maven Repository Plugin (during install)
[INFO] ------------------------------------------------------------------------
[INFO] Failed to install project dependencies: MavenProject: org.apache.maven.plugins:maven-repository-plugin:2.3.2-SNAPSHOT
@ <https://builds.apache.org/job/maven-plugins-ITs-m2/ws/maven-repository-plugin/pom.xml>

Embedded error: Failed to install project artifacts: MavenProject: org.apache.maven.plugins:maven-compiler-plugin:3.2-SNAPSHOT
@ <https://builds.apache.org/job/maven-plugins-ITs-m2/ws/maven-compiler-plugin/pom.xml>
Artifact is not fully assembled: <https://builds.apache.org/job/maven-plugins-ITs-m2/ws/maven-compiler-plugin/target/classes>
[INFO] ------------------------------------------------------------------------
[INFO] Error for project: Apache Maven Site Plugin (during install)
[INFO] ------------------------------------------------------------------------
[INFO] Failed to install project dependencies: MavenProject: org.apache.maven.plugins:maven-site-plugin:3.4.1-SNAPSHOT
@ <https://builds.apache.org/job/maven-plugins-ITs-m2/ws/maven-site-plugin/dependency-reduced-pom.xml>

Embedded error: Failed to install project artifacts: MavenProject: org.apache.maven.plugins:maven-compiler-plugin:3.2-SNAPSHOT
@ <https://builds.apache.org/job/maven-plugins-ITs-m2/ws/maven-compiler-plugin/pom.xml>
Artifact is not fully assembled: <https://builds.apache.org/job/maven-plugins-ITs-m2/ws/maven-compiler-plugin/target/classes>
[INFO] ------------------------------------------------------------------------
[INFO] Error for project: Apache Maven Source Plugin (during install)
[INFO] ------------------------------------------------------------------------
[INFO] Failed to install project dependencies: MavenProject: org.apache.maven.plugins:maven-source-plugin:2.4-SNAPSHOT
@ <https://builds.apache.org/job/maven-plugins-ITs-m2/ws/maven-source-plugin/pom.xml>

Embedded error: Failed to install project artifacts: MavenProject: org.apache.maven.plugins:maven-compiler-plugin:3.2-SNAPSHOT
@ <https://builds.apache.org/job/maven-plugins-ITs-m2/ws/maven-compiler-plugin/pom.xml>
Artifact is not fully assembled: <https://builds.apache.org/job/maven-plugins-ITs-m2/ws/maven-compiler-plugin/target/classes>
[INFO] ------------------------------------------------------------------------
[INFO] Error for project: Apache Maven Stage Plugin (during install)
[INFO] ------------------------------------------------------------------------
[INFO] Failed to install project dependencies: MavenProject: org.apache.maven.plugins:maven-stage-plugin:1.0-SNAPSHOT
@ <https://builds.apache.org/job/maven-plugins-ITs-m2/ws/maven-stage-plugin/pom.xml>

Embedded error: Failed to install project artifacts: MavenProject: org.apache.maven.plugins:maven-compiler-plugin:3.2-SNAPSHOT
@ <https://builds.apache.org/job/maven-plugins-ITs-m2/ws/maven-compiler-plugin/pom.xml>
Artifact is not fully assembled: <https://builds.apache.org/job/maven-plugins-ITs-m2/ws/maven-compiler-plugin/target/classes>
[INFO] ------------------------------------------------------------------------
[INFO] Error for project: Apache Maven Toolchains Plugin (during install)
[INFO] ------------------------------------------------------------------------
[INFO] Failed to install project dependencies: MavenProject: org.apache.maven.plugins:maven-toolchains-plugin:1.1-SNAPSHOT
@ <https://builds.apache.org/job/maven-plugins-ITs-m2/ws/maven-toolchains-plugin/pom.xml>

Embedded error: Failed to install project artifacts: MavenProject: org.apache.maven.plugins:maven-compiler-plugin:3.2-SNAPSHOT
@ <https://builds.apache.org/job/maven-plugins-ITs-m2/ws/maven-compiler-plugin/pom.xml>
Artifact is not fully assembled: <https://builds.apache.org/job/maven-plugins-ITs-m2/ws/maven-compiler-plugin/target/classes>
[INFO] ------------------------------------------------------------------------
[INFO] Error for project: Apache Maven Verifier Plugin (during install)
[INFO] ------------------------------------------------------------------------
[INFO] Failed to install project dependencies: MavenProject: org.apache.maven.plugins:maven-verifier-plugin:1.1-SNAPSHOT
@ <https://builds.apache.org/job/maven-plugins-ITs-m2/ws/maven-verifier-plugin/pom.xml>

Embedded error: Failed to install project artifacts: MavenProject: org.apache.maven.plugins:maven-compiler-plugin:3.2-SNAPSHOT
@ <https://builds.apache.org/job/maven-plugins-ITs-m2/ws/maven-compiler-plugin/pom.xml>
Artifact is not fully assembled: <https://builds.apache.org/job/maven-plugins-ITs-m2/ws/maven-compiler-plugin/target/classes>
[INFO] ------------------------------------------------------------------------
[INFO] Error for project: Apache Maven WAR Plugin (during install)
[INFO] ------------------------------------------------------------------------
[INFO] Failed to install project dependencies: MavenProject: org.apache.maven.plugins:maven-war-plugin:2.5-SNAPSHOT
@ <https://builds.apache.org/job/maven-plugins-ITs-m2/ws/maven-war-plugin/pom.xml>

Embedded error: Failed to install project artifacts: MavenProject: org.apache.maven.plugins:maven-compiler-plugin:3.2-SNAPSHOT
@ <https://builds.apache.org/job/maven-plugins-ITs-m2/ws/maven-compiler-plugin/pom.xml>
Artifact is not fully assembled: <https://builds.apache.org/job/maven-plugins-ITs-m2/ws/maven-compiler-plugin/target/classes>
[INFO] ------------------------------------------------------------------------
[INFO] Error for project: Apache Maven PMD Plugin (during install)
[INFO] ------------------------------------------------------------------------
[INFO] Failed to install project dependencies: MavenProject: org.apache.maven.plugins:maven-pmd-plugin:3.3-SNAPSHOT
@ <https://builds.apache.org/job/maven-plugins-ITs-m2/ws/maven-pmd-plugin/pom.xml>

Embedded error: Failed to install project artifacts: MavenProject: org.apache.maven.plugins:maven-compiler-plugin:3.2-SNAPSHOT
@ <https://builds.apache.org/job/maven-plugins-ITs-m2/ws/maven-compiler-plugin/pom.xml>
Artifact is not fully assembled: <https://builds.apache.org/job/maven-plugins-ITs-m2/ws/maven-compiler-plugin/target/classes>
[INFO] ------------------------------------------------------------------------
[INFO] Error for project: Apache Maven GPG Plugin (during install)
[INFO] ------------------------------------------------------------------------
[INFO] Failed to install project dependencies: MavenProject: org.apache.maven.plugins:maven-gpg-plugin:1.6-SNAPSHOT
@ <https://builds.apache.org/job/maven-plugins-ITs-m2/ws/maven-gpg-plugin/pom.xml>

Embedded error: Failed to install project artifacts: MavenProject: org.apache.maven.plugins:maven-compiler-plugin:3.2-SNAPSHOT
@ <https://builds.apache.org/job/maven-plugins-ITs-m2/ws/maven-compiler-plugin/pom.xml>
Artifact is not fully assembled: <https://builds.apache.org/job/maven-plugins-ITs-m2/ws/maven-compiler-plugin/target/classes>
[INFO] ------------------------------------------------------------------------
[INFO] For more information, run Maven with the -e switch
[INFO] ------------------------------------------------------------------------
[INFO] BUILD ERRORS
[INFO] ------------------------------------------------------------------------
[INFO] Total time: 25 minutes 59 seconds
[INFO] Finished at: Mon Aug 25 18:42:00 UTC 2014
[INFO] Final Memory: 238M/607M
[INFO] ------------------------------------------------------------------------
Build step 'Invoke top-level Maven targets' marked build as failure

Mime
View raw message