maven-notifications mailing list archives

Site index · List index
Message view « Date » · « Thread »
Top « Date » · « Thread »
From Apache Jenkins Server <jenk...@builds.apache.org>
Subject Build failed in Jenkins: core-it-maven-3-win #617
Date Mon, 11 Aug 2014 14:24:43 GMT
See <https://builds.apache.org/job/core-it-maven-3-win/617/changes>

Changes:

[brianf] default to ssl for central

------------------------------------------
[...truncated 9305 lines...]
[WARNING] Some problems were encountered while building the effective model for org.codehaus.jira.mng.XXX:mng-module4-XXX:ejb:1.0-SNAPSHOT
[WARNING] 'parent.relativePath' points at org.codehaus.jira.mng:builder instead of org.codehaus.jira.mng.XXX:parent,
please verify your project structure @ line 7, column 10
[WARNING] 'build.plugins.plugin.version' for org.apache.maven.plugins:maven-ejb-plugin is
missing. @ line 23, column 12
[WARNING] 
[WARNING] Some problems were encountered while building the effective model for org.codehaus.jira.mng.XXX:mng-module5-XXX:jar:1.0-SNAPSHOT
[WARNING] 'parent.relativePath' points at org.codehaus.jira.mng:builder instead of org.codehaus.jira.mng.XXX:parent,
please verify your project structure @ line 7, column 10
[WARNING] 
[WARNING] Some problems were encountered while building the effective model for org.codehaus.jira.mng:builder:pom:SNAPSHOT
[WARNING] 'version' uses an unsupported snapshot version format, should be '*-SNAPSHOT' instead.
@ line 12, column 14
[WARNING] 
[WARNING] It is highly recommended to fix these problems because they threaten the stability
of your build.
[WARNING] 
[WARNING] For this reason, future Maven versions might no longer support building such malformed
projects.
[WARNING] 
[INFO] ------------------------------------------------------------------------
[INFO] Reactor Build Order:
[INFO] 
[INFO] Module-1 XXX
[INFO] Module-2 XXX
[INFO] Module-3 XXX
[INFO] Module-4 XXX
[INFO] Module-5 XXX
[INFO] Builder POM for issue XXX
[INFO]                                                                         
[INFO] ------------------------------------------------------------------------
[INFO] Building Module-1 XXX 1.0-SNAPSHOT
[INFO] ------------------------------------------------------------------------
[INFO] Downloading: http://repo1.maven.org/maven2/org/apache/maven/plugins/maven-surefire-plugin/2.3/maven-surefire-plugin-2.3.pom
[WARNING] Checksum validation failed, could not read expected checksum: Failed to transfer
file: http://repo1.maven.org/maven2/org/apache/maven/plugins/maven-surefire-plugin/2.3/maven-surefire-plugin-2.3.pom.sha1.
Return code is: 503 , ReasonPhrase:Backend is unhealthy. for http://repo1.maven.org/maven2/org/apache/maven/plugins/maven-surefire-plugin/2.3/maven-surefire-plugin-2.3.pom
[WARNING] Checksum validation failed, could not read expected checksum: Failed to transfer
file: http://repo1.maven.org/maven2/org/apache/maven/plugins/maven-surefire-plugin/2.3/maven-surefire-plugin-2.3.pom.sha1.
Return code is: 503 , ReasonPhrase:Backend is unhealthy. for http://repo1.maven.org/maven2/org/apache/maven/plugins/maven-surefire-plugin/2.3/maven-surefire-plugin-2.3.pom
[INFO] Downloaded: http://repo1.maven.org/maven2/org/apache/maven/plugins/maven-surefire-plugin/2.3/maven-surefire-plugin-2.3.pom
(5 KB at 0.4 KB/sec)
[INFO] Downloading: http://repo1.maven.org/maven2/org/apache/maven/surefire/surefire/2.3/surefire-2.3.pom
[INFO] Downloaded: http://repo1.maven.org/maven2/org/apache/maven/surefire/surefire/2.3/surefire-2.3.pom
(6 KB at 0.2 KB/sec)
[INFO] Downloading: http://repo1.maven.org/maven2/org/apache/maven/plugins/maven-surefire-plugin/2.3/maven-surefire-plugin-2.3.jar
[INFO] ------------------------------------------------------------------------
[INFO] Reactor Summary:
[INFO] 
[INFO] Module-1 XXX ....................................... FAILURE [01:09 min]
[INFO] Module-2 XXX ....................................... SKIPPED
[INFO] Module-3 XXX ....................................... SKIPPED
[INFO] Module-4 XXX ....................................... SKIPPED
[INFO] Module-5 XXX ....................................... SKIPPED
[INFO] Builder POM for issue XXX .......................... SKIPPED
[INFO] ------------------------------------------------------------------------
[INFO] BUILD FAILURE
[INFO] ------------------------------------------------------------------------
[INFO] Total time: 01:09 min
[INFO] Finished at: 2014-08-11T15:13:15+01:00
[INFO] Final Memory: 7M/736M
[INFO] ------------------------------------------------------------------------
[ERROR] Plugin org.apache.maven.plugins:maven-surefire-plugin:2.3 or one of its dependencies
could not be resolved: Could not transfer artifact org.apache.maven.plugins:maven-surefire-plugin:jar:2.3
from/to central (http://repo1.maven.org/maven2): Failed to transfer file: http://repo1.maven.org/maven2/org/apache/maven/plugins/maven-surefire-plugin/2.3/maven-surefire-plugin-2.3.jar.
Return code is: 503 , ReasonPhrase:backend read error. -> [Help 1]
org.apache.maven.plugin.PluginResolutionException: Plugin org.apache.maven.plugins:maven-surefire-plugin:2.3
or one of its dependencies could not be resolved: Could not transfer artifact org.apache.maven.plugins:maven-surefire-plugin:jar:2.3
from/to central (http://repo1.maven.org/maven2): Failed to transfer file: http://repo1.maven.org/maven2/org/apache/maven/plugins/maven-surefire-plugin/2.3/maven-surefire-plugin-2.3.jar.
Return code is: 503 , ReasonPhrase:backend read error.
	at org.apache.maven.plugin.internal.DefaultPluginDependenciesResolver.resolve(DefaultPluginDependenciesResolver.java:133)
	at org.apache.maven.plugin.internal.DefaultMavenPluginManager.getPluginDescriptor(DefaultMavenPluginManager.java:148)
	at org.apache.maven.plugin.internal.DefaultMavenPluginManager.getMojoDescriptor(DefaultMavenPluginManager.java:267)
	at org.apache.maven.plugin.DefaultBuildPluginManager.getMojoDescriptor(DefaultBuildPluginManager.java:239)
	at org.apache.maven.lifecycle.internal.DefaultLifecycleExecutionPlanCalculator.setupMojoExecution(DefaultLifecycleExecutionPlanCalculator.java:158)
	at org.apache.maven.lifecycle.internal.DefaultLifecycleExecutionPlanCalculator.setupMojoExecutions(DefaultLifecycleExecutionPlanCalculator.java:145)
	at org.apache.maven.lifecycle.internal.DefaultLifecycleExecutionPlanCalculator.calculateExecutionPlan(DefaultLifecycleExecutionPlanCalculator.java:122)
	at org.apache.maven.lifecycle.internal.DefaultLifecycleExecutionPlanCalculator.calculateExecutionPlan(DefaultLifecycleExecutionPlanCalculator.java:135)
	at org.apache.maven.lifecycle.internal.builder.BuilderCommon.resolveBuildPlan(BuilderCommon.java:97)
	at org.apache.maven.lifecycle.internal.LifecycleModuleBuilder.buildProject(LifecycleModuleBuilder.java:109)
	at org.apache.maven.lifecycle.internal.LifecycleModuleBuilder.buildProject(LifecycleModuleBuilder.java:80)
	at org.apache.maven.lifecycle.internal.builder.singlethreaded.SingleThreadedBuilder.build(SingleThreadedBuilder.java:51)
	at org.apache.maven.lifecycle.internal.LifecycleStarter.execute(LifecycleStarter.java:120)
	at org.apache.maven.DefaultMaven.doExecute(DefaultMaven.java:347)
	at org.apache.maven.DefaultMaven.execute(DefaultMaven.java:154)
	at org.apache.maven.cli.MavenCli.execute(MavenCli.java:582)
	at org.apache.maven.cli.MavenCli.doMain(MavenCli.java:214)
	at org.apache.maven.cli.MavenCli.main(MavenCli.java:158)
	at sun.reflect.NativeMethodAccessorImpl.invoke0(Native Method)
	at sun.reflect.NativeMethodAccessorImpl.invoke(NativeMethodAccessorImpl.java:39)
	at sun.reflect.DelegatingMethodAccessorImpl.invoke(DelegatingMethodAccessorImpl.java:25)
	at java.lang.reflect.Method.invoke(Method.java:597)
	at org.codehaus.plexus.classworlds.launcher.Launcher.launchEnhanced(Launcher.java:289)
	at org.codehaus.plexus.classworlds.launcher.Launcher.launch(Launcher.java:229)
	at org.codehaus.plexus.classworlds.launcher.Launcher.mainWithExitCode(Launcher.java:415)
	at org.codehaus.plexus.classworlds.launcher.Launcher.main(Launcher.java:356)
Caused by: org.eclipse.aether.resolution.ArtifactResolutionException: Could not transfer artifact
org.apache.maven.plugins:maven-surefire-plugin:jar:2.3 from/to central (http://repo1.maven.org/maven2):
Failed to transfer file: http://repo1.maven.org/maven2/org/apache/maven/plugins/maven-surefire-plugin/2.3/maven-surefire-plugin-2.3.jar.
Return code is: 503 , ReasonPhrase:backend read error.
	at org.eclipse.aether.internal.impl.DefaultArtifactResolver.resolve(DefaultArtifactResolver.java:459)
	at org.eclipse.aether.internal.impl.DefaultArtifactResolver.resolveArtifacts(DefaultArtifactResolver.java:262)
	at org.eclipse.aether.internal.impl.DefaultArtifactResolver.resolveArtifact(DefaultArtifactResolver.java:239)
	at org.eclipse.aether.internal.impl.DefaultRepositorySystem.resolveArtifact(DefaultRepositorySystem.java:295)
	at org.apache.maven.plugin.internal.DefaultPluginDependenciesResolver.resolve(DefaultPluginDependenciesResolver.java:129)
	... 25 more
Caused by: org.eclipse.aether.transfer.ArtifactTransferException: Could not transfer artifact
org.apache.maven.plugins:maven-surefire-plugin:jar:2.3 from/to central (http://repo1.maven.org/maven2):
Failed to transfer file: http://repo1.maven.org/maven2/org/apache/maven/plugins/maven-surefire-plugin/2.3/maven-surefire-plugin-2.3.jar.
Return code is: 503 , ReasonPhrase:backend read error.
	at org.eclipse.aether.connector.wagon.WagonRepositoryConnector$6.wrap(WagonRepositoryConnector.java:1016)
	at org.eclipse.aether.connector.wagon.WagonRepositoryConnector$6.wrap(WagonRepositoryConnector.java:1004)
	at org.eclipse.aether.connector.wagon.WagonRepositoryConnector$GetTask.run(WagonRepositoryConnector.java:725)
	at org.eclipse.aether.util.concurrency.RunnableErrorForwarder$1.run(RunnableErrorForwarder.java:67)
	at java.util.concurrent.ThreadPoolExecutor$Worker.runTask(ThreadPoolExecutor.java:886)
	at java.util.concurrent.ThreadPoolExecutor$Worker.run(ThreadPoolExecutor.java:908)
	at java.lang.Thread.run(Thread.java:662)
Caused by: org.apache.maven.wagon.TransferFailedException: Failed to transfer file: http://repo1.maven.org/maven2/org/apache/maven/plugins/maven-surefire-plugin/2.3/maven-surefire-plugin-2.3.jar.
Return code is: 503 , ReasonPhrase:backend read error.
	at org.apache.maven.wagon.providers.http.AbstractHttpClientWagon.fillInputData(AbstractHttpClientWagon.java:889)
	at org.apache.maven.wagon.StreamWagon.getInputStream(StreamWagon.java:116)
	at org.apache.maven.wagon.StreamWagon.getIfNewer(StreamWagon.java:88)
	at org.apache.maven.wagon.StreamWagon.get(StreamWagon.java:61)
	at org.eclipse.aether.connector.wagon.WagonRepositoryConnector$GetTask.run(WagonRepositoryConnector.java:660)
	... 4 more
[ERROR] 
[ERROR] Re-run Maven using the -X switch to enable full debug logging.
[ERROR] 
[ERROR] For more information about the errors and possible solutions, please read the following
articles:
[ERROR] [Help 1] http://cwiki.apache.org/confluence/display/MAVEN/PluginResolutionException

	at org.apache.maven.it.Verifier.executeGoals(Verifier.java:1359)
	at org.apache.maven.it.Verifier.executeGoal(Verifier.java:1235)
	at org.apache.maven.it.Verifier.executeGoal(Verifier.java:1229)
	at org.apache.maven.it.MavenITmng3259DepsDroppedInMultiModuleBuildTest.testitMNG3259(MavenITmng3259DepsDroppedInMultiModuleBuildTest.java:62)


Results :

Tests in error: 
  MavenITmng3396DependencyManagementForOverConstrainedRangesTest>AbstractMavenIntegrationTestCase.runTest:220->testitMNG3396:66
» Verification
  MavenITmng3372DirectInvocationOfPluginsTest>AbstractMavenIntegrationTestCase.runTest:220->testDependencyTreeInvocation:83
» Verification
  MavenITmng3259DepsDroppedInMultiModuleBuildTest>AbstractMavenIntegrationTestCase.runTest:220->testitMNG3259:62
» Verification

Tests run: 750, Failures: 0, Errors: 3, Skipped: 0

[INFO] ------------------------------------------------------------------------
[INFO] Reactor Summary:
[INFO] 
[INFO] Maven Core ITs .................................... SUCCESS [33.481s]
[INFO] Maven IT Support .................................. SUCCESS [1.194s]
[INFO] Maven IT :: Plugins ............................... SUCCESS [0.843s]
[INFO] Maven IT Plugin :: Active Collection .............. SUCCESS [17.795s]
[INFO] Maven IT Plugin :: Ant-Based ...................... SUCCESS [8.053s]
[INFO] Maven IT Plugin :: Artifact ....................... SUCCESS [2.175s]
[INFO] Maven IT Plugin :: Class Loader :: Dependency A ... SUCCESS [0.419s]
[INFO] Maven IT Plugin :: Class Loader :: Dependency B ... SUCCESS [0.521s]
[INFO] Maven IT Plugin :: Class Loader :: Dependency C ... SUCCESS [0.217s]
[INFO] Maven IT Plugin :: Class Loader ................... SUCCESS [2.119s]
[INFO] Maven IT Plugin :: Class Loader :: Aggregator ..... SUCCESS [0.033s]
[INFO] Maven IT Plugin :: Configuration .................. SUCCESS [0.974s]
[INFO] Maven IT Plugin :: Context Passing ................ SUCCESS [0.193s]
[INFO] Maven ITs :: Core Plugin Stubs .................... SUCCESS [0.061s]
[INFO] Maven IT Clean Plugin Stub ........................ SUCCESS [0.282s]
[INFO] Maven IT Compiler Plugin Stub ..................... SUCCESS [0.356s]
[INFO] Maven IT Deploy Plugin Stub ....................... SUCCESS [0.381s]
[INFO] Maven IT EAR Plugin Stub .......................... SUCCESS [0.972s]
[INFO] Maven IT EJB Plugin Stub .......................... SUCCESS [0.561s]
[INFO] Maven IT Install Plugin Stub ...................... SUCCESS [0.436s]
[INFO] Maven IT JAR Plugin Stub .......................... SUCCESS [0.422s]
[INFO] Maven IT Javadoc Plugin Stub ...................... SUCCESS [0.355s]
[INFO] Maven IT Plugin Plugin Stub ....................... SUCCESS [0.771s]
[INFO] Maven IT RAR Plugin Stub .......................... SUCCESS [0.528s]
[INFO] Maven IT Resources Plugin Stub .................... SUCCESS [0.450s]
[INFO] Maven IT Site Plugin Stub ......................... SUCCESS [0.664s]
[INFO] Maven IT Source Plugin Stub ....................... SUCCESS [0.334s]
[INFO] Maven IT Surefire Plugin Stub ..................... SUCCESS [0.302s]
[INFO] Maven IT WAR Plugin Stub .......................... SUCCESS [0.352s]
[INFO] Maven IT Plugin :: Dependency Collection .......... SUCCESS [0.503s]
[INFO] Maven IT Plugin :: Dependency Resolution .......... SUCCESS [7.635s]
[INFO] Maven IT Plugin :: Expression ..................... SUCCESS [0.937s]
[INFO] Maven IT Plugin :: Error Mojos .................... SUCCESS [2.877s]
[INFO] Maven IT Component ................................ SUCCESS [0.205s]
[INFO] Maven IT Plugin :: Extension Consumer ............. SUCCESS [0.258s]
[INFO] Maven IT Plugin :: Extension Provider ............. SUCCESS [0.385s]
[INFO] Maven IT Plugin :: Fork ........................... SUCCESS [0.495s]
[INFO] Maven IT Plugin :: Invalid Descriptor ............. SUCCESS [0.214s]
[INFO] Maven IT Plugin :: Log File ....................... SUCCESS [0.269s]
[INFO] Maven IT Helper Library ........................... SUCCESS [1.494s]
[INFO] Maven IT Plugin :: Model Interpolation ............ SUCCESS [0.682s]
[INFO] Maven IT Plugin :: No Default Component ........... SUCCESS [0.440s]
[INFO] Maven IT Plugin :: No Project ..................... SUCCESS [0.225s]
[INFO] Maven IT Plugin :: Online ......................... SUCCESS [0.214s]
[INFO] Maven IT Plugin :: Optional Mojos ................. SUCCESS [0.424s]
[INFO] Maven IT Plugin :: Packaging ...................... SUCCESS [0.289s]
[INFO] Maven IT Plugin :: Parameter Implementation ....... SUCCESS [0.195s]
[INFO] Maven IT Plugin :: Plugin Dependency .............. SUCCESS [0.394s]
[INFO] Maven IT Plugin :: Project ........................ SUCCESS [0.484s]
[INFO] Maven IT Plugin :: Project Interpolation .......... SUCCESS [0.468s]
[INFO] Maven IT Plugin :: Setter ......................... SUCCESS [0.151s]
[INFO] Maven IT Plugin :: Singleton Component ............ SUCCESS [0.232s]
[INFO] Maven IT Plugin :: Site ........................... SUCCESS [1.961s]
[INFO] Maven IT Plugin :: Toolchain ...................... SUCCESS [6.805s]
[INFO] Maven IT Plugin :: Touch .......................... SUCCESS [0.844s]
[INFO] Maven IT Plugin :: Uses Properties Plugin ......... SUCCESS [0.324s]
[INFO] Maven IT Plugin :: Uses Wagon Plugin .............. SUCCESS [2.222s]
[INFO] Maven IT Plugin :: This plugin should contain the mojos needed by all tests.  SUCCESS
[2.236s]
[INFO] Maven IT Plugin :: Plexus Utils 1.1 ............... SUCCESS [0.690s]
[INFO] Maven IT Plugin :: Plexus Utils New ............... SUCCESS [0.300s]
[INFO] Maven IT Plugin :: Plexus Component API ........... SUCCESS [1.132s]
[INFO] Maven IT Plugin :: Log4J Client ................... SUCCESS [0.546s]
[INFO] Maven IT Plugin :: Extension 1 .................... SUCCESS [0.210s]
[INFO] Maven IT Plugin :: Extension 2 .................... SUCCESS [0.190s]
[INFO] Maven IT Plugin :: Plexus Lifecycle ............... SUCCESS [2.176s]
[INFO] Maven IT Plugin :: Settings ....................... SUCCESS [0.645s]
[INFO] Maven IT Toolchain ................................ SUCCESS [0.647s]
[INFO] Maven IT Wagon .................................... SUCCESS [0.226s]
[INFO] Maven IT Support Artifacts ........................ SUCCESS [2.237s]
[INFO] Maven IT Extension ................................ SUCCESS [0.206s]
[INFO] Maven ITs ......................................... FAILURE [46:27.713s]
[INFO] ------------------------------------------------------------------------
[INFO] BUILD FAILURE
[INFO] ------------------------------------------------------------------------
[INFO] Total time: 48:30.262s
[INFO] Finished at: Mon Aug 11 15:24:23 BST 2014
[INFO] Final Memory: 36M/766M
[INFO] ------------------------------------------------------------------------
[ERROR] Failed to execute goal org.apache.maven.plugins:maven-surefire-plugin:2.13:test (default-test)
on project core-it-suite: There are test failures.
[ERROR] 
[ERROR] Please refer to F:\ws\m3-its\core-integration-testing-trunk\core-it-suite\target\surefire-reports
for the individual test results.
[ERROR] -> [Help 1]
org.apache.maven.lifecycle.LifecycleExecutionException: Failed to execute goal org.apache.maven.plugins:maven-surefire-plugin:2.13:test
(default-test) on project core-it-suite: There are test failures.

Please refer to F:\ws\m3-its\core-integration-testing-trunk\core-it-suite\target\surefire-reports
for the individual test results.
	at org.apache.maven.lifecycle.internal.MojoExecutor.execute(MojoExecutor.java:213)
	at org.apache.maven.lifecycle.internal.MojoExecutor.execute(MojoExecutor.java:153)
	at org.apache.maven.lifecycle.internal.MojoExecutor.execute(MojoExecutor.java:145)
	at org.apache.maven.lifecycle.internal.LifecycleModuleBuilder.buildProject(LifecycleModuleBuilder.java:84)
	at org.apache.maven.lifecycle.internal.LifecycleModuleBuilder.buildProject(LifecycleModuleBuilder.java:59)
	at org.apache.maven.lifecycle.internal.LifecycleStarter.singleThreadedBuild(LifecycleStarter.java:183)
	at org.apache.maven.lifecycle.internal.LifecycleStarter.execute(LifecycleStarter.java:161)
	at org.apache.maven.DefaultMaven.doExecute(DefaultMaven.java:320)
	at org.apache.maven.DefaultMaven.execute(DefaultMaven.java:156)
	at org.apache.maven.cli.MavenCli.execute(MavenCli.java:537)
	at org.apache.maven.cli.MavenCli.doMain(MavenCli.java:196)
	at org.apache.maven.cli.MavenCli.main(MavenCli.java:141)
	at sun.reflect.NativeMethodAccessorImpl.invoke0(Native Method)
	at sun.reflect.NativeMethodAccessorImpl.invoke(NativeMethodAccessorImpl.java:39)
	at sun.reflect.DelegatingMethodAccessorImpl.invoke(DelegatingMethodAccessorImpl.java:25)
	at java.lang.reflect.Method.invoke(Method.java:597)
	at org.codehaus.plexus.classworlds.launcher.Launcher.launchEnhanced(Launcher.java:290)
	at org.codehaus.plexus.classworlds.launcher.Launcher.launch(Launcher.java:230)
	at org.codehaus.plexus.classworlds.launcher.Launcher.mainWithExitCode(Launcher.java:409)
	at org.codehaus.plexus.classworlds.launcher.Launcher.main(Launcher.java:352)
Caused by: org.apache.maven.plugin.MojoFailureException: There are test failures.

Please refer to F:\ws\m3-its\core-integration-testing-trunk\core-it-suite\target\surefire-reports
for the individual test results.
	at org.apache.maven.plugin.surefire.SurefireHelper.reportExecution(SurefireHelper.java:82)
	at org.apache.maven.plugin.surefire.SurefirePlugin.handleSummary(SurefirePlugin.java:151)
	at org.apache.maven.plugin.surefire.AbstractSurefireMojo.executeAfterPreconditionsChecked(AbstractSurefireMojo.java:721)
	at org.apache.maven.plugin.surefire.AbstractSurefireMojo.execute(AbstractSurefireMojo.java:620)
	at org.apache.maven.plugin.DefaultBuildPluginManager.executeMojo(DefaultBuildPluginManager.java:101)
	at org.apache.maven.lifecycle.internal.MojoExecutor.execute(MojoExecutor.java:209)
	... 19 more
[ERROR] 
[ERROR] Re-run Maven using the -X switch to enable full debug logging.
[ERROR] 
[ERROR] For more information about the errors and possible solutions, please read the following
articles:
[ERROR] [Help 1] http://cwiki.apache.org/confluence/display/MAVEN/MojoFailureException
[ERROR] 
[ERROR] After correcting the problems, you can resume the build with the command
[ERROR]   mvn <goals> -rf :core-it-suite
Build step 'Invoke top-level Maven targets' marked build as failure
Recording test results

Mime
View raw message