maven-notifications mailing list archives

Site index · List index
Message view « Date » · « Thread »
Top « Date » · « Thread »
From Apache Jenkins Server <jenk...@builds.apache.org>
Subject Build failed in Jenkins: maven-indexer #223
Date Sun, 14 Sep 2014 07:23:24 GMT
See <https://builds.apache.org/job/maven-indexer/223/>

------------------------------------------
[...truncated 1704 lines...]
[INFO] Exclude: src/test/**/.placeholder
[INFO] 4 resources included (use -debug for more details)
[INFO] Rat check: Summary of files. Unapproved: 0 unknown: 0 generated: 0 approved: 4 licence.
[INFO] 
[INFO] --- maven-jar-plugin:2.4:jar (default-jar) @ indexer-examples-basic ---
[INFO] Building jar: <https://builds.apache.org/job/maven-indexer/ws/indexer-examples/indexer-examples-basic/target/indexer-examples-basic-6.0-SNAPSHOT.jar>
[INFO] 
[INFO] --- maven-site-plugin:3.3:attach-descriptor (attach-descriptor) @ indexer-examples-basic
---
[INFO] 
[INFO] --- maven-install-plugin:2.5.1:install (default-install) @ indexer-examples-basic ---
[INFO] Installing <https://builds.apache.org/job/maven-indexer/ws/indexer-examples/indexer-examples-basic/target/indexer-examples-basic-6.0-SNAPSHOT.jar>
to /home/jenkins/jenkins-slave/maven-repositories/0/org/apache/maven/indexer/indexer-examples-basic/6.0-SNAPSHOT/indexer-examples-basic-6.0-SNAPSHOT.jar
[INFO] Installing <https://builds.apache.org/job/maven-indexer/ws/indexer-examples/indexer-examples-basic/pom.xml>
to /home/jenkins/jenkins-slave/maven-repositories/0/org/apache/maven/indexer/indexer-examples-basic/6.0-SNAPSHOT/indexer-examples-basic-6.0-SNAPSHOT.pom
[INFO]                                                                         
[INFO] ------------------------------------------------------------------------
[INFO] Building Maven :: Indexer Examples [Spring] 6.0-SNAPSHOT
[INFO] ------------------------------------------------------------------------
Downloading: http://repo.maven.apache.org/maven2/org/apache/maven/maven-model-builder/3.2.3/maven-model-builder-3.2.3.pom
Downloaded: http://repo.maven.apache.org/maven2/org/apache/maven/maven-model-builder/3.2.3/maven-model-builder-3.2.3.pom
(3 KB at 3.2 KB/sec)
Downloading: http://repo.maven.apache.org/maven2/org/apache/maven/maven-model-builder/3.2.3/maven-model-builder-3.2.3.jar
Downloaded: http://repo.maven.apache.org/maven2/org/apache/maven/maven-model-builder/3.2.3/maven-model-builder-3.2.3.jar
(165 KB at 470.3 KB/sec)
[INFO] 
[INFO] --- maven-clean-plugin:2.5:clean (default-clean) @ indexer-examples-spring ---
[INFO] Deleting <https://builds.apache.org/job/maven-indexer/ws/indexer-examples/indexer-examples-spring/target>
[INFO] 
[INFO] --- maven-enforcer-plugin:1.3.1:enforce (enforce-bytecode-version) @ indexer-examples-spring
---
[INFO] 
[INFO] --- maven-enforcer-plugin:1.3.1:enforce (ban-known-bad-maven-versions) @ indexer-examples-spring
---
[INFO] 
[INFO] --- maven-remote-resources-plugin:1.5:process (default) @ indexer-examples-spring ---
[INFO] 
[INFO] --- maven-resources-plugin:2.6:resources (default-resources) @ indexer-examples-spring
---
[INFO] Using 'UTF-8' encoding to copy filtered resources.
[INFO] Copying 1 resource
[INFO] Copying 3 resources
[INFO] 
[INFO] --- maven-compiler-plugin:3.1:compile (default-compile) @ indexer-examples-spring ---
[INFO] Changes detected - recompiling the module!
[INFO] Compiling 8 source files to <https://builds.apache.org/job/maven-indexer/ws/indexer-examples/indexer-examples-spring/target/classes>
[INFO] 
[INFO] --- animal-sniffer-maven-plugin:1.11:check (check-java-1.7-compat) @ indexer-examples-spring
---
[INFO] Checking unresolved references to org.codehaus.mojo.signature:java17:1.0
[INFO] 
[INFO] --- maven-resources-plugin:2.6:testResources (default-testResources) @ indexer-examples-spring
---
[INFO] Using 'UTF-8' encoding to copy filtered resources.
[INFO] Copying 2 resources
[INFO] Copying 3 resources
[INFO] 
[INFO] --- maven-compiler-plugin:3.1:testCompile (default-testCompile) @ indexer-examples-spring
---
[INFO] Changes detected - recompiling the module!
[INFO] Compiling 3 source files to <https://builds.apache.org/job/maven-indexer/ws/indexer-examples/indexer-examples-spring/target/test-classes>
[INFO] 
[INFO] --- maven-surefire-plugin:2.17:test (default-test) @ indexer-examples-spring ---
[INFO] Tests are skipped.
[INFO] 
[INFO] --- apache-rat-plugin:0.10:check (rat-verify) @ indexer-examples-spring ---
[INFO] 51 implicit excludes (use -debug for more details).
[INFO] Exclude: README.md
[INFO] Exclude: .gitignore
[INFO] Exclude: NOTICE
[INFO] Exclude: .git/**
[INFO] Exclude: .idea/**
[INFO] Exclude: src/test/**/*.sha1
[INFO] Exclude: src/test/**/*.md5
[INFO] Exclude: src/test/**/*.xml
[INFO] Exclude: src/test/**/*.pom
[INFO] Exclude: src/test/**/*.asc
[INFO] Exclude: src/test/**/*.properties
[INFO] Exclude: src/test/**/*.swc
[INFO] Exclude: src/test/**/*.txt
[INFO] Exclude: src/test/**/*.filename
[INFO] Exclude: src/test/**/.placeholder
[INFO] 14 resources included (use -debug for more details)
[INFO] Rat check: Summary of files. Unapproved: 0 unknown: 0 generated: 0 approved: 14 licence.
[INFO] 
[INFO] --- maven-jar-plugin:2.4:jar (default-jar) @ indexer-examples-spring ---
[INFO] Building jar: <https://builds.apache.org/job/maven-indexer/ws/indexer-examples/indexer-examples-spring/target/indexer-examples-spring-6.0-SNAPSHOT.jar>
[INFO] 
[INFO] --- maven-site-plugin:3.3:attach-descriptor (attach-descriptor) @ indexer-examples-spring
---
[INFO] 
[INFO] --- maven-install-plugin:2.5.1:install (default-install) @ indexer-examples-spring
---
[INFO] Installing <https://builds.apache.org/job/maven-indexer/ws/indexer-examples/indexer-examples-spring/target/indexer-examples-spring-6.0-SNAPSHOT.jar>
to /home/jenkins/jenkins-slave/maven-repositories/0/org/apache/maven/indexer/indexer-examples-spring/6.0-SNAPSHOT/indexer-examples-spring-6.0-SNAPSHOT.jar
[INFO] Installing <https://builds.apache.org/job/maven-indexer/ws/indexer-examples/indexer-examples-spring/pom.xml>
to /home/jenkins/jenkins-slave/maven-repositories/0/org/apache/maven/indexer/indexer-examples-spring/6.0-SNAPSHOT/indexer-examples-spring-6.0-SNAPSHOT.pom
[INFO]                                                                         
[INFO] ------------------------------------------------------------------------
[INFO] Building Maven :: Indexer Examples 6.0-SNAPSHOT
[INFO] ------------------------------------------------------------------------
[INFO] 
[INFO] --- maven-clean-plugin:2.5:clean (default-clean) @ indexer-examples ---
[INFO] Deleting <https://builds.apache.org/job/maven-indexer/ws/indexer-examples/target>
[INFO] 
[INFO] --- maven-enforcer-plugin:1.3.1:enforce (enforce-bytecode-version) @ indexer-examples
---
[INFO] 
[INFO] --- maven-enforcer-plugin:1.3.1:enforce (ban-known-bad-maven-versions) @ indexer-examples
---
[INFO] 
[INFO] --- maven-remote-resources-plugin:1.5:process (default) @ indexer-examples ---
[INFO] 
[INFO] --- animal-sniffer-maven-plugin:1.11:check (check-java-1.7-compat) @ indexer-examples
---
[INFO] Checking unresolved references to org.codehaus.mojo.signature:java17:1.0
[INFO] 
[INFO] --- apache-rat-plugin:0.10:check (rat-verify) @ indexer-examples ---
[INFO] 53 implicit excludes (use -debug for more details).
[INFO] Exclude: README.md
[INFO] Exclude: .gitignore
[INFO] Exclude: NOTICE
[INFO] Exclude: .git/**
[INFO] Exclude: .idea/**
[INFO] Exclude: src/test/**/*.sha1
[INFO] Exclude: src/test/**/*.md5
[INFO] Exclude: src/test/**/*.xml
[INFO] Exclude: src/test/**/*.pom
[INFO] Exclude: src/test/**/*.asc
[INFO] Exclude: src/test/**/*.properties
[INFO] Exclude: src/test/**/*.swc
[INFO] Exclude: src/test/**/*.txt
[INFO] Exclude: src/test/**/*.filename
[INFO] Exclude: src/test/**/.placeholder
[INFO] 1 resources included (use -debug for more details)
[INFO] Rat check: Summary of files. Unapproved: 0 unknown: 0 generated: 0 approved: 1 licence.
[INFO] 
[INFO] --- maven-site-plugin:3.3:attach-descriptor (attach-descriptor) @ indexer-examples
---
[INFO] 
[INFO] --- maven-install-plugin:2.5.1:install (default-install) @ indexer-examples ---
[INFO] Installing <https://builds.apache.org/job/maven-indexer/ws/indexer-examples/pom.xml>
to /home/jenkins/jenkins-slave/maven-repositories/0/org/apache/maven/indexer/indexer-examples/6.0-SNAPSHOT/indexer-examples-6.0-SNAPSHOT.pom
[INFO] ------------------------------------------------------------------------
[INFO] Reactor Summary:
[INFO] 
[INFO] Maven-Indexer ..................................... SUCCESS [1:05.861s]
[INFO] Maven :: Indexer Core ............................. SUCCESS [6:03.267s]
[INFO] Maven :: Indexer CLI .............................. FAILURE [1:44.529s]
[INFO] Maven :: Indexer Examples [Basic] ................. SUCCESS [17.128s]
[INFO] Maven :: Indexer Examples [Spring] ................ SUCCESS [17.772s]
[INFO] Maven :: Indexer Examples ......................... SUCCESS [6.318s]
[INFO] ------------------------------------------------------------------------
[INFO] BUILD FAILURE
[INFO] ------------------------------------------------------------------------
[INFO] Total time: 9:48.585s
[INFO] Finished at: Sun Sep 14 07:21:05 UTC 2014
[INFO] Final Memory: 34M/436M
[INFO] ------------------------------------------------------------------------
Waiting for Jenkins to finish collecting data[ERROR] Failed to execute goal org.apache.maven.plugins:maven-failsafe-plugin:2.17:integration-test
(default) on project indexer-cli: Execution default of goal org.apache.maven.plugins:maven-failsafe-plugin:2.17:integration-test
failed: The forked VM terminated without properly saying goodbye. VM crash or System.exit
called?
[ERROR] Command was /bin/sh -c cd <https://builds.apache.org/job/maven-indexer/ws/indexer-cli>
&& /home/jenkins/tools/java/jdk1.7.0_25-32/jre/bin/java -jar <https://builds.apache.org/job/maven-indexer/ws/indexer-cli/target/surefire/surefirebooter8923994639271188921.jar>
<https://builds.apache.org/job/maven-indexer/ws/indexer-cli/target/surefire/surefire929041248220432168tmp>
<https://builds.apache.org/job/maven-indexer/ws/indexer-cli/target/surefire/surefire_16153316046568383673tmp>
[ERROR] -> [Help 1]
org.apache.maven.lifecycle.LifecycleExecutionException: Failed to execute goal org.apache.maven.plugins:maven-failsafe-plugin:2.17:integration-test
(default) on project indexer-cli: Execution default of goal org.apache.maven.plugins:maven-failsafe-plugin:2.17:integration-test
failed: The forked VM terminated without properly saying goodbye. VM crash or System.exit
called?
Command was /bin/sh -c cd <https://builds.apache.org/job/maven-indexer/ws/indexer-cli>
&& /home/jenkins/tools/java/jdk1.7.0_25-32/jre/bin/java -jar <https://builds.apache.org/job/maven-indexer/ws/indexer-cli/target/surefire/surefirebooter8923994639271188921.jar>
<https://builds.apache.org/job/maven-indexer/ws/indexer-cli/target/surefire/surefire929041248220432168tmp>
<https://builds.apache.org/job/maven-indexer/ws/indexer-cli/target/surefire/surefire_16153316046568383673tmp>
	at org.apache.maven.lifecycle.internal.MojoExecutor.execute(MojoExecutor.java:225)
	at org.apache.maven.lifecycle.internal.MojoExecutor.execute(MojoExecutor.java:153)
	at org.apache.maven.lifecycle.internal.MojoExecutor.execute(MojoExecutor.java:145)
	at org.apache.maven.lifecycle.internal.LifecycleModuleBuilder.buildProject(LifecycleModuleBuilder.java:84)
	at org.apache.maven.lifecycle.internal.LifecycleModuleBuilder.buildProject(LifecycleModuleBuilder.java:59)
	at org.apache.maven.lifecycle.internal.LifecycleStarter.singleThreadedBuild(LifecycleStarter.java:183)
	at org.apache.maven.lifecycle.internal.LifecycleStarter.execute(LifecycleStarter.java:161)
	at org.apache.maven.DefaultMaven.doExecute(DefaultMaven.java:320)
	at org.apache.maven.DefaultMaven.execute(DefaultMaven.java:156)
	at org.jvnet.hudson.maven3.launcher.Maven3Launcher.main(Maven3Launcher.java:117)
	at sun.reflect.NativeMethodAccessorImpl.invoke0(Native Method)
	at sun.reflect.NativeMethodAccessorImpl.invoke(NativeMethodAccessorImpl.java:57)
	at sun.reflect.DelegatingMethodAccessorImpl.invoke(DelegatingMethodAccessorImpl.java:43)
	at java.lang.reflect.Method.invoke(Method.java:606)
	at org.codehaus.plexus.classworlds.launcher.Launcher.launchStandard(Launcher.java:329)
	at org.codehaus.plexus.classworlds.launcher.Launcher.launch(Launcher.java:239)
	at org.jvnet.hudson.maven3.agent.Maven3Main.launch(Maven3Main.java:178)
	at sun.reflect.NativeMethodAccessorImpl.invoke0(Native Method)
	at sun.reflect.NativeMethodAccessorImpl.invoke(NativeMethodAccessorImpl.java:57)
	at sun.reflect.DelegatingMethodAccessorImpl.invoke(DelegatingMethodAccessorImpl.java:43)
	at java.lang.reflect.Method.invoke(Method.java:606)
	at hudson.maven.Maven3Builder.call(Maven3Builder.java:134)
	at hudson.maven.Maven3Builder.call(Maven3Builder.java:69)
	at hudson.remoting.UserRequest.perform(UserRequest.java:118)
	at hudson.remoting.UserRequest.perform(UserRequest.java:48)
	at hudson.remoting.Request$2.run(Request.java:328)
	at hudson.remoting.InterceptingExecutorService$1.call(InterceptingExecutorService.java:72)
	at java.util.concurrent.FutureTask$Sync.innerRun(FutureTask.java:334)
	at java.util.concurrent.FutureTask.run(FutureTask.java:166)
	at java.util.concurrent.ThreadPoolExecutor.runWorker(ThreadPoolExecutor.java:1145)
	at java.util.concurrent.ThreadPoolExecutor$Worker.run(ThreadPoolExecutor.java:615)
	at java.lang.Thread.run(Thread.java:724)
Caused by: org.apache.maven.plugin.PluginExecutionException: Execution default of goal org.apache.maven.plugins:maven-failsafe-plugin:2.17:integration-test
failed: The forked VM terminated without properly saying goodbye. VM crash or System.exit
called?
Command was /bin/sh -c cd <https://builds.apache.org/job/maven-indexer/ws/indexer-cli>
&& /home/jenkins/tools/java/jdk1.7.0_25-32/jre/bin/java -jar <https://builds.apache.org/job/maven-indexer/ws/indexer-cli/target/surefire/surefirebooter8923994639271188921.jar>
<https://builds.apache.org/job/maven-indexer/ws/indexer-cli/target/surefire/surefire929041248220432168tmp>
<https://builds.apache.org/job/maven-indexer/ws/indexer-cli/target/surefire/surefire_16153316046568383673tmp>
	at org.apache.maven.plugin.DefaultBuildPluginManager.executeMojo(DefaultBuildPluginManager.java:110)
	at org.apache.maven.lifecycle.internal.MojoExecutor.execute(MojoExecutor.java:209)
	... 31 more
Caused by: java.lang.RuntimeException: The forked VM terminated without properly saying goodbye.
VM crash or System.exit called?
Command was /bin/sh -c cd <https://builds.apache.org/job/maven-indexer/ws/indexer-cli>
&& /home/jenkins/tools/java/jdk1.7.0_25-32/jre/bin/java -jar <https://builds.apache.org/job/maven-indexer/ws/indexer-cli/target/surefire/surefirebooter8923994639271188921.jar>
<https://builds.apache.org/job/maven-indexer/ws/indexer-cli/target/surefire/surefire929041248220432168tmp>
<https://builds.apache.org/job/maven-indexer/ws/indexer-cli/target/surefire/surefire_16153316046568383673tmp>
	at org.apache.maven.plugin.surefire.booterclient.ForkStarter.fork(ForkStarter.java:485)
	at org.apache.maven.plugin.surefire.booterclient.ForkStarter.fork(ForkStarter.java:352)
	at org.apache.maven.plugin.surefire.booterclient.ForkStarter.run(ForkStarter.java:158)
	at org.apache.maven.plugin.surefire.AbstractSurefireMojo.executeProvider(AbstractSurefireMojo.java:967)
	at org.apache.maven.plugin.surefire.AbstractSurefireMojo.executeAfterPreconditionsChecked(AbstractSurefireMojo.java:831)
	at org.apache.maven.plugin.surefire.AbstractSurefireMojo.execute(AbstractSurefireMojo.java:729)
	at org.apache.maven.plugin.DefaultBuildPluginManager.executeMojo(DefaultBuildPluginManager.java:101)
	... 32 more
[ERROR] 
[ERROR] Re-run Maven using the -X switch to enable full debug logging.
[ERROR] 
[ERROR] For more information about the errors and possible solutions, please read the following
articles:
[ERROR] [Help 1] http://cwiki.apache.org/confluence/display/MAVEN/PluginExecutionException
[ERROR] 
[ERROR] After correcting the problems, you can resume the build with the command
[ERROR]   mvn <goals> -rf :indexer-cli

[JENKINS] Archiving <https://builds.apache.org/job/maven-indexer/ws/indexer-examples/indexer-examples-basic/pom.xml>
to org.apache.maven.indexer/indexer-examples-basic/6.0-SNAPSHOT/indexer-examples-basic-6.0-SNAPSHOT.pom
[JENKINS] Archiving <https://builds.apache.org/job/maven-indexer/ws/indexer-examples/indexer-examples-basic/target/indexer-examples-basic-6.0-SNAPSHOT.jar>
to org.apache.maven.indexer/indexer-examples-basic/6.0-SNAPSHOT/indexer-examples-basic-6.0-SNAPSHOT.jar
Sending artifact delta relative to maven-indexer ? Maven :: Indexer Examples [Basic] #222
Archived 2 artifacts
Archive block size is 32768
Received 0 blocks and 20575 bytes
Compression is 0.0%
Took 0.12 sec
[JENKINS] Archiving <https://builds.apache.org/job/maven-indexer/ws/pom.xml> to org.apache.maven.indexer/maven-indexer/6.0-SNAPSHOT/maven-indexer-6.0-SNAPSHOT.pom
[JENKINS] Archiving <https://builds.apache.org/job/maven-indexer/ws/target/maven-indexer-6.0-SNAPSHOT-site.xml>
to org.apache.maven.indexer/maven-indexer/6.0-SNAPSHOT/maven-indexer-6.0-SNAPSHOT-site.xml
Sending artifact delta relative to maven-indexer ? Maven-Indexer #222
Archived 2 artifacts
Archive block size is 32768
Received 0 blocks and 20196 bytes
Compression is 0.0%
Took 1.8 sec
[JENKINS] Archiving <https://builds.apache.org/job/maven-indexer/ws/indexer-examples/pom.xml>
to org.apache.maven.indexer/indexer-examples/6.0-SNAPSHOT/indexer-examples-6.0-SNAPSHOT.pom
Sending artifact delta relative to maven-indexer ? Maven :: Indexer Examples #222
Archived 1 artifacts
Archive block size is 32768
Received 0 blocks and 1660 bytes
Compression is 0.0%
Took 0.16 sec
[JENKINS] Archiving <https://builds.apache.org/job/maven-indexer/ws/indexer-examples/indexer-examples-spring/pom.xml>
to org.apache.maven.indexer/indexer-examples-spring/6.0-SNAPSHOT/indexer-examples-spring-6.0-SNAPSHOT.pom
[JENKINS] Archiving <https://builds.apache.org/job/maven-indexer/ws/indexer-examples/indexer-examples-spring/target/indexer-examples-spring-6.0-SNAPSHOT.jar>
to org.apache.maven.indexer/indexer-examples-spring/6.0-SNAPSHOT/indexer-examples-spring-6.0-SNAPSHOT.jar
Sending artifact delta relative to maven-indexer ? Maven :: Indexer Examples [Spring] #222
Archived 2 artifacts
Archive block size is 32768
Received 0 blocks and 32922 bytes
Compression is 0.0%
Took 0.14 sec
[JENKINS] Archiving <https://builds.apache.org/job/maven-indexer/ws/indexer-core/pom.xml>
to org.apache.maven.indexer/indexer-core/6.0-SNAPSHOT/indexer-core-6.0-SNAPSHOT.pom
[JENKINS] Archiving <https://builds.apache.org/job/maven-indexer/ws/indexer-core/target/indexer-core-6.0-SNAPSHOT.jar>
to org.apache.maven.indexer/indexer-core/6.0-SNAPSHOT/indexer-core-6.0-SNAPSHOT.jar
Sending artifact delta relative to maven-indexer ? Maven :: Indexer Core #222
Archived 2 artifacts
Archive block size is 32768
Received 0 blocks and 258022 bytes
Compression is 0.0%
Took 2 sec
[JENKINS] Archiving <https://builds.apache.org/job/maven-indexer/ws/indexer-cli/pom.xml>
to org.apache.maven.indexer/indexer-cli/6.0-SNAPSHOT/indexer-cli-6.0-SNAPSHOT.pom
[JENKINS] Archiving <https://builds.apache.org/job/maven-indexer/ws/indexer-cli/target/indexer-cli-6.0-SNAPSHOT.jar>
to org.apache.maven.indexer/indexer-cli/6.0-SNAPSHOT/indexer-cli-6.0-SNAPSHOT.jar
Sending artifact delta relative to maven-indexer ? Maven :: Indexer CLI #222
Archived 2 artifacts
Archive block size is 32768
Received 10 blocks and 12001893 bytes
Compression is 2.7%
Took 18 sec
Sending e-mails to: notifications@maven.apache.org
channel stopped

Mime
View raw message