maven-notifications mailing list archives

Site index · List index
Message view « Date » · « Thread »
Top « Date » · « Thread »
From Apache Jenkins Server <jenk...@builds.apache.org>
Subject Build failed in Jenkins: core-it-maven-3-win #807
Date Fri, 20 Feb 2015 14:24:20 GMT
See <https://builds.apache.org/job/core-it-maven-3-win/807/changes>

Changes:

[ifedorenko] MNG-5768 @execution-id syntax for direct plugin goal invocation

[ifedorenko] MNG-5767 .mvn/ for project specific jvm options and maven parameters

[ifedorenko] MNG-5768 @execution-id syntax for direct plugin goal invocation

------------------------------------------
[...truncated 9206 lines...]
0086PluginRealm(it0086).....................................OK (2.5 s)
0085TransitiveSystemScope(it0085)...........................OK (3.1 s)
0072InterpolationWithDottedProperty(it0072).................OK (2.6 s)
0071PluginConfigWithDottedProperty(it0071)..................OK (3.3 s)
0064MojoConfigViaSetters(it0064)............................OK (2.6 s)
0063SystemScopeDependency(it0063)...........................OK (3.1 s)
0056MultipleGoalExecutions(it0056)..........................OK (2.7 s)
0052ReleaseProfile(it0052)..................................OK (3.0 s)
0051ReleaseProfile(it0051)..................................OK (3.1 s)
0041ArtifactTypeFromPluginExtension(it0041).................OK (3.8 s)
0040PackagingFromPluginExtension(it0040)....................OK (2.5 s)
0039ReleasePomInReactor(it0039).............................SKIPPED - Maven version 3.2.6-SNAPSHOT
not in range [2.0,3.0-alpha-1)
0038AlternatePomFileDifferentDir(it0038)....................OK (2.6 s)
0037AlternatePomFileSameDir(it0037).........................OK (2.6 s)
0036ReleasePom(it0036)......................................SKIPPED - Maven version 3.2.6-SNAPSHOT
not in range (2.0,3.0-alpha-1)
0032MavenPrerequisite(it0032)...............................OK (2.5 s)
0030DepPomDepMngtInheritance(it0030)........................OK (9.5 s)
0025MultipleExecutionLevelConfigs(it0025)...................OK (3.3 s)
0024MultipleGoalExecutions(it0024)..........................OK (2.6 s)
0023SettingsProfile(it0023).................................OK (3.5 s)
0021PomProfile(it0021)......................................OK (3.2 s)
0019PluginVersionMngtBySuperPom(it0019).....................OK (3.0 s)
0018DependencyManagement(it0018)............................OK (3.4 s)
0012PomInterpolation(it0012)................................OK (2.8 s)
0011DefaultVersionByDependencyManagement(it0011)............OK (5.6 s)
0010DependencyClosureResolution(it0010).....................OK (5.3 s)
0009GoalConfiguration(it0009)...............................OK (3.5 s)
0008SimplePlugin(it0008)....................................OK (4.8 s)
Tests run: 759, Failures: 0, Errors: 1, Skipped: 0, Time elapsed: 2,948.213 sec <<<
FAILURE!
testCustomMojoExecutionConfigurator(org.apache.maven.it.MavenITmng5753CustomMojoExecutionConfiguratorTest)
 Time elapsed: 4.503 sec  <<< ERROR!
org.apache.maven.it.VerificationException: Exit code was non-zero: 1; command line and log
= 
<https://builds.apache.org/job/core-it-maven-3-win/ws/apache-maven-3-SNAPSHOT\bin\mvn>
--global-settings F:\ws\m3-its\core-integration-testing-trunk\core-it-suite\target\test-classes\settings-remote.xml
-e --batch-mode -Dmaven.repo.local=<https://builds.apache.org/job/core-it-maven-3-win/ws/it-local-repo>
install
[INFO] Error stacktraces are turned on.
[INFO] Scanning for projects...
[INFO]                                                                         
[INFO] ------------------------------------------------------------------------
[INFO] Building mng-5753-custom-mojo-execution-configurator-plugin 0.1
[INFO] ------------------------------------------------------------------------
[INFO] Downloading: http://repo1.maven.org/maven2/org/apache/maven/maven-plugin-api/3.2.6-SNAPSHOT/maven-metadata.xml
[INFO] Downloading: http://repo1.maven.org/maven2/org/apache/maven/maven-plugin-api/3.2.6-SNAPSHOT/maven-plugin-api-3.2.6-SNAPSHOT.pom
[WARNING] The POM for org.apache.maven:maven-plugin-api:jar:3.2.6-SNAPSHOT is missing, no
dependency information available
[INFO] Downloading: http://repo1.maven.org/maven2/org/apache/maven/maven-model/3.2.6-SNAPSHOT/maven-metadata.xml
[INFO] Downloading: http://repo1.maven.org/maven2/org/apache/maven/maven-model/3.2.6-SNAPSHOT/maven-model-3.2.6-SNAPSHOT.pom
[WARNING] The POM for org.apache.maven:maven-model:jar:3.2.6-SNAPSHOT is missing, no dependency
information available
[INFO] Downloading: http://repo1.maven.org/maven2/org/apache/maven/maven-core/3.2.6-SNAPSHOT/maven-metadata.xml
[INFO] Downloading: http://repo1.maven.org/maven2/org/apache/maven/maven-core/3.2.6-SNAPSHOT/maven-core-3.2.6-SNAPSHOT.pom
[WARNING] The POM for org.apache.maven:maven-core:jar:3.2.6-SNAPSHOT is missing, no dependency
information available
[INFO] Downloading: http://repo1.maven.org/maven2/org/apache/maven/maven-plugin-api/3.2.6-SNAPSHOT/maven-plugin-api-3.2.6-SNAPSHOT.jar
[INFO] Downloading: http://repo1.maven.org/maven2/org/apache/maven/maven-model/3.2.6-SNAPSHOT/maven-model-3.2.6-SNAPSHOT.jar
[INFO] Downloading: http://repo1.maven.org/maven2/org/apache/maven/maven-core/3.2.6-SNAPSHOT/maven-core-3.2.6-SNAPSHOT.jar
[INFO] ------------------------------------------------------------------------
[INFO] BUILD FAILURE
[INFO] ------------------------------------------------------------------------
[INFO] Total time: 2.339 s
[INFO] Finished at: 2015-02-20T05:37:08-08:00
[INFO] Final Memory: 12M/742M
[INFO] ------------------------------------------------------------------------
[ERROR] Failed to execute goal on project mng-5753-custom-mojo-execution-configurator-plugin:
Could not resolve dependencies for project mng-5753-custom-mojo-execution-configurator:mng-5753-custom-mojo-execution-configurator-plugin:maven-plugin:0.1:
The following artifacts could not be resolved: org.apache.maven:maven-plugin-api:jar:3.2.6-SNAPSHOT,
org.apache.maven:maven-model:jar:3.2.6-SNAPSHOT, org.apache.maven:maven-core:jar:3.2.6-SNAPSHOT:
Could not find artifact org.apache.maven:maven-plugin-api:jar:3.2.6-SNAPSHOT in central (http://repo1.maven.org/maven2)
-> [Help 1]
org.apache.maven.lifecycle.LifecycleExecutionException: Failed to execute goal on project
mng-5753-custom-mojo-execution-configurator-plugin: Could not resolve dependencies for project
mng-5753-custom-mojo-execution-configurator:mng-5753-custom-mojo-execution-configurator-plugin:maven-plugin:0.1:
The following artifacts could not be resolved: org.apache.maven:maven-plugin-api:jar:3.2.6-SNAPSHOT,
org.apache.maven:maven-model:jar:3.2.6-SNAPSHOT, org.apache.maven:maven-core:jar:3.2.6-SNAPSHOT:
Could not find artifact org.apache.maven:maven-plugin-api:jar:3.2.6-SNAPSHOT in central (http://repo1.maven.org/maven2)
	at org.apache.maven.lifecycle.internal.LifecycleDependencyResolver.getDependencies(LifecycleDependencyResolver.java:220)
	at org.apache.maven.lifecycle.internal.LifecycleDependencyResolver.resolveProjectDependencies(LifecycleDependencyResolver.java:127)
	at org.apache.maven.lifecycle.internal.MojoExecutor.ensureDependenciesAreResolved(MojoExecutor.java:257)
	at org.apache.maven.lifecycle.internal.MojoExecutor.execute(MojoExecutor.java:200)
	at org.apache.maven.lifecycle.internal.MojoExecutor.execute(MojoExecutor.java:153)
	at org.apache.maven.lifecycle.internal.MojoExecutor.execute(MojoExecutor.java:145)
	at org.apache.maven.lifecycle.internal.LifecycleModuleBuilder.buildProject(LifecycleModuleBuilder.java:116)
	at org.apache.maven.lifecycle.internal.LifecycleModuleBuilder.buildProject(LifecycleModuleBuilder.java:80)
	at org.apache.maven.lifecycle.internal.builder.singlethreaded.SingleThreadedBuilder.build(SingleThreadedBuilder.java:51)
	at org.apache.maven.lifecycle.internal.LifecycleStarter.execute(LifecycleStarter.java:120)
	at org.apache.maven.DefaultMaven.doExecute(DefaultMaven.java:347)
	at org.apache.maven.DefaultMaven.execute(DefaultMaven.java:151)
	at org.apache.maven.cli.MavenCli.execute(MavenCli.java:650)
	at org.apache.maven.cli.MavenCli.doMain(MavenCli.java:234)
	at org.apache.maven.cli.MavenCli.main(MavenCli.java:177)
	at sun.reflect.NativeMethodAccessorImpl.invoke0(Native Method)
	at sun.reflect.NativeMethodAccessorImpl.invoke(NativeMethodAccessorImpl.java:39)
	at sun.reflect.DelegatingMethodAccessorImpl.invoke(DelegatingMethodAccessorImpl.java:25)
	at java.lang.reflect.Method.invoke(Method.java:597)
	at org.codehaus.plexus.classworlds.launcher.Launcher.launchEnhanced(Launcher.java:289)
	at org.codehaus.plexus.classworlds.launcher.Launcher.launch(Launcher.java:229)
	at org.codehaus.plexus.classworlds.launcher.Launcher.mainWithExitCode(Launcher.java:415)
	at org.codehaus.plexus.classworlds.launcher.Launcher.main(Launcher.java:356)
Caused by: org.apache.maven.project.DependencyResolutionException: Could not resolve dependencies
for project mng-5753-custom-mojo-execution-configurator:mng-5753-custom-mojo-execution-configurator-plugin:maven-plugin:0.1:
The following artifacts could not be resolved: org.apache.maven:maven-plugin-api:jar:3.2.6-SNAPSHOT,
org.apache.maven:maven-model:jar:3.2.6-SNAPSHOT, org.apache.maven:maven-core:jar:3.2.6-SNAPSHOT:
Could not find artifact org.apache.maven:maven-plugin-api:jar:3.2.6-SNAPSHOT in central (http://repo1.maven.org/maven2)
	at org.apache.maven.project.DefaultProjectDependenciesResolver.resolve(DefaultProjectDependenciesResolver.java:211)
	at org.apache.maven.lifecycle.internal.LifecycleDependencyResolver.getDependencies(LifecycleDependencyResolver.java:195)
	... 22 more
Caused by: org.eclipse.aether.resolution.DependencyResolutionException: The following artifacts
could not be resolved: org.apache.maven:maven-plugin-api:jar:3.2.6-SNAPSHOT, org.apache.maven:maven-model:jar:3.2.6-SNAPSHOT,
org.apache.maven:maven-core:jar:3.2.6-SNAPSHOT: Could not find artifact org.apache.maven:maven-plugin-api:jar:3.2.6-SNAPSHOT
in central (http://repo1.maven.org/maven2)
	at org.eclipse.aether.internal.impl.DefaultRepositorySystem.resolveDependencies(DefaultRepositorySystem.java:384)
	at org.apache.maven.project.DefaultProjectDependenciesResolver.resolve(DefaultProjectDependenciesResolver.java:205)
	... 23 more
Caused by: org.eclipse.aether.resolution.ArtifactResolutionException: The following artifacts
could not be resolved: org.apache.maven:maven-plugin-api:jar:3.2.6-SNAPSHOT, org.apache.maven:maven-model:jar:3.2.6-SNAPSHOT,
org.apache.maven:maven-core:jar:3.2.6-SNAPSHOT: Could not find artifact org.apache.maven:maven-plugin-api:jar:3.2.6-SNAPSHOT
in central (http://repo1.maven.org/maven2)
	at org.eclipse.aether.internal.impl.DefaultArtifactResolver.resolve(DefaultArtifactResolver.java:444)
	at org.eclipse.aether.internal.impl.DefaultArtifactResolver.resolveArtifacts(DefaultArtifactResolver.java:246)
	at org.eclipse.aether.internal.impl.DefaultRepositorySystem.resolveDependencies(DefaultRepositorySystem.java:367)
	... 24 more
Caused by: org.eclipse.aether.transfer.ArtifactNotFoundException: Could not find artifact
org.apache.maven:maven-plugin-api:jar:3.2.6-SNAPSHOT in central (http://repo1.maven.org/maven2)
	at org.eclipse.aether.connector.basic.ArtifactTransportListener.transferFailed(ArtifactTransportListener.java:39)
	at org.eclipse.aether.connector.basic.BasicRepositoryConnector$TaskRunner.run(BasicRepositoryConnector.java:355)
	at org.eclipse.aether.util.concurrency.RunnableErrorForwarder$1.run(RunnableErrorForwarder.java:67)
	at java.util.concurrent.ThreadPoolExecutor$Worker.runTask(ThreadPoolExecutor.java:886)
	at java.util.concurrent.ThreadPoolExecutor$Worker.run(ThreadPoolExecutor.java:908)
	at java.lang.Thread.run(Thread.java:662)
[ERROR] 
[ERROR] Re-run Maven using the -X switch to enable full debug logging.
[ERROR] 
[ERROR] For more information about the errors and possible solutions, please read the following
articles:
[ERROR] [Help 1] http://cwiki.apache.org/confluence/display/MAVEN/DependencyResolutionException

	at org.apache.maven.it.Verifier.executeGoals(Verifier.java:1359)
	at org.apache.maven.it.Verifier.executeGoal(Verifier.java:1235)
	at org.apache.maven.it.Verifier.executeGoal(Verifier.java:1229)
	at org.apache.maven.it.MavenITmng5753CustomMojoExecutionConfiguratorTest.testCustomMojoExecutionConfigurator(MavenITmng5753CustomMojoExecutionConfiguratorTest.java:47)


Results :

Tests in error: 
  MavenITmng5753CustomMojoExecutionConfiguratorTest>AbstractMavenIntegrationTestCase.runTest:220->testCustomMojoExecutionConfigurator:47
ยป Verification

Tests run: 759, Failures: 0, Errors: 1, Skipped: 0

[INFO] ------------------------------------------------------------------------
[INFO] Reactor Summary:
[INFO] 
[INFO] Maven Core ITs .................................... SUCCESS [29.543s]
[INFO] Maven IT Support .................................. SUCCESS [0.076s]
[INFO] Maven IT :: Plugins ............................... SUCCESS [0.077s]
[INFO] Maven IT Plugin :: Active Collection .............. SUCCESS [15.202s]
[INFO] Maven IT Plugin :: Ant-Based ...................... SUCCESS [5.033s]
[INFO] Maven IT Plugin :: Artifact ....................... SUCCESS [1.859s]
[INFO] Maven IT Plugin :: Class Loader :: Dependency A ... SUCCESS [0.133s]
[INFO] Maven IT Plugin :: Class Loader :: Dependency B ... SUCCESS [0.169s]
[INFO] Maven IT Plugin :: Class Loader :: Dependency C ... SUCCESS [0.095s]
[INFO] Maven IT Plugin :: Class Loader ................... SUCCESS [1.671s]
[INFO] Maven IT Plugin :: Class Loader :: Aggregator ..... SUCCESS [0.033s]
[INFO] Maven IT Plugin :: Configuration .................. SUCCESS [0.918s]
[INFO] Maven IT Plugin :: Context Passing ................ SUCCESS [0.239s]
[INFO] Maven ITs :: Core Plugin Stubs .................... SUCCESS [0.051s]
[INFO] Maven IT Clean Plugin Stub ........................ SUCCESS [0.410s]
[INFO] Maven IT Compiler Plugin Stub ..................... SUCCESS [0.606s]
[INFO] Maven IT Deploy Plugin Stub ....................... SUCCESS [0.395s]
[INFO] Maven IT EAR Plugin Stub .......................... SUCCESS [0.760s]
[INFO] Maven IT EJB Plugin Stub .......................... SUCCESS [0.264s]
[INFO] Maven IT Install Plugin Stub ...................... SUCCESS [0.680s]
[INFO] Maven IT JAR Plugin Stub .......................... SUCCESS [0.288s]
[INFO] Maven IT Javadoc Plugin Stub ...................... SUCCESS [0.271s]
[INFO] Maven IT Plugin Plugin Stub ....................... SUCCESS [0.707s]
[INFO] Maven IT RAR Plugin Stub .......................... SUCCESS [0.370s]
[INFO] Maven IT Resources Plugin Stub .................... SUCCESS [0.390s]
[INFO] Maven IT Site Plugin Stub ......................... SUCCESS [0.709s]
[INFO] Maven IT Source Plugin Stub ....................... SUCCESS [0.251s]
[INFO] Maven IT Surefire Plugin Stub ..................... SUCCESS [0.743s]
[INFO] Maven IT WAR Plugin Stub .......................... SUCCESS [0.677s]
[INFO] Maven IT Plugin :: Dependency Collection .......... SUCCESS [0.746s]
[INFO] Maven IT Plugin :: Dependency Resolution .......... SUCCESS [5.996s]
[INFO] Maven IT Plugin :: Expression ..................... SUCCESS [0.763s]
[INFO] Maven IT Plugin :: Error Mojos .................... SUCCESS [2.338s]
[INFO] Maven IT Component ................................ SUCCESS [0.222s]
[INFO] Maven IT Plugin :: Extension Consumer ............. SUCCESS [0.161s]
[INFO] Maven IT Plugin :: Extension Provider ............. SUCCESS [0.175s]
[INFO] Maven IT Plugin :: Fork ........................... SUCCESS [0.317s]
[INFO] Maven IT Plugin :: Invalid Descriptor ............. SUCCESS [0.126s]
[INFO] Maven IT Plugin :: Log File ....................... SUCCESS [0.180s]
[INFO] Maven IT Helper Library ........................... SUCCESS [1.788s]
[INFO] Maven IT Plugin :: Model Interpolation ............ SUCCESS [0.781s]
[INFO] Maven IT Plugin :: No Default Component ........... SUCCESS [0.141s]
[INFO] Maven IT Plugin :: No Project ..................... SUCCESS [0.326s]
[INFO] Maven IT Plugin :: Online ......................... SUCCESS [0.552s]
[INFO] Maven IT Plugin :: Optional Mojos ................. SUCCESS [0.311s]
[INFO] Maven IT Plugin :: Packaging ...................... SUCCESS [0.138s]
[INFO] Maven IT Plugin :: Parameter Implementation ....... SUCCESS [0.206s]
[INFO] Maven IT Plugin :: Plugin Dependency .............. SUCCESS [0.125s]
[INFO] Maven IT Plugin :: Project ........................ SUCCESS [0.639s]
[INFO] Maven IT Plugin :: Project Interpolation .......... SUCCESS [0.353s]
[INFO] Maven IT Plugin :: Setter ......................... SUCCESS [0.209s]
[INFO] Maven IT Plugin :: Singleton Component ............ SUCCESS [0.149s]
[INFO] Maven IT Plugin :: Site ........................... SUCCESS [2.023s]
[INFO] Maven IT Plugin :: Toolchain ...................... SUCCESS [36.014s]
[INFO] Maven IT Plugin :: Touch .......................... SUCCESS [1.010s]
[INFO] Maven IT Plugin :: Uses Properties Plugin ......... SUCCESS [0.126s]
[INFO] Maven IT Plugin :: Uses Wagon Plugin .............. SUCCESS [1.544s]
[INFO] Maven IT Plugin :: This plugin should contain the mojos needed by all tests.  SUCCESS
[1.575s]
[INFO] Maven IT Plugin :: Plexus Utils 1.1 ............... SUCCESS [1.776s]
[INFO] Maven IT Plugin :: Plexus Utils New ............... SUCCESS [0.288s]
[INFO] Maven IT Plugin :: Plexus Component API ........... SUCCESS [1.249s]
[INFO] Maven IT Plugin :: Log4J Client ................... SUCCESS [0.757s]
[INFO] Maven IT Plugin :: Extension 1 .................... SUCCESS [0.121s]
[INFO] Maven IT Plugin :: Extension 2 .................... SUCCESS [0.106s]
[INFO] Maven IT Plugin :: Plexus Lifecycle ............... SUCCESS [2.065s]
[INFO] Maven IT Plugin :: Settings ....................... SUCCESS [0.349s]
[INFO] Maven IT Toolchain ................................ SUCCESS [0.660s]
[INFO] Maven IT Wagon .................................... SUCCESS [0.184s]
[INFO] Maven IT Support Artifacts ........................ SUCCESS [2.275s]
[INFO] Maven IT Extension ................................ SUCCESS [0.102s]
[INFO] Maven ITs ......................................... FAILURE [49:47.497s]
[INFO] ------------------------------------------------------------------------
[INFO] BUILD FAILURE
[INFO] ------------------------------------------------------------------------
[INFO] Total time: 52:02.807s
[INFO] Finished at: Fri Feb 20 06:24:12 PST 2015
[INFO] Final Memory: 36M/742M
[INFO] ------------------------------------------------------------------------
[ERROR] Failed to execute goal org.apache.maven.plugins:maven-surefire-plugin:2.13:test (default-test)
on project core-it-suite: There are test failures.
[ERROR] 
[ERROR] Please refer to F:\ws\m3-its\core-integration-testing-trunk\core-it-suite\target\surefire-reports
for the individual test results.
[ERROR] -> [Help 1]
org.apache.maven.lifecycle.LifecycleExecutionException: Failed to execute goal org.apache.maven.plugins:maven-surefire-plugin:2.13:test
(default-test) on project core-it-suite: There are test failures.

Please refer to F:\ws\m3-its\core-integration-testing-trunk\core-it-suite\target\surefire-reports
for the individual test results.
	at org.apache.maven.lifecycle.internal.MojoExecutor.execute(MojoExecutor.java:213)
	at org.apache.maven.lifecycle.internal.MojoExecutor.execute(MojoExecutor.java:153)
	at org.apache.maven.lifecycle.internal.MojoExecutor.execute(MojoExecutor.java:145)
	at org.apache.maven.lifecycle.internal.LifecycleModuleBuilder.buildProject(LifecycleModuleBuilder.java:84)
	at org.apache.maven.lifecycle.internal.LifecycleModuleBuilder.buildProject(LifecycleModuleBuilder.java:59)
	at org.apache.maven.lifecycle.internal.LifecycleStarter.singleThreadedBuild(LifecycleStarter.java:183)
	at org.apache.maven.lifecycle.internal.LifecycleStarter.execute(LifecycleStarter.java:161)
	at org.apache.maven.DefaultMaven.doExecute(DefaultMaven.java:320)
	at org.apache.maven.DefaultMaven.execute(DefaultMaven.java:156)
	at org.apache.maven.cli.MavenCli.execute(MavenCli.java:537)
	at org.apache.maven.cli.MavenCli.doMain(MavenCli.java:196)
	at org.apache.maven.cli.MavenCli.main(MavenCli.java:141)
	at sun.reflect.NativeMethodAccessorImpl.invoke0(Native Method)
	at sun.reflect.NativeMethodAccessorImpl.invoke(NativeMethodAccessorImpl.java:39)
	at sun.reflect.DelegatingMethodAccessorImpl.invoke(DelegatingMethodAccessorImpl.java:25)
	at java.lang.reflect.Method.invoke(Method.java:597)
	at org.codehaus.plexus.classworlds.launcher.Launcher.launchEnhanced(Launcher.java:290)
	at org.codehaus.plexus.classworlds.launcher.Launcher.launch(Launcher.java:230)
	at org.codehaus.plexus.classworlds.launcher.Launcher.mainWithExitCode(Launcher.java:409)
	at org.codehaus.plexus.classworlds.launcher.Launcher.main(Launcher.java:352)
Caused by: org.apache.maven.plugin.MojoFailureException: There are test failures.

Please refer to F:\ws\m3-its\core-integration-testing-trunk\core-it-suite\target\surefire-reports
for the individual test results.
	at org.apache.maven.plugin.surefire.SurefireHelper.reportExecution(SurefireHelper.java:82)
	at org.apache.maven.plugin.surefire.SurefirePlugin.handleSummary(SurefirePlugin.java:151)
	at org.apache.maven.plugin.surefire.AbstractSurefireMojo.executeAfterPreconditionsChecked(AbstractSurefireMojo.java:721)
	at org.apache.maven.plugin.surefire.AbstractSurefireMojo.execute(AbstractSurefireMojo.java:620)
	at org.apache.maven.plugin.DefaultBuildPluginManager.executeMojo(DefaultBuildPluginManager.java:101)
	at org.apache.maven.lifecycle.internal.MojoExecutor.execute(MojoExecutor.java:209)
	... 19 more
[ERROR] 
[ERROR] Re-run Maven using the -X switch to enable full debug logging.
[ERROR] 
[ERROR] For more information about the errors and possible solutions, please read the following
articles:
[ERROR] [Help 1] http://cwiki.apache.org/confluence/display/MAVEN/MojoFailureException
[ERROR] 
[ERROR] After correcting the problems, you can resume the build with the command
[ERROR]   mvn <goals> -rf :core-it-suite
Build step 'Invoke top-level Maven targets' marked build as failure
Recording test results

Mime
View raw message