maven-notifications mailing list archives

Site index · List index
Message view « Date » · « Thread »
Top « Date » · « Thread »
From Apache Jenkins Server <jenk...@builds.apache.org>
Subject Build failed in Jenkins: maven-archetype-m2 » Maven Archetype Plugin #126
Date Thu, 12 Feb 2015 23:08:50 GMT
See <https://builds.apache.org/job/maven-archetype-m2/org.apache.maven.plugins$maven-archetype-plugin/126/>

------------------------------------------
[...truncated 164 lines...]
[WARNING] Note: Recompile with -Xlint:unchecked for details.
[INFO] [plexus-component-metadata:generate-metadata {execution: default}]
[INFO] Discovered 8 component descriptors(s)
[INFO] [plugin:descriptor {execution: mojo-descriptor}]
[INFO] Using 'UTF-8' encoding to read mojo metadata.
[INFO] Applying mojo extractor for language: java-annotations
[INFO] Mojo extractor for language: java-annotations found 7 mojo descriptors.
[INFO] Applying mojo extractor for language: java
[INFO] Mojo extractor for language: java found 1 mojo descriptors.
[INFO] Applying mojo extractor for language: bsh
[INFO] Mojo extractor for language: bsh found 0 mojo descriptors.
[INFO] [resources:testResources {execution: default-testResources}]
[INFO] Using 'UTF-8' encoding to copy filtered resources.
[INFO] skip non existing resourceDirectory <https://builds.apache.org/job/maven-archetype-m2/org.apache.maven.plugins$maven-archetype-plugin/ws/src/test/resources>
[INFO] Copying 3 resources
[INFO] [compiler:testCompile {execution: default-testCompile}]
[INFO] Changes detected - recompiling the module!
[INFO] Compiling 4 source files to <https://builds.apache.org/job/maven-archetype-m2/org.apache.maven.plugins$maven-archetype-plugin/ws/target/test-classes>
[INFO] [surefire:test {execution: default-test}]
[INFO] Surefire report directory: <https://builds.apache.org/job/maven-archetype-m2/org.apache.maven.plugins$maven-archetype-plugin/ws/target/surefire-reports>

-------------------------------------------------------
 T E S T S
-------------------------------------------------------
Running org.apache.maven.archetype.ui.generation.DefaultArchetypeSelectorTest
[INFO] No catalog defined. Using internal catalog
[INFO] No archetype defined. Using maven-archetype-quickstart (org.apache.maven.archetypes:maven-archetype-quickstart:1.0)
[INFO] No catalog defined. Using internal catalog
[INFO] No archetype defined. Using maven-archetype-quickstart (org.apache.maven.archetypes:maven-archetype-quickstart:1.0)
[INFO] No catalog defined. Using internal catalog
[INFO] No catalog defined. Using internal catalog
[WARNING] Archetype not found in any catalog. Falling back to central repository (http://repo.maven.apache.org/maven2).
[WARNING] Use -DarchetypeRepository=<your repository> if archetype's repository is elsewhere.
[INFO] No catalog defined. Using internal catalog
[INFO] No archetype defined. Using maven-archetype-quickstart (org.apache.maven.archetypes:maven-archetype-quickstart:1.0)
Tests run: 5, Failures: 0, Errors: 0, Skipped: 0, Time elapsed: 0.823 sec - in org.apache.maven.archetype.ui.generation.DefaultArchetypeSelectorTest
Running org.apache.maven.archetype.ui.generation.RequiredPropertyComparatorTest
Tests run: 2, Failures: 0, Errors: 0, Skipped: 0, Time elapsed: 0.002 sec - in org.apache.maven.archetype.ui.generation.RequiredPropertyComparatorTest
Running org.apache.maven.archetype.ui.generation.DefaultArchetypeSelectionQueryerTest
Tests run: 5, Failures: 0, Errors: 0, Skipped: 0, Time elapsed: 0.196 sec - in org.apache.maven.archetype.ui.generation.DefaultArchetypeSelectionQueryerTest
Running org.apache.maven.archetype.ui.generation.DefaultArchetypeGenerationConfiguratorTest
[WARNING] Property groupId is missing. Add -DgroupId=someValue
[WARNING] Property package is missing. Add -Dpackage=someValue
Tests run: 3, Failures: 0, Errors: 0, Skipped: 0, Time elapsed: 0.127 sec - in org.apache.maven.archetype.ui.generation.DefaultArchetypeGenerationConfiguratorTest

Results :

Tests run: 15, Failures: 0, Errors: 0, Skipped: 0

[JENKINS] Recording test results
[INFO] [jar:jar {execution: default-jar}]
[INFO] Building jar: <https://builds.apache.org/job/maven-archetype-m2/org.apache.maven.plugins$maven-archetype-plugin/ws/target/maven-archetype-plugin-2.3-SNAPSHOT.jar>
[INFO] [plugin:addPluginArtifactMetadata {execution: default-addPluginArtifactMetadata}]
Downloading: http://repo1.maven.org/maven2/org/apache/maven/maven-project/2.0.10/maven-project-2.0.10.pom
2K downloaded  (maven-project-2.0.10.pom)
Downloading: http://repo1.maven.org/maven2/org/apache/maven/maven/2.0.10/maven-2.0.10.pom
23K downloaded  (maven-2.0.10.pom)
Downloading: http://repo1.maven.org/maven2/org/apache/maven/maven-plugin-api/2.0.10/maven-plugin-api-2.0.10.pom
1K downloaded  (maven-plugin-api-2.0.10.pom)
Downloading: http://repo1.maven.org/maven2/org/apache/maven/doxia/doxia-logging-api/1.1.2/doxia-logging-api-1.1.2.pom
1K downloaded  (doxia-logging-api-1.1.2.pom)
Downloading: http://repo1.maven.org/maven2/org/codehaus/plexus/plexus-utils/1.5.12/plexus-utils-1.5.12.pom
5K downloaded  (plexus-utils-1.5.12.pom)
Downloading: http://repo1.maven.org/maven2/xerces/xercesImpl/2.8.1/xercesImpl-2.8.1.pom
2K downloaded  (xercesImpl-2.8.1.pom)
Downloading: http://repo1.maven.org/maven2/xml-apis/xml-apis/1.3.03/xml-apis-1.3.03.pom
738b downloaded  (xml-apis-1.3.03.pom)
Downloading: http://repo1.maven.org/maven2/org/apache/apache/1/apache-1.pom
3K downloaded  (apache-1.pom)
Downloading: http://repo1.maven.org/maven2/commons-httpclient/commons-httpclient/3.1/commons-httpclient-3.1.pom
7K downloaded  (commons-httpclient-3.1.pom)
Downloading: http://repo1.maven.org/maven2/org/apache/maven/doxia/doxia-decoration-model/1.1.2/doxia-decoration-model-1.1.2.pom
2K downloaded  (doxia-decoration-model-1.1.2.pom)
Downloading: http://repo1.maven.org/maven2/org/apache/maven/doxia/doxia-module-xhtml/1.1.2/doxia-module-xhtml-1.1.2.pom
1K downloaded  (doxia-module-xhtml-1.1.2.pom)
Downloading: http://repo1.maven.org/maven2/org/apache/maven/doxia/doxia-modules/1.1.2/doxia-modules-1.1.2.pom
2K downloaded  (doxia-modules-1.1.2.pom)
Downloading: http://repo1.maven.org/maven2/org/apache/maven/doxia/doxia-module-fml/1.1.2/doxia-module-fml-1.1.2.pom
5K downloaded  (doxia-module-fml-1.1.2.pom)
Downloading: http://repo1.maven.org/maven2/org/apache/maven/shared/maven-script-interpreter/1.1/maven-script-interpreter-1.1.pom
3K downloaded  (maven-script-interpreter-1.1.pom)
Downloading: http://repo1.maven.org/maven2/org/codehaus/groovy/groovy/2.0.1/groovy-2.0.1.pom
15K downloaded  (groovy-2.0.1.pom)
Downloading: http://repo1.maven.org/maven2/org/ow2/asm/asm-tree/4.0/asm-tree-4.0.pom
2K downloaded  (asm-tree-4.0.pom)
Downloading: http://repo1.maven.org/maven2/org/ow2/asm/asm-parent/4.0/asm-parent-4.0.pom
5K downloaded  (asm-parent-4.0.pom)
Downloading: http://repo1.maven.org/maven2/org/ow2/asm/asm/4.0/asm-4.0.pom
1K downloaded  (asm-4.0.pom)
Downloading: http://repo1.maven.org/maven2/org/ow2/asm/asm-commons/4.0/asm-commons-4.0.pom
2K downloaded  (asm-commons-4.0.pom)
Downloading: http://repo1.maven.org/maven2/org/ow2/asm/asm-util/4.0/asm-util-4.0.pom
2K downloaded  (asm-util-4.0.pom)
Downloading: http://repo1.maven.org/maven2/org/ow2/asm/asm-analysis/4.0/asm-analysis-4.0.pom
2K downloaded  (asm-analysis-4.0.pom)
Downloading: http://repo1.maven.org/maven2/org/apache/maven/doxia/doxia-sink-api/1.1.4/doxia-sink-api-1.1.4.pom
1K downloaded  (doxia-sink-api-1.1.4.pom)
Downloading: http://repo1.maven.org/maven2/org/apache/maven/doxia/doxia/1.1.4/doxia-1.1.4.pom
18K downloaded  (doxia-1.1.4.pom)
Downloading: http://repo1.maven.org/maven2/org/apache/maven/doxia/doxia-logging-api/1.1.4/doxia-logging-api-1.1.4.pom
1K downloaded  (doxia-logging-api-1.1.4.pom)
Downloading: http://repo1.maven.org/maven2/org/apache/maven/doxia/doxia-site-renderer/1.1.4/doxia-site-renderer-1.1.4.pom
5K downloaded  (doxia-site-renderer-1.1.4.pom)
Downloading: http://repo1.maven.org/maven2/org/apache/maven/doxia/doxia-sitetools/1.1.4/doxia-sitetools-1.1.4.pom
15K downloaded  (doxia-sitetools-1.1.4.pom)
Downloading: http://repo1.maven.org/maven2/org/apache/maven/doxia/doxia-core/1.1.4/doxia-core-1.1.4.pom
3K downloaded  (doxia-core-1.1.4.pom)
Downloading: http://repo1.maven.org/maven2/org/apache/maven/doxia/doxia-decoration-model/1.1.4/doxia-decoration-model-1.1.4.pom
2K downloaded  (doxia-decoration-model-1.1.4.pom)
Downloading: http://repo1.maven.org/maven2/org/apache/maven/doxia/doxia-module-xhtml/1.1.4/doxia-module-xhtml-1.1.4.pom
1K downloaded  (doxia-module-xhtml-1.1.4.pom)
Downloading: http://repo1.maven.org/maven2/org/apache/maven/doxia/doxia-modules/1.1.4/doxia-modules-1.1.4.pom
2K downloaded  (doxia-modules-1.1.4.pom)
Downloading: http://repo1.maven.org/maven2/org/apache/maven/doxia/doxia-module-fml/1.1.4/doxia-module-fml-1.1.4.pom
5K downloaded  (doxia-module-fml-1.1.4.pom)
Downloading: http://repo1.maven.org/maven2/org/codehaus/plexus/plexus-utils/3.0.1/plexus-utils-3.0.1.pom
2K downloaded  (plexus-utils-3.0.1.pom)
Downloading: http://repo1.maven.org/maven2/org/apache/maven/doxia/doxia-core/1.1.2/doxia-core-1.1.2.jar
Downloading: http://repo1.maven.org/maven2/xerces/xercesImpl/2.8.1/xercesImpl-2.8.1.jar
Downloading: http://repo1.maven.org/maven2/org/codehaus/plexus/plexus-utils/3.0.1/plexus-utils-3.0.1.jar
Downloading: http://repo1.maven.org/maven2/org/ow2/asm/asm-tree/4.0/asm-tree-4.0.jar
Downloading: http://repo1.maven.org/maven2/commons-httpclient/commons-httpclient/3.1/commons-httpclient-3.1.jar
21K downloaded  (asm-tree-4.0.jar)
Downloading: http://repo1.maven.org/maven2/org/codehaus/groovy/groovy/2.0.1/groovy-2.0.1.jar
154K downloaded  (doxia-core-1.1.2.jar)
Downloading: http://repo1.maven.org/maven2/commons-collections/commons-collections/3.2/commons-collections-3.2.jar
221K downloaded  (plexus-utils-3.0.1.jar)
Downloading: http://repo1.maven.org/maven2/org/apache/maven/shared/maven-script-interpreter/1.1/maven-script-interpreter-1.1.jar
297K downloaded  (commons-httpclient-3.1.jar)
20K downloaded  (maven-script-interpreter-1.1.jar)
Downloading: http://repo1.maven.org/maven2/org/ow2/asm/asm/4.0/asm-4.0.jar
Downloading: http://repo1.maven.org/maven2/org/apache/maven/doxia/doxia-site-renderer/1.1.4/doxia-site-renderer-1.1.4.jar
44K downloaded  (asm-4.0.jar)
49K downloaded  (doxia-site-renderer-1.1.4.jar)
557K downloaded  (commons-collections-3.2.jar)
Downloading: http://repo1.maven.org/maven2/org/ow2/asm/asm-commons/4.0/asm-commons-4.0.jar
Downloading: http://repo1.maven.org/maven2/org/apache/maven/doxia/doxia-decoration-model/1.1.4/doxia-decoration-model-1.1.4.jar
36K downloaded  (asm-commons-4.0.jar)
51K downloaded  (doxia-decoration-model-1.1.4.jar)
Downloading: http://repo1.maven.org/maven2/org/ow2/asm/asm-util/4.0/asm-util-4.0.jar
Downloading: http://repo1.maven.org/maven2/org/apache/maven/doxia/doxia-module-xhtml/1.1.4/doxia-module-xhtml-1.1.4.jar
36K downloaded  (asm-util-4.0.jar)
14K downloaded  (doxia-module-xhtml-1.1.4.jar)
1184K downloaded  (xercesImpl-2.8.1.jar)
Downloading: http://repo1.maven.org/maven2/org/ow2/asm/asm-analysis/4.0/asm-analysis-4.0.jar
Downloading: http://repo1.maven.org/maven2/org/apache/maven/doxia/doxia-module-fml/1.1.4/doxia-module-fml-1.1.4.jar
19K downloaded  (asm-analysis-4.0.jar)
36K downloaded  (doxia-module-fml-1.1.4.jar)
3193K downloaded  (groovy-2.0.1.jar)
[INFO] [invoker:install {execution: integration-test}]
[INFO] Installing /home/jenkins/jenkins-slave/workspace/maven-archetype-m2/archetype-models/archetype-catalog/pom.xml
to <https://builds.apache.org/job/maven-archetype-m2/org.apache.maven.plugins$maven-archetype-plugin/ws/target/local-repo/org/apache/maven/archetype/archetype-catalog/2.3-SNAPSHOT/archetype-catalog-2.3-SNAPSHOT.pom>
[INFO] Installing /home/jenkins/jenkins-slave/workspace/maven-archetype-m2/archetype-models/archetype-catalog/target/archetype-catalog-2.3-SNAPSHOT.jar
to <https://builds.apache.org/job/maven-archetype-m2/org.apache.maven.plugins$maven-archetype-plugin/ws/target/local-repo/org/apache/maven/archetype/archetype-catalog/2.3-SNAPSHOT/archetype-catalog-2.3-SNAPSHOT.jar>
[INFO] Installing /home/jenkins/jenkins-slave/workspace/maven-archetype-m2/archetype-models/pom.xml
to <https://builds.apache.org/job/maven-archetype-m2/org.apache.maven.plugins$maven-archetype-plugin/ws/target/local-repo/org/apache/maven/archetype/archetype-models/2.3-SNAPSHOT/archetype-models-2.3-SNAPSHOT.pom>
[INFO] Installing /home/jenkins/jenkins-slave/workspace/maven-archetype-m2/pom.xml to <https://builds.apache.org/job/maven-archetype-m2/org.apache.maven.plugins$maven-archetype-plugin/ws/target/local-repo/org/apache/maven/archetype/maven-archetype/2.3-SNAPSHOT/maven-archetype-2.3-SNAPSHOT.pom>
[INFO] Installing /home/jenkins/jenkins-slave/workspace/maven-archetype-m2/archetype-models/archetype-descriptor/pom.xml
to <https://builds.apache.org/job/maven-archetype-m2/org.apache.maven.plugins$maven-archetype-plugin/ws/target/local-repo/org/apache/maven/archetype/archetype-descriptor/2.3-SNAPSHOT/archetype-descriptor-2.3-SNAPSHOT.pom>
[INFO] Installing /home/jenkins/jenkins-slave/workspace/maven-archetype-m2/archetype-models/archetype-descriptor/target/archetype-descriptor-2.3-SNAPSHOT.jar
to <https://builds.apache.org/job/maven-archetype-m2/org.apache.maven.plugins$maven-archetype-plugin/ws/target/local-repo/org/apache/maven/archetype/archetype-descriptor/2.3-SNAPSHOT/archetype-descriptor-2.3-SNAPSHOT.jar>
[INFO] Installing /home/jenkins/jenkins-slave/workspace/maven-archetype-m2/archetype-models/archetype-registry/pom.xml
to <https://builds.apache.org/job/maven-archetype-m2/org.apache.maven.plugins$maven-archetype-plugin/ws/target/local-repo/org/apache/maven/archetype/archetype-registry/2.3-SNAPSHOT/archetype-registry-2.3-SNAPSHOT.pom>
[INFO] Installing /home/jenkins/jenkins-slave/workspace/maven-archetype-m2/archetype-models/archetype-registry/target/archetype-registry-2.3-SNAPSHOT.jar
to <https://builds.apache.org/job/maven-archetype-m2/org.apache.maven.plugins$maven-archetype-plugin/ws/target/local-repo/org/apache/maven/archetype/archetype-registry/2.3-SNAPSHOT/archetype-registry-2.3-SNAPSHOT.jar>
[INFO] Installing /home/jenkins/jenkins-slave/workspace/maven-archetype-m2/archetype-common/pom.xml
to <https://builds.apache.org/job/maven-archetype-m2/org.apache.maven.plugins$maven-archetype-plugin/ws/target/local-repo/org/apache/maven/archetype/archetype-common/2.3-SNAPSHOT/archetype-common-2.3-SNAPSHOT.pom>
[INFO] Installing /home/jenkins/jenkins-slave/workspace/maven-archetype-m2/archetype-common/target/archetype-common-2.3-SNAPSHOT.jar
to <https://builds.apache.org/job/maven-archetype-m2/org.apache.maven.plugins$maven-archetype-plugin/ws/target/local-repo/org/apache/maven/archetype/archetype-common/2.3-SNAPSHOT/archetype-common-2.3-SNAPSHOT.jar>
[INFO] Installing <https://builds.apache.org/job/maven-archetype-m2/org.apache.maven.plugins$maven-archetype-plugin/ws/pom.xml>
to <https://builds.apache.org/job/maven-archetype-m2/org.apache.maven.plugins$maven-archetype-plugin/ws/target/local-repo/org/apache/maven/plugins/maven-archetype-plugin/2.3-SNAPSHOT/maven-archetype-plugin-2.3-SNAPSHOT.pom>
[INFO] Installing <https://builds.apache.org/job/maven-archetype-m2/org.apache.maven.plugins$maven-archetype-plugin/ws/target/maven-archetype-plugin-2.3-SNAPSHOT.jar>
to <https://builds.apache.org/job/maven-archetype-m2/org.apache.maven.plugins$maven-archetype-plugin/ws/target/local-repo/org/apache/maven/plugins/maven-archetype-plugin/2.3-SNAPSHOT/maven-archetype-plugin-2.3-SNAPSHOT.jar>
[INFO] [invoker:run {execution: integration-test}]
[INFO] Building: build-archetype/pom.xml
[INFO] ..FAILED (15.0 s)
[INFO]   The build exited with code 1. See <https://builds.apache.org/job/maven-archetype-m2/org.apache.maven.plugins$maven-archetype-plugin/ws/target/it/build-archetype/build.log>
for details.
[INFO] Building: create-from-project/pom.xml
[INFO] run script verify.bsh
[INFO] ..SUCCESS (3.6 s)
[INFO] Building: property-setting-cli/pom.xml
[INFO] ..SUCCESS (3.7 s)
[INFO] Building: generate-basic
[INFO] run script setup.groovy
[INFO] run script verify.bsh
[INFO] ..SUCCESS (4.5 s)
[INFO] -------------------------------------------------
[INFO] Build Summary:
[INFO]   Passed: 3, Failed: 1, Errors: 0, Skipped: 0
[INFO] -------------------------------------------------
[ERROR] The following builds failed:
[ERROR] *  build-archetype/pom.xml
[INFO] -------------------------------------------------
[INFO] 
[INFO] 
[INFO] ------------------------------------------------------------------------
[INFO] Reactor Summary:
[INFO] ------------------------------------------------------------------------
[INFO] Maven Archetype ....................................... SUCCESS [37.095s]
[INFO] Maven Archetype Testing ............................... SUCCESS [0.612s]
[INFO] Maven Archetype Webapp Proxy .......................... SUCCESS [7.772s]
[INFO] Maven Archetype Webapp Repository ..................... SUCCESS [0.833s]
[INFO] Maven Archetype Models ................................ SUCCESS [0.610s]
[INFO] Maven Archetype Catalog Model ......................... SUCCESS [5.537s]
[INFO] Maven Archetype Descriptor Model ...................... SUCCESS [0.963s]
[INFO] Maven Archetype Registry Model ........................ SUCCESS [0.819s]
[INFO] Maven Archetype Common ................................ SUCCESS [38.648s]
[INFO] Maven Archetype Packaging ............................. SUCCESS [0.790s]
[INFO] Maven Archetype Plugin ................................ FAILED [43.943s]
[INFO] ------------------------------------------------------------------------
[INFO] Error for project: Maven Archetype Plugin (during install)
[INFO] ------------------------------------------------------------------------
[INFO] 1 build failed. See console output above for details.
[INFO] ------------------------------------------------------------------------
[INFO] Trace
org.apache.maven.BuildFailureException: 1 build failed. See console output above for details.
	at org.apache.maven.lifecycle.DefaultLifecycleExecutor.executeGoals(DefaultLifecycleExecutor.java:715)
	at org.apache.maven.lifecycle.DefaultLifecycleExecutor.executeGoalWithLifecycle(DefaultLifecycleExecutor.java:556)
	at org.apache.maven.lifecycle.DefaultLifecycleExecutor.executeGoal(DefaultLifecycleExecutor.java:535)
	at org.apache.maven.lifecycle.DefaultLifecycleExecutor.executeGoalAndHandleFailures(DefaultLifecycleExecutor.java:387)
	at org.apache.maven.lifecycle.DefaultLifecycleExecutor.executeTaskSegments(DefaultLifecycleExecutor.java:348)
	at org.apache.maven.lifecycle.DefaultLifecycleExecutor.execute(DefaultLifecycleExecutor.java:180)
	at org.apache.maven.lifecycle.LifecycleExecutorInterceptor.execute(LifecycleExecutorInterceptor.java:65)
	at org.apache.maven.DefaultMaven.doExecute(DefaultMaven.java:328)
	at org.apache.maven.DefaultMaven.execute(DefaultMaven.java:138)
	at org.apache.maven.cli.MavenCli.main(MavenCli.java:362)
	at sun.reflect.NativeMethodAccessorImpl.invoke0(Native Method)
	at sun.reflect.NativeMethodAccessorImpl.invoke(NativeMethodAccessorImpl.java:39)
	at sun.reflect.DelegatingMethodAccessorImpl.invoke(DelegatingMethodAccessorImpl.java:25)
	at java.lang.reflect.Method.invoke(Method.java:597)
	at org.codehaus.classworlds.Launcher.launchEnhanced(Launcher.java:315)
	at org.codehaus.classworlds.Launcher.launch(Launcher.java:255)
	at hudson.maven.agent.Main.launch(Main.java:205)
	at hudson.maven.MavenBuilder.call(MavenBuilder.java:154)
	at hudson.maven.Maven2Builder.call(Maven2Builder.java:79)
	at hudson.maven.Maven2Builder.call(Maven2Builder.java:55)
	at hudson.remoting.UserRequest.perform(UserRequest.java:118)
	at hudson.remoting.UserRequest.perform(UserRequest.java:48)
	at hudson.remoting.Request$2.run(Request.java:328)
	at hudson.remoting.InterceptingExecutorService$1.call(InterceptingExecutorService.java:72)
	at java.util.concurrent.FutureTask$Sync.innerRun(FutureTask.java:303)
	at java.util.concurrent.FutureTask.run(FutureTask.java:138)
	at java.util.concurrent.ThreadPoolExecutor$Worker.runTask(ThreadPoolExecutor.java:895)
	at java.util.concurrent.ThreadPoolExecutor$Worker.run(ThreadPoolExecutor.java:918)
	at java.lang.Thread.run(Thread.java:662)
Caused by: org.apache.maven.plugin.MojoFailureException: 1 build failed. See console output
above for details.
	at org.apache.maven.plugin.invoker.InvokerSession.handleFailures(InvokerSession.java:258)
	at org.apache.maven.plugin.invoker.InvokerMojo.processResults(InvokerMojo.java:61)
	at org.apache.maven.plugin.invoker.AbstractInvokerMojo.execute(AbstractInvokerMojo.java:672)
	at org.apache.maven.plugin.DefaultPluginManager.executeMojo(DefaultPluginManager.java:490)
	at hudson.maven.agent.PluginManagerInterceptor.executeMojo(PluginManagerInterceptor.java:182)
	at org.apache.maven.lifecycle.DefaultLifecycleExecutor.executeGoals(DefaultLifecycleExecutor.java:694)
	... 28 more
[INFO] ------------------------------------------------------------------------
[INFO] BUILD ERRORS
[INFO] ------------------------------------------------------------------------
[INFO] Total time: 2 minutes 25 seconds
[INFO] Finished at: Thu Feb 12 23:08:44 UTC 2015
[INFO] Final Memory: 107M/829M
[INFO] ------------------------------------------------------------------------

Mime
View raw message