maven-notifications mailing list archives

Site index · List index
Message view « Date » · « Thread »
Top « Date » · « Thread »
From Apache Jenkins Server <jenk...@builds.apache.org>
Subject Build failed in Jenkins: core-it-maven-3-win #954
Date Mon, 06 Jul 2015 18:34:12 GMT
See <https://builds.apache.org/job/core-it-maven-3-win/954/changes>

Changes:

[khmarbaise] [MNG-5816] Empy maven.config cause Maven to exit with failure

------------------------------------------
[...truncated 7282 lines...]
[INFO] 
[INFO] --- maven-remote-resources-plugin:1.5:process (default) @ maven-it-plugin-invalid-descriptor
---
[INFO] 
[INFO] --- maven-resources-plugin:2.6:resources (default-resources) @ maven-it-plugin-invalid-descriptor
---
[INFO] Using 'UTF-8' encoding to copy filtered resources.
[INFO] Copying 1 resource
[INFO] Copying 3 resources
[INFO] 
[INFO] --- maven-compiler-plugin:3.1:compile (default-compile) @ maven-it-plugin-invalid-descriptor
---
[INFO] Changes detected - recompiling the module!
[INFO] Compiling 1 source file to F:\ws\m3-its\core-integration-testing-trunk\core-it-support\core-it-plugins\maven-it-plugin-invalid-descriptor\target\classes
[INFO] 
[INFO] --- maven-resources-plugin:2.6:testResources (default-testResources) @ maven-it-plugin-invalid-descriptor
---
[INFO] Using 'UTF-8' encoding to copy filtered resources.
[INFO] skip non existing resourceDirectory F:\ws\m3-its\core-integration-testing-trunk\core-it-support\core-it-plugins\maven-it-plugin-invalid-descriptor\src\test\resources
[INFO] Copying 3 resources
[INFO] 
[INFO] --- maven-compiler-plugin:3.1:testCompile (default-testCompile) @ maven-it-plugin-invalid-descriptor
---
[INFO] No sources to compile
[INFO] 
[INFO] --- maven-surefire-plugin:2.17:test (default-test) @ maven-it-plugin-invalid-descriptor
---
[INFO] 
[INFO] --- maven-resources-plugin:2.6:copy-resources (copy-resources) @ maven-it-plugin-invalid-descriptor
---
[INFO] Using 'UTF-8' encoding to copy filtered resources.
[INFO] Copying 1 resource
[INFO] 
[INFO] --- maven-jar-plugin:2.5:jar (default-jar) @ maven-it-plugin-invalid-descriptor ---
[INFO] Building jar: F:\ws\m3-its\core-integration-testing-trunk\core-it-support\core-it-plugins\maven-it-plugin-invalid-descriptor\target\maven-it-plugin-invalid-descriptor-2.1-SNAPSHOT.jar
[INFO] 
[INFO] --- maven-plugin-plugin:3.3:addPluginArtifactMetadata (default-addPluginArtifactMetadata)
@ maven-it-plugin-invalid-descriptor ---
[INFO] 
[INFO] --- maven-site-plugin:3.4:attach-descriptor (attach-descriptor) @ maven-it-plugin-invalid-descriptor
---
[INFO] 
[INFO] --- maven-checkstyle-plugin:2.13:check (checkstyle-check) @ maven-it-plugin-invalid-descriptor
---
[INFO] 
[INFO] 
[INFO] --- maven-install-plugin:2.5.2:install (default-install) @ maven-it-plugin-invalid-descriptor
---
[INFO] Installing F:\ws\m3-its\core-integration-testing-trunk\core-it-support\core-it-plugins\maven-it-plugin-invalid-descriptor\target\maven-it-plugin-invalid-descriptor-2.1-SNAPSHOT.jar
to <https://builds.apache.org/job/core-it-maven-3-win/ws/it-local-repo\org\apache\maven\its\plugins\maven-it-plugin-invalid-descriptor\2.1-SNAPSHOT\maven-it-plugin-invalid-descriptor-2.1-SNAPSHOT.jar>
[INFO] Installing F:\ws\m3-its\core-integration-testing-trunk\core-it-support\core-it-plugins\maven-it-plugin-invalid-descriptor\pom.xml
to <https://builds.apache.org/job/core-it-maven-3-win/ws/it-local-repo\org\apache\maven\its\plugins\maven-it-plugin-invalid-descriptor\2.1-SNAPSHOT\maven-it-plugin-invalid-descriptor-2.1-SNAPSHOT.pom>
[INFO]                                                                         
[INFO] ------------------------------------------------------------------------
[INFO] Building Maven IT Plugin :: Log File 2.1-SNAPSHOT
[INFO] ------------------------------------------------------------------------
[INFO] 
[INFO] --- maven-clean-plugin:2.5:clean (default-clean) @ maven-it-plugin-log-file ---
[INFO] Deleting F:\ws\m3-its\core-integration-testing-trunk\core-it-support\core-it-plugins\maven-it-plugin-log-file\target
[INFO] 
[INFO] --- maven-enforcer-plugin:1.3.1:enforce (enforce-bytecode-version) @ maven-it-plugin-log-file
---
[INFO] 
[INFO] --- maven-enforcer-plugin:1.3.1:enforce (ban-known-bad-maven-versions) @ maven-it-plugin-log-file
---
[INFO] 
[INFO] --- apache-rat-plugin:0.11:check (rat-check) @ maven-it-plugin-log-file ---
[INFO] 51 implicit excludes (use -debug for more details).
[INFO] Exclude: DEPENDENCIES
[INFO] 6 resources included (use -debug for more details)
[INFO] Rat check: Summary of files. Unapproved: 0 unknown: 0 generated: 0 approved: 6 licence.
[INFO] 
[INFO] --- maven-plugin-plugin:3.3:descriptor (default-descriptor) @ maven-it-plugin-log-file
---
[INFO] Using 'UTF-8' encoding to read mojo metadata.
[INFO] Applying mojo extractor for language: java-annotations
[INFO] Mojo extractor for language: java-annotations found 0 mojo descriptors.
[INFO] Applying mojo extractor for language: java
[INFO] Mojo extractor for language: java found 3 mojo descriptors.
[INFO] Applying mojo extractor for language: bsh
[INFO] Mojo extractor for language: bsh found 0 mojo descriptors.
[INFO] 
[INFO] --- maven-remote-resources-plugin:1.5:process (default) @ maven-it-plugin-log-file
---
[INFO] 
[INFO] --- maven-resources-plugin:2.6:resources (default-resources) @ maven-it-plugin-log-file
---
[INFO] Using 'UTF-8' encoding to copy filtered resources.
[INFO] skip non existing resourceDirectory F:\ws\m3-its\core-integration-testing-trunk\core-it-support\core-it-plugins\maven-it-plugin-log-file\src\main\resources
[INFO] Copying 3 resources
[INFO] 
[INFO] --- maven-compiler-plugin:3.1:compile (default-compile) @ maven-it-plugin-log-file
---
[INFO] Changes detected - recompiling the module!
[INFO] Compiling 4 source files to F:\ws\m3-its\core-integration-testing-trunk\core-it-support\core-it-plugins\maven-it-plugin-log-file\target\classes
[INFO] 
[INFO] --- maven-resources-plugin:2.6:testResources (default-testResources) @ maven-it-plugin-log-file
---
[INFO] Not copying test resources
[INFO] 
[INFO] --- maven-compiler-plugin:3.1:testCompile (default-testCompile) @ maven-it-plugin-log-file
---
[INFO] Not compiling test sources
[INFO] 
[INFO] --- maven-surefire-plugin:2.17:test (default-test) @ maven-it-plugin-log-file ---
[INFO] Tests are skipped.
[INFO] 
[INFO] --- maven-jar-plugin:2.5:jar (default-jar) @ maven-it-plugin-log-file ---
[INFO] Building jar: F:\ws\m3-its\core-integration-testing-trunk\core-it-support\core-it-plugins\maven-it-plugin-log-file\target\maven-it-plugin-log-file-2.1-SNAPSHOT.jar
[INFO] 
[INFO] --- maven-plugin-plugin:3.3:addPluginArtifactMetadata (default-addPluginArtifactMetadata)
@ maven-it-plugin-log-file ---
[INFO] 
[INFO] --- maven-site-plugin:3.4:attach-descriptor (attach-descriptor) @ maven-it-plugin-log-file
---
[INFO] 
[INFO] --- maven-checkstyle-plugin:2.13:check (checkstyle-check) @ maven-it-plugin-log-file
---
[INFO] 
[INFO] 
[INFO] --- maven-install-plugin:2.5.2:install (default-install) @ maven-it-plugin-log-file
---
[INFO] Installing F:\ws\m3-its\core-integration-testing-trunk\core-it-support\core-it-plugins\maven-it-plugin-log-file\target\maven-it-plugin-log-file-2.1-SNAPSHOT.jar
to <https://builds.apache.org/job/core-it-maven-3-win/ws/it-local-repo\org\apache\maven\its\plugins\maven-it-plugin-log-file\2.1-SNAPSHOT\maven-it-plugin-log-file-2.1-SNAPSHOT.jar>
[INFO] Installing F:\ws\m3-its\core-integration-testing-trunk\core-it-support\core-it-plugins\maven-it-plugin-log-file\pom.xml
to <https://builds.apache.org/job/core-it-maven-3-win/ws/it-local-repo\org\apache\maven\its\plugins\maven-it-plugin-log-file\2.1-SNAPSHOT\maven-it-plugin-log-file-2.1-SNAPSHOT.pom>
[INFO]                                                                         
[INFO] ------------------------------------------------------------------------
[INFO] Building Maven IT Helper Library 2.1-SNAPSHOT
[INFO] ------------------------------------------------------------------------
Downloading: http://repository.apache.org/snapshots/org/apache/maven/shared/maven-verifier/1.6-SNAPSHOT/maven-metadata.xml
Downloading: http://repository.apache.org/snapshots/org/apache/maven/shared/maven-verifier/1.6-SNAPSHOT/maven-verifier-1.6-SNAPSHOT.pom
[WARNING] The POM for org.apache.maven.shared:maven-verifier:jar:1.6-SNAPSHOT is missing,
no dependency information available
Downloading: http://repo.maven.apache.org/maven2/org/apache/maven/maven-artifact/2.0.5/maven-artifact-2.0.5.jar
Downloaded: http://repo.maven.apache.org/maven2/org/apache/maven/maven-artifact/2.0.5/maven-artifact-2.0.5.jar
(84 KB at 1042.9 KB/sec)
Downloading: http://repository.apache.org/snapshots/org/apache/maven/shared/maven-verifier/1.6-SNAPSHOT/maven-verifier-1.6-SNAPSHOT.jar
[INFO] ------------------------------------------------------------------------
[INFO] Reactor Summary:
[INFO] 
[INFO] Maven Core ITs .................................... SUCCESS [59.298s]
[INFO] Maven IT Support .................................. SUCCESS [1.591s]
[INFO] Maven IT :: Plugins ............................... SUCCESS [0.824s]
[INFO] Maven IT Plugin :: Active Collection .............. SUCCESS [12.245s]
[INFO] Maven IT Plugin :: Ant-Based ...................... SUCCESS [7.378s]
[INFO] Maven IT Plugin :: Artifact ....................... SUCCESS [3.316s]
[INFO] Maven IT Plugin :: Class Loader :: Dependency A ... SUCCESS [0.567s]
[INFO] Maven IT Plugin :: Class Loader :: Dependency B ... SUCCESS [0.878s]
[INFO] Maven IT Plugin :: Class Loader :: Dependency C ... SUCCESS [0.530s]
[INFO] Maven IT Plugin :: Class Loader ................... SUCCESS [2.569s]
[INFO] Maven IT Plugin :: Class Loader :: Aggregator ..... SUCCESS [0.444s]
[INFO] Maven IT Plugin :: Configuration .................. SUCCESS [1.604s]
[INFO] Maven IT Plugin :: Context Passing ................ SUCCESS [0.815s]
[INFO] Maven ITs :: Core Plugin Stubs .................... SUCCESS [0.470s]
[INFO] Maven IT Clean Plugin Stub ........................ SUCCESS [0.823s]
[INFO] Maven IT Compiler Plugin Stub ..................... SUCCESS [1.008s]
[INFO] Maven IT Deploy Plugin Stub ....................... SUCCESS [1.150s]
[INFO] Maven IT EAR Plugin Stub .......................... SUCCESS [0.753s]
[INFO] Maven IT EJB Plugin Stub .......................... SUCCESS [0.642s]
[INFO] Maven IT Install Plugin Stub ...................... SUCCESS [0.760s]
[INFO] Maven IT JAR Plugin Stub .......................... SUCCESS [0.785s]
[INFO] Maven IT Javadoc Plugin Stub ...................... SUCCESS [0.677s]
[INFO] Maven IT Plugin Plugin Stub ....................... SUCCESS [0.967s]
[INFO] Maven IT RAR Plugin Stub .......................... SUCCESS [0.703s]
[INFO] Maven IT Resources Plugin Stub .................... SUCCESS [0.799s]
[INFO] Maven IT Site Plugin Stub ......................... SUCCESS [0.866s]
[INFO] Maven IT Source Plugin Stub ....................... SUCCESS [0.644s]
[INFO] Maven IT Surefire Plugin Stub ..................... SUCCESS [0.743s]
[INFO] Maven IT WAR Plugin Stub .......................... SUCCESS [0.697s]
[INFO] Maven IT Plugin :: Dependency Collection .......... SUCCESS [1.444s]
[INFO] Maven IT Plugin :: Dependency Resolution .......... SUCCESS [8.039s]
[INFO] Maven IT Plugin :: Expression ..................... SUCCESS [2.055s]
[INFO] Maven IT Plugin :: Error Mojos .................... SUCCESS [3.556s]
[INFO] Maven IT Component ................................ SUCCESS [0.462s]
[INFO] Maven IT Plugin :: Extension Consumer ............. SUCCESS [0.662s]
[INFO] Maven IT Plugin :: Extension Provider ............. SUCCESS [0.550s]
[INFO] Maven IT Plugin :: Fork ........................... SUCCESS [1.394s]
[INFO] Maven IT Plugin :: Invalid Descriptor ............. SUCCESS [0.521s]
[INFO] Maven IT Plugin :: Log File ....................... SUCCESS [0.682s]
[INFO] Maven IT Helper Library ........................... FAILURE [2.532s]
[INFO] Maven IT Plugin :: Model Interpolation ............ SKIPPED
[INFO] Maven IT Plugin :: No Default Component ........... SKIPPED
[INFO] Maven IT Plugin :: No Project ..................... SKIPPED
[INFO] Maven IT Plugin :: Online ......................... SKIPPED
[INFO] Maven IT Plugin :: Optional Mojos ................. SKIPPED
[INFO] Maven IT Plugin :: Packaging ...................... SKIPPED
[INFO] Maven IT Plugin :: Parameter Implementation ....... SKIPPED
[INFO] Maven IT Plugin :: Plugin Dependency .............. SKIPPED
[INFO] Maven IT Plugin :: Project ........................ SKIPPED
[INFO] Maven IT Plugin :: Project Interpolation .......... SKIPPED
[INFO] Maven IT Plugin :: Setter ......................... SKIPPED
[INFO] Maven IT Plugin :: Singleton Component ............ SKIPPED
[INFO] Maven IT Plugin :: Site ........................... SKIPPED
[INFO] Maven IT Plugin :: Toolchain ...................... SKIPPED
[INFO] Maven IT Plugin :: Touch .......................... SKIPPED
[INFO] Maven IT Plugin :: Uses Properties Plugin ......... SKIPPED
[INFO] Maven IT Plugin :: Uses Wagon Plugin .............. SKIPPED
[INFO] Maven IT Plugin :: This plugin should contain the mojos needed by all tests.  SKIPPED
[INFO] Maven IT Plugin :: Plexus Utils 1.1 ............... SKIPPED
[INFO] Maven IT Plugin :: Plexus Utils New ............... SKIPPED
[INFO] Maven IT Plugin :: Plexus Component API ........... SKIPPED
[INFO] Maven IT Plugin :: Log4J Client ................... SKIPPED
[INFO] Maven IT Plugin :: Extension 1 .................... SKIPPED
[INFO] Maven IT Plugin :: Extension 2 .................... SKIPPED
[INFO] Maven IT Plugin :: Plexus Lifecycle ............... SKIPPED
[INFO] Maven IT Plugin :: Settings ....................... SKIPPED
[INFO] Maven IT Plugin :: mng-5805 extension ............. SKIPPED
[INFO] Maven IT Plugin :: mng-5805 plugin ................ SKIPPED
[INFO] Maven IT Plugin :: mng-5805 plugin-dep ............ SKIPPED
[INFO] Maven IT Toolchain ................................ SKIPPED
[INFO] Maven IT Wagon .................................... SKIPPED
[INFO] Maven IT Support Artifacts ........................ SKIPPED
[INFO] Maven IT Extension ................................ SKIPPED
[INFO] Maven ITs ......................................... SKIPPED
[INFO] ------------------------------------------------------------------------
[INFO] BUILD FAILURE
[INFO] ------------------------------------------------------------------------
[INFO] Total time: 2:09.985s
[INFO] Finished at: Mon Jul 06 11:34:14 PDT 2015
[INFO] Final Memory: 52M/742M
[INFO] ------------------------------------------------------------------------
[ERROR] Failed to execute goal on project maven-it-helper: Could not resolve dependencies
for project org.apache.maven.its:maven-it-helper:jar:2.1-SNAPSHOT: Could not find artifact
org.apache.maven.shared:maven-verifier:jar:1.6-SNAPSHOT in apache.snapshots (http://repository.apache.org/snapshots)
-> [Help 1]
org.apache.maven.lifecycle.LifecycleExecutionException: Failed to execute goal on project
maven-it-helper: Could not resolve dependencies for project org.apache.maven.its:maven-it-helper:jar:2.1-SNAPSHOT:
Could not find artifact org.apache.maven.shared:maven-verifier:jar:1.6-SNAPSHOT in apache.snapshots
(http://repository.apache.org/snapshots)
	at org.apache.maven.lifecycle.internal.LifecycleDependencyResolver.getDependencies(LifecycleDependencyResolver.java:210)
	at org.apache.maven.lifecycle.internal.LifecycleDependencyResolver.resolveProjectDependencies(LifecycleDependencyResolver.java:117)
	at org.apache.maven.lifecycle.internal.MojoExecutor.ensureDependenciesAreResolved(MojoExecutor.java:258)
	at org.apache.maven.lifecycle.internal.MojoExecutor.execute(MojoExecutor.java:201)
	at org.apache.maven.lifecycle.internal.MojoExecutor.execute(MojoExecutor.java:153)
	at org.apache.maven.lifecycle.internal.MojoExecutor.execute(MojoExecutor.java:145)
	at org.apache.maven.lifecycle.internal.LifecycleModuleBuilder.buildProject(LifecycleModuleBuilder.java:84)
	at org.apache.maven.lifecycle.internal.LifecycleModuleBuilder.buildProject(LifecycleModuleBuilder.java:59)
	at org.apache.maven.lifecycle.internal.LifecycleStarter.singleThreadedBuild(LifecycleStarter.java:183)
	at org.apache.maven.lifecycle.internal.LifecycleStarter.execute(LifecycleStarter.java:161)
	at org.apache.maven.DefaultMaven.doExecute(DefaultMaven.java:320)
	at org.apache.maven.DefaultMaven.execute(DefaultMaven.java:156)
	at org.apache.maven.cli.MavenCli.execute(MavenCli.java:537)
	at org.apache.maven.cli.MavenCli.doMain(MavenCli.java:196)
	at org.apache.maven.cli.MavenCli.main(MavenCli.java:141)
	at sun.reflect.NativeMethodAccessorImpl.invoke0(Native Method)
	at sun.reflect.NativeMethodAccessorImpl.invoke(NativeMethodAccessorImpl.java:57)
	at sun.reflect.DelegatingMethodAccessorImpl.invoke(DelegatingMethodAccessorImpl.java:43)
	at java.lang.reflect.Method.invoke(Method.java:601)
	at org.codehaus.plexus.classworlds.launcher.Launcher.launchEnhanced(Launcher.java:290)
	at org.codehaus.plexus.classworlds.launcher.Launcher.launch(Launcher.java:230)
	at org.codehaus.plexus.classworlds.launcher.Launcher.mainWithExitCode(Launcher.java:409)
	at org.codehaus.plexus.classworlds.launcher.Launcher.main(Launcher.java:352)
Caused by: org.apache.maven.project.DependencyResolutionException: Could not resolve dependencies
for project org.apache.maven.its:maven-it-helper:jar:2.1-SNAPSHOT: Could not find artifact
org.apache.maven.shared:maven-verifier:jar:1.6-SNAPSHOT in apache.snapshots (http://repository.apache.org/snapshots)
	at org.apache.maven.project.DefaultProjectDependenciesResolver.resolve(DefaultProjectDependenciesResolver.java:189)
	at org.apache.maven.lifecycle.internal.LifecycleDependencyResolver.getDependencies(LifecycleDependencyResolver.java:185)
	... 22 more
Caused by: org.sonatype.aether.resolution.DependencyResolutionException: Could not find artifact
org.apache.maven.shared:maven-verifier:jar:1.6-SNAPSHOT in apache.snapshots (http://repository.apache.org/snapshots)
	at org.sonatype.aether.impl.internal.DefaultRepositorySystem.resolveDependencies(DefaultRepositorySystem.java:375)
	at org.apache.maven.project.DefaultProjectDependenciesResolver.resolve(DefaultProjectDependenciesResolver.java:183)
	... 23 more
Caused by: org.sonatype.aether.resolution.ArtifactResolutionException: Could not find artifact
org.apache.maven.shared:maven-verifier:jar:1.6-SNAPSHOT in apache.snapshots (http://repository.apache.org/snapshots)
	at org.sonatype.aether.impl.internal.DefaultArtifactResolver.resolve(DefaultArtifactResolver.java:538)
	at org.sonatype.aether.impl.internal.DefaultArtifactResolver.resolveArtifacts(DefaultArtifactResolver.java:216)
	at org.sonatype.aether.impl.internal.DefaultRepositorySystem.resolveDependencies(DefaultRepositorySystem.java:358)
	... 24 more
Caused by: org.sonatype.aether.transfer.ArtifactNotFoundException: Could not find artifact
org.apache.maven.shared:maven-verifier:jar:1.6-SNAPSHOT in apache.snapshots (http://repository.apache.org/snapshots)
	at org.sonatype.aether.connector.wagon.WagonRepositoryConnector$4.wrap(WagonRepositoryConnector.java:947)
	at org.sonatype.aether.connector.wagon.WagonRepositoryConnector$4.wrap(WagonRepositoryConnector.java:941)
	at org.sonatype.aether.connector.wagon.WagonRepositoryConnector$GetTask.run(WagonRepositoryConnector.java:669)
	at org.sonatype.aether.util.concurrency.RunnableErrorForwarder$1.run(RunnableErrorForwarder.java:60)
	at java.util.concurrent.ThreadPoolExecutor.runWorker(ThreadPoolExecutor.java:1110)
	at java.util.concurrent.ThreadPoolExecutor$Worker.run(ThreadPoolExecutor.java:603)
	at java.lang.Thread.run(Thread.java:722)
[ERROR] 
[ERROR] Re-run Maven using the -X switch to enable full debug logging.
[ERROR] 
[ERROR] For more information about the errors and possible solutions, please read the following
articles:
[ERROR] [Help 1] http://cwiki.apache.org/confluence/display/MAVEN/DependencyResolutionException
[ERROR] 
[ERROR] After correcting the problems, you can resume the build with the command
[ERROR]   mvn <goals> -rf :maven-it-helper
Build step 'Invoke top-level Maven targets' marked build as failure
Recording test results

Mime
View raw message