maven-notifications mailing list archives

Site index · List index
Message view « Date » · « Thread »
Top « Date » · « Thread »
From Apache Jenkins Server <jenk...@builds.apache.org>
Subject Build failed in Jenkins: maven-plugins » Apache Maven Dependency Plugin #4096
Date Mon, 06 Jul 2015 20:38:45 GMT
See <https://builds.apache.org/job/maven-plugins/org.apache.maven.plugins$maven-dependency-plugin/4096/>

------------------------------------------
[INFO]                                                                         
[INFO] ------------------------------------------------------------------------
[INFO] Building Apache Maven Dependency Plugin 2.11-SNAPSHOT
[INFO] ------------------------------------------------------------------------
[INFO] Downloading: http://repo.maven.apache.org/maven2/org/apache/maven/shared/maven-dependency-analyzer/1.6/maven-dependency-analyzer-1.6.pom
[INFO] Downloaded: http://repo.maven.apache.org/maven2/org/apache/maven/shared/maven-dependency-analyzer/1.6/maven-dependency-analyzer-1.6.pom
(6 KB at 591.0 KB/sec)
[INFO] Downloading: http://repository.apache.org/snapshots/org/apache/maven/shared/maven-dependency-tree/3.0-SNAPSHOT/maven-metadata.xml
[INFO] Downloaded: http://repository.apache.org/snapshots/org/apache/maven/shared/maven-dependency-tree/3.0-SNAPSHOT/maven-metadata.xml
(791 B at 2.5 KB/sec)
[INFO] Downloading: http://repository.apache.org/snapshots/org/apache/maven/shared/maven-dependency-tree/3.0-SNAPSHOT/maven-dependency-tree-3.0-20150706.193234-16.pom
[INFO] Downloaded: http://repository.apache.org/snapshots/org/apache/maven/shared/maven-dependency-tree/3.0-SNAPSHOT/maven-dependency-tree-3.0-20150706.193234-16.pom
(8 KB at 23.8 KB/sec)
[INFO] Downloading: http://repository.apache.org/snapshots/org/apache/maven/shared/maven-common-artifact-filters/3.0-SNAPSHOT/maven-metadata.xml
[INFO] Downloaded: http://repository.apache.org/snapshots/org/apache/maven/shared/maven-common-artifact-filters/3.0-SNAPSHOT/maven-metadata.xml
(799 B at 2.5 KB/sec)
[INFO] Downloading: http://repository.apache.org/snapshots/org/apache/maven/shared/maven-common-artifact-filters/3.0-SNAPSHOT/maven-common-artifact-filters-3.0-20150706.193232-16.pom
[INFO] Downloaded: http://repository.apache.org/snapshots/org/apache/maven/shared/maven-common-artifact-filters/3.0-SNAPSHOT/maven-common-artifact-filters-3.0-20150706.193232-16.pom
(5 KB at 14.4 KB/sec)
[INFO] Downloading: http://repository.apache.org/snapshots/org/apache/maven/shared/maven-artifact-transfer/3.0-SNAPSHOT/maven-metadata.xml
[INFO] Downloaded: http://repository.apache.org/snapshots/org/apache/maven/shared/maven-artifact-transfer/3.0-SNAPSHOT/maven-metadata.xml
(793 B at 2.1 KB/sec)
[INFO] Downloading: http://repository.apache.org/snapshots/org/apache/maven/shared/maven-artifact-transfer/3.0-SNAPSHOT/maven-artifact-transfer-3.0-20150706.193231-16.pom
[INFO] Downloaded: http://repository.apache.org/snapshots/org/apache/maven/shared/maven-artifact-transfer/3.0-SNAPSHOT/maven-artifact-transfer-3.0-20150706.193231-16.pom
(7 KB at 21.6 KB/sec)
[INFO] Downloading: http://repo.maven.apache.org/maven2/org/apache/maven/plugin-testing/maven-plugin-testing-tools/2.1/maven-plugin-testing-tools-2.1.pom
[INFO] Downloaded: http://repo.maven.apache.org/maven2/org/apache/maven/plugin-testing/maven-plugin-testing-tools/2.1/maven-plugin-testing-tools-2.1.pom
(4 KB at 458.7 KB/sec)
[INFO] Downloading: http://repo.maven.apache.org/maven2/org/apache/maven/plugin-testing/maven-plugin-testing/2.1/maven-plugin-testing-2.1.pom
[INFO] Downloaded: http://repo.maven.apache.org/maven2/org/apache/maven/plugin-testing/maven-plugin-testing/2.1/maven-plugin-testing-2.1.pom
(10 KB at 1090.1 KB/sec)
[INFO] Downloading: http://repo.maven.apache.org/maven2/org/apache/maven/plugin-testing/maven-plugin-testing-harness/2.1/maven-plugin-testing-harness-2.1.pom
[INFO] Downloaded: http://repo.maven.apache.org/maven2/org/apache/maven/plugin-testing/maven-plugin-testing-harness/2.1/maven-plugin-testing-harness-2.1.pom
(4 KB at 394.3 KB/sec)
[INFO] Downloading: http://repo.maven.apache.org/maven2/org/sonatype/aether/aether-connector-wagon/1.7/aether-connector-wagon-1.7.pom
[INFO] Downloaded: http://repo.maven.apache.org/maven2/org/sonatype/aether/aether-connector-wagon/1.7/aether-connector-wagon-1.7.pom
(4 KB at 386.5 KB/sec)
[INFO] Downloading: http://repo.maven.apache.org/maven2/org/apache/maven/plugin-testing/maven-plugin-testing-tools/2.1/maven-plugin-testing-tools-2.1.jar
[INFO] Downloading: http://repo.maven.apache.org/maven2/org/apache/maven/shared/maven-dependency-analyzer/1.6/maven-dependency-analyzer-1.6.jar
[INFO] Downloading: http://repo.maven.apache.org/maven2/org/apache/maven/plugin-testing/maven-plugin-testing-harness/2.1/maven-plugin-testing-harness-2.1.jar
[INFO] Downloading: http://repo.maven.apache.org/maven2/org/sonatype/aether/aether-connector-wagon/1.7/aether-connector-wagon-1.7.jar
[INFO] Downloaded: http://repo.maven.apache.org/maven2/org/apache/maven/shared/maven-dependency-analyzer/1.6/maven-dependency-analyzer-1.6.jar
(31 KB at 3845.8 KB/sec)
[INFO] Downloaded: http://repo.maven.apache.org/maven2/org/apache/maven/plugin-testing/maven-plugin-testing-tools/2.1/maven-plugin-testing-tools-2.1.jar
(28 KB at 3091.4 KB/sec)
[INFO] Downloaded: http://repo.maven.apache.org/maven2/org/apache/maven/plugin-testing/maven-plugin-testing-harness/2.1/maven-plugin-testing-harness-2.1.jar
(39 KB at 4224.7 KB/sec)
[INFO] Downloaded: http://repo.maven.apache.org/maven2/org/sonatype/aether/aether-connector-wagon/1.7/aether-connector-wagon-1.7.jar
(25 KB at 2429.3 KB/sec)
[INFO] Downloading: http://repository.apache.org/snapshots/org/apache/maven/shared/maven-dependency-tree/3.0-SNAPSHOT/maven-dependency-tree-3.0-20150706.193234-16.jar
[INFO] Downloading: http://repository.apache.org/snapshots/org/apache/maven/shared/maven-common-artifact-filters/3.0-SNAPSHOT/maven-common-artifact-filters-3.0-20150706.193232-16.jar
[INFO] Downloading: http://repository.apache.org/snapshots/org/apache/maven/shared/maven-artifact-transfer/3.0-SNAPSHOT/maven-artifact-transfer-3.0-20150706.193231-16.jar
[INFO] Downloaded: http://repository.apache.org/snapshots/org/apache/maven/shared/maven-dependency-tree/3.0-SNAPSHOT/maven-dependency-tree-3.0-20150706.193234-16.jar
(36 KB at 91.5 KB/sec)
[INFO] Downloaded: http://repository.apache.org/snapshots/org/apache/maven/shared/maven-common-artifact-filters/3.0-SNAPSHOT/maven-common-artifact-filters-3.0-20150706.193232-16.jar
(50 KB at 71.3 KB/sec)
[INFO] Downloaded: http://repository.apache.org/snapshots/org/apache/maven/shared/maven-artifact-transfer/3.0-SNAPSHOT/maven-artifact-transfer-3.0-20150706.193231-16.jar
(69 KB at 98.5 KB/sec)
[INFO] 
[INFO] --- maven-clean-plugin:2.5:clean (default-clean) @ maven-dependency-plugin ---
[INFO] 
[INFO] --- maven-enforcer-plugin:1.3.1:enforce (enforce-bytecode-version) @ maven-dependency-plugin
---
[INFO] Downloading: http://repo.maven.apache.org/maven2/org/apache/maven/maven-model/2.0.5/maven-model-2.0.5.jar
[INFO] Downloaded: http://repo.maven.apache.org/maven2/org/apache/maven/maven-model/2.0.5/maven-model-2.0.5.jar
(85 KB at 7037.3 KB/sec)
[INFO] Downloading: http://repo.maven.apache.org/maven2/org/apache/maven/maven-artifact/2.0.5/maven-artifact-2.0.5.jar
[INFO] Downloaded: http://repo.maven.apache.org/maven2/org/apache/maven/maven-artifact/2.0.5/maven-artifact-2.0.5.jar
(84 KB at 6418.0 KB/sec)
[INFO] 
[INFO] --- maven-enforcer-plugin:1.3.1:enforce (ban-known-bad-maven-versions) @ maven-dependency-plugin
---
[INFO] 
[INFO] --- maven-enforcer-plugin:1.3.1:enforce (ensure-no-container-api) @ maven-dependency-plugin
---
[INFO] 
[INFO] --- apache-rat-plugin:0.11:check (rat-check) @ maven-dependency-plugin ---
[INFO] 51 implicit excludes (use -debug for more details).
[INFO] Exclude: src/it/projects/tree/expected.txt
[INFO] Exclude: src/it/projects/tree-includes/expected.txt
[INFO] Exclude: src/it/projects/tree-verbose/expected.txt
[INFO] Exclude: DEPENDENCIES
[INFO] 285 resources included (use -debug for more details)
[INFO] Rat check: Summary of files. Unapproved: 0 unknown: 0 generated: 0 approved: 284 licence.
[INFO] 
[INFO] --- maven-plugin-plugin:3.3:helpmojo (generated-helpmojo) @ maven-dependency-plugin
---
[INFO] Using 'UTF-8' encoding to read mojo metadata.
[INFO] Applying mojo extractor for language: java-annotations
[INFO] Mojo extractor for language: java-annotations found 0 mojo descriptors.
[INFO] Applying mojo extractor for language: java
[INFO] Mojo extractor for language: java found 0 mojo descriptors.
[INFO] Applying mojo extractor for language: bsh
[INFO] Mojo extractor for language: bsh found 0 mojo descriptors.
[INFO] 
[INFO] --- maven-remote-resources-plugin:1.5:process (default) @ maven-dependency-plugin ---
[INFO] 
[INFO] --- maven-resources-plugin:2.6:resources (default-resources) @ maven-dependency-plugin
---
[INFO] Using 'UTF-8' encoding to copy filtered resources.
[INFO] Copying 6 resources
[INFO] Copying 3 resources
[INFO] 
[INFO] --- maven-compiler-plugin:3.1:compile (default-compile) @ maven-dependency-plugin ---
[INFO] Changes detected - recompiling the module!
[INFO] Compiling 50 source files to <https://builds.apache.org/job/maven-plugins/org.apache.maven.plugins$maven-dependency-plugin/ws/target/classes>
[INFO] -------------------------------------------------------------
[WARNING] COMPILATION WARNING : 
[INFO] -------------------------------------------------------------
[WARNING] Note: Some input files use or override a deprecated API.
[WARNING] Note: Recompile with -Xlint:deprecation for details.
[WARNING] Note: Some input files use unchecked or unsafe operations.
[WARNING] Note: Recompile with -Xlint:unchecked for details.
[INFO] 4 warnings 
[INFO] -------------------------------------------------------------
[INFO] -------------------------------------------------------------
[ERROR] COMPILATION ERROR : 
[INFO] -------------------------------------------------------------
[ERROR] <https://builds.apache.org/job/maven-plugins/org.apache.maven.plugins$maven-dependency-plugin/ws/src/main/java/org/apache/maven/plugin/dependency/fromDependencies/AbstractDependencyFilterMojo.java>:[372,77]
incompatible types
found   : org.apache.maven.shared.artifact.resolve.ArtifactResult
required: org.apache.maven.artifact.Artifact
[ERROR] <https://builds.apache.org/job/maven-plugins/org.apache.maven.plugins$maven-dependency-plugin/ws/src/main/java/org/apache/maven/plugin/dependency/fromConfiguration/AbstractFromConfigurationMojo.java>:[269,56]
incompatible types
found   : org.apache.maven.shared.artifact.resolve.ArtifactResult
required: org.apache.maven.artifact.Artifact
[ERROR] <https://builds.apache.org/job/maven-plugins/org.apache.maven.plugins$maven-dependency-plugin/ws/src/main/java/org/apache/maven/plugin/dependency/utils/resolvers/DefaultArtifactsResolver.java>:[69,52]
incompatible types
found   : org.apache.maven.shared.artifact.resolve.ArtifactResult
required: org.apache.maven.artifact.Artifact
[ERROR] <https://builds.apache.org/job/maven-plugins/org.apache.maven.plugins$maven-dependency-plugin/ws/src/main/java/org/apache/maven/plugin/dependency/fromDependencies/CopyDependenciesMojo.java>:[305,64]
incompatible types
found   : org.apache.maven.shared.artifact.resolve.ArtifactResult
required: org.apache.maven.artifact.Artifact
[INFO] 4 errors 
[INFO] -------------------------------------------------------------

Mime
View raw message