maven-notifications mailing list archives

Site index · List index
Message view « Date » · « Thread »
Top « Date » · « Thread »
From Apache Jenkins Server <jenk...@builds.apache.org>
Subject Build failed in Jenkins: dist-tool-plugin #915
Date Sat, 04 Jul 2015 10:22:35 GMT
See <https://builds.apache.org/job/dist-tool-plugin/915/>

------------------------------------------
[...truncated 2176 lines...]
     [java] Jul 04, 2015 10:21:26 AM java.util.prefs.FileSystemPreferences$1 run
     [java] INFO: Created user preferences directory.
     [java] Warnings generated: 12
[INFO] Done FindBugs Analysis....
[warn] [XHTML Sink] Modified invalid anchor name: 'org.apache.maven.dist.tools.DistCheckSiteMojo$CheckSiteResult'
to 'org.apache.maven.dist.tools.DistCheckSiteMojoCheckSiteResult'
[INFO] Generating "Sonar" report                --- maven-report:0.1:report
[INFO] Generating "Dist Tool> Check Sites" report --- dist-tool-plugin:1.0-SNAPSHOT:check-site
Downloading: https://repo.maven.apache.org/maven2/org/apache/maven/maven-ant-tasks/2.1.3/maven-ant-tasks-2.1.3.pom
Downloaded: https://repo.maven.apache.org/maven2/org/apache/maven/maven-ant-tasks/2.1.3/maven-ant-tasks-2.1.3.pom
(13 KB at 120.0 KB/sec)
Downloading: https://repo.maven.apache.org/maven2/org/apache/maven/archetype/maven-archetype/2.3/maven-archetype-2.3.pom
Downloaded: https://repo.maven.apache.org/maven2/org/apache/maven/archetype/maven-archetype/2.3/maven-archetype-2.3.pom
(13 KB at 289.9 KB/sec)
Downloading: https://repo.maven.apache.org/maven2/org/apache/maven/doxia/doxia-converter/1.2/doxia-converter-1.2.pom
Downloaded: https://repo.maven.apache.org/maven2/org/apache/maven/doxia/doxia-converter/1.2/doxia-converter-1.2.pom
(6 KB at 47.1 KB/sec)
Downloading: https://repo.maven.apache.org/maven2/org/apache/maven/doxia/doxia-tools/1.2/doxia-tools-1.2.pom
Downloaded: https://repo.maven.apache.org/maven2/org/apache/maven/doxia/doxia-tools/1.2/doxia-tools-1.2.pom
(9 KB at 221.6 KB/sec)
Downloading: https://repo.maven.apache.org/maven2/org/apache/maven/doxia/doxia-linkcheck/1.2/doxia-linkcheck-1.2.pom
Downloaded: https://repo.maven.apache.org/maven2/org/apache/maven/doxia/doxia-linkcheck/1.2/doxia-linkcheck-1.2.pom
(4 KB at 86.2 KB/sec)
Downloading: https://repo.maven.apache.org/maven2/org/apache/maven/enforcer/enforcer/1.4/enforcer-1.4.pom
Downloaded: https://repo.maven.apache.org/maven2/org/apache/maven/enforcer/enforcer/1.4/enforcer-1.4.pom
(7 KB at 179.3 KB/sec)
Downloading: https://repo.maven.apache.org/maven2/org/apache/maven/indexer/maven-indexer/5.1.1/maven-indexer-5.1.1.pom
Downloaded: https://repo.maven.apache.org/maven2/org/apache/maven/indexer/maven-indexer/5.1.1/maven-indexer-5.1.1.pom
(13 KB at 273.6 KB/sec)
Downloading: https://repo.maven.apache.org/maven2/org/apache/maven/apache-maven/3.0.5/apache-maven-3.0.5.pom
Downloaded: https://repo.maven.apache.org/maven2/org/apache/maven/apache-maven/3.0.5/apache-maven-3.0.5.pom
(6 KB at 133.0 KB/sec)
Downloading: https://repo.maven.apache.org/maven2/org/apache/maven/maven/3.0.5/maven-3.0.5.pom
Downloaded: https://repo.maven.apache.org/maven2/org/apache/maven/maven/3.0.5/maven-3.0.5.pom
(22 KB at 429.1 KB/sec)
Downloading: https://repo.maven.apache.org/maven2/org/apache/maven/apache-maven/3.1.1/apache-maven-3.1.1.pom
Downloaded: https://repo.maven.apache.org/maven2/org/apache/maven/apache-maven/3.1.1/apache-maven-3.1.1.pom
(7 KB at 99.1 KB/sec)
Downloading: https://repo.maven.apache.org/maven2/org/apache/maven/maven/3.1.1/maven-3.1.1.pom
Downloaded: https://repo.maven.apache.org/maven2/org/apache/maven/maven/3.1.1/maven-3.1.1.pom
(22 KB at 423.1 KB/sec)
Downloading: https://repo.maven.apache.org/maven2/org/apache/maven/apache-maven/3.3.3/apache-maven-3.3.3.pom
Downloaded: https://repo.maven.apache.org/maven2/org/apache/maven/apache-maven/3.3.3/apache-maven-3.3.3.pom
(7 KB at 48.7 KB/sec)
Downloading: https://repo.maven.apache.org/maven2/org/apache/maven/maven/3.3.3/maven-3.3.3.pom
Downloaded: https://repo.maven.apache.org/maven2/org/apache/maven/maven/3.3.3/maven-3.3.3.pom
(23 KB at 423.8 KB/sec)
Downloading: https://repo.maven.apache.org/maven2/org/apache/maven/jxr/jxr/2.5/jxr-2.5.pom
Downloaded: https://repo.maven.apache.org/maven2/org/apache/maven/jxr/jxr/2.5/jxr-2.5.pom
(5 KB at 130.2 KB/sec)
Downloading: https://repo.maven.apache.org/maven2/org/apache/maven/plugin-testing/maven-plugin-testing/3.3.0/maven-plugin-testing-3.3.0.pom
Downloaded: https://repo.maven.apache.org/maven2/org/apache/maven/plugin-testing/maven-plugin-testing/3.3.0/maven-plugin-testing-3.3.0.pom
(11 KB at 273.0 KB/sec)
Downloading: https://repo.maven.apache.org/maven2/org/apache/maven/plugin-tools/maven-plugin-tools/3.4/maven-plugin-tools-3.4.pom
Downloaded: https://repo.maven.apache.org/maven2/org/apache/maven/plugin-tools/maven-plugin-tools/3.4/maven-plugin-tools-3.4.pom
(14 KB at 358.7 KB/sec)
Downloading: https://repo.maven.apache.org/maven2/org/apache/maven/plugins/maven-acr-plugin/1.1/maven-acr-plugin-1.1.pom
Downloaded: https://repo.maven.apache.org/maven2/org/apache/maven/plugins/maven-acr-plugin/1.1/maven-acr-plugin-1.1.pom
(6 KB at 86.9 KB/sec)
Downloading: https://repo.maven.apache.org/maven2/org/apache/maven/plugins/maven-ant-plugin/2.4/maven-ant-plugin-2.4.pom
Downloaded: https://repo.maven.apache.org/maven2/org/apache/maven/plugins/maven-ant-plugin/2.4/maven-ant-plugin-2.4.pom
(6 KB at 143.2 KB/sec)
Downloading: https://repo.maven.apache.org/maven2/org/apache/maven/plugins/maven-antrun-plugin/1.8/maven-antrun-plugin-1.8.pom
Downloaded: https://repo.maven.apache.org/maven2/org/apache/maven/plugins/maven-antrun-plugin/1.8/maven-antrun-plugin-1.8.pom
(4 KB at 92.5 KB/sec)
Downloading: https://repo.maven.apache.org/maven2/org/apache/maven/plugins/maven-assembly-plugin/2.5.5/maven-assembly-plugin-2.5.5.pom
Downloaded: https://repo.maven.apache.org/maven2/org/apache/maven/plugins/maven-assembly-plugin/2.5.5/maven-assembly-plugin-2.5.5.pom
(17 KB at 451.0 KB/sec)
Downloading: https://repo.maven.apache.org/maven2/org/apache/maven/plugins/maven-changelog-plugin/2.3/maven-changelog-plugin-2.3.pom
Downloaded: https://repo.maven.apache.org/maven2/org/apache/maven/plugins/maven-changelog-plugin/2.3/maven-changelog-plugin-2.3.pom
(14 KB at 358.3 KB/sec)
Downloading: https://repo.maven.apache.org/maven2/org/apache/maven/plugins/maven-changes-plugin/2.11/maven-changes-plugin-2.11.pom
Downloaded: https://repo.maven.apache.org/maven2/org/apache/maven/plugins/maven-changes-plugin/2.11/maven-changes-plugin-2.11.pom
(19 KB at 501.3 KB/sec)
Downloading: https://repo.maven.apache.org/maven2/org/apache/maven/plugins/maven-checkstyle-plugin/2.15/maven-checkstyle-plugin-2.15.pom
Downloaded: https://repo.maven.apache.org/maven2/org/apache/maven/plugins/maven-checkstyle-plugin/2.15/maven-checkstyle-plugin-2.15.pom
(14 KB at 380.2 KB/sec)
Downloading: https://repo.maven.apache.org/maven2/org/apache/maven/plugins/maven-clean-plugin/2.6.1/maven-clean-plugin-2.6.1.pom
Downloaded: https://repo.maven.apache.org/maven2/org/apache/maven/plugins/maven-clean-plugin/2.6.1/maven-clean-plugin-2.6.1.pom
(5 KB at 134.7 KB/sec)
Downloading: https://repo.maven.apache.org/maven2/org/apache/maven/plugins/maven-plugins/26/maven-plugins-26.pom
Downloaded: https://repo.maven.apache.org/maven2/org/apache/maven/plugins/maven-plugins/26/maven-plugins-26.pom
(12 KB at 191.4 KB/sec)
Downloading: https://repo.maven.apache.org/maven2/org/apache/maven/plugins/maven-dependency-plugin/2.10/maven-dependency-plugin-2.10.pom
Downloaded: https://repo.maven.apache.org/maven2/org/apache/maven/plugins/maven-dependency-plugin/2.10/maven-dependency-plugin-2.10.pom
(12 KB at 316.5 KB/sec)
Downloading: https://repo.maven.apache.org/maven2/org/apache/maven/plugins/maven-doap-plugin/1.2/maven-doap-plugin-1.2.pom
Downloaded: https://repo.maven.apache.org/maven2/org/apache/maven/plugins/maven-doap-plugin/1.2/maven-doap-plugin-1.2.pom
(8 KB at 148.7 KB/sec)
Downloading: https://repo.maven.apache.org/maven2/org/apache/maven/plugins/maven-docck-plugin/1.1/maven-docck-plugin-1.1.pom
Downloaded: https://repo.maven.apache.org/maven2/org/apache/maven/plugins/maven-docck-plugin/1.1/maven-docck-plugin-1.1.pom
(6 KB at 86.3 KB/sec)
Downloading: https://repo.maven.apache.org/maven2/org/apache/maven/plugins/maven-ear-plugin/2.10.1/maven-ear-plugin-2.10.1.pom
Downloaded: https://repo.maven.apache.org/maven2/org/apache/maven/plugins/maven-ear-plugin/2.10.1/maven-ear-plugin-2.10.1.pom
(10 KB at 253.5 KB/sec)
Downloading: https://repo.maven.apache.org/maven2/org/apache/maven/plugins/maven-eclipse-plugin/2.10/maven-eclipse-plugin-2.10.pom
Downloaded: https://repo.maven.apache.org/maven2/org/apache/maven/plugins/maven-eclipse-plugin/2.10/maven-eclipse-plugin-2.10.pom
(19 KB at 492.3 KB/sec)
Downloading: https://repo.maven.apache.org/maven2/org/apache/maven/plugins/maven-ejb-plugin/2.5.1/maven-ejb-plugin-2.5.1.pom
Downloaded: https://repo.maven.apache.org/maven2/org/apache/maven/plugins/maven-ejb-plugin/2.5.1/maven-ejb-plugin-2.5.1.pom
(6 KB at 144.9 KB/sec)
Downloading: https://repo.maven.apache.org/maven2/org/apache/maven/plugins/maven-gpg-plugin/1.6/maven-gpg-plugin-1.6.pom
Downloaded: https://repo.maven.apache.org/maven2/org/apache/maven/plugins/maven-gpg-plugin/1.6/maven-gpg-plugin-1.6.pom
(6 KB at 135.3 KB/sec)
Downloading: https://repo.maven.apache.org/maven2/org/apache/maven/plugins/maven-help-plugin/2.2/maven-help-plugin-2.2.pom
Downloaded: https://repo.maven.apache.org/maven2/org/apache/maven/plugins/maven-help-plugin/2.2/maven-help-plugin-2.2.pom
(9 KB at 243.3 KB/sec)
Downloading: https://repo.maven.apache.org/maven2/org/apache/maven/plugins/maven-invoker-plugin/2.0.0/maven-invoker-plugin-2.0.0.pom
Downloaded: https://repo.maven.apache.org/maven2/org/apache/maven/plugins/maven-invoker-plugin/2.0.0/maven-invoker-plugin-2.0.0.pom
(11 KB at 298.7 KB/sec)
Downloading: https://repo.maven.apache.org/maven2/org/apache/maven/plugins/maven-jar-plugin/2.6/maven-jar-plugin-2.6.pom
Downloaded: https://repo.maven.apache.org/maven2/org/apache/maven/plugins/maven-jar-plugin/2.6/maven-jar-plugin-2.6.pom
(6 KB at 159.9 KB/sec)
Downloading: https://repo.maven.apache.org/maven2/org/apache/maven/plugins/maven-jarsigner-plugin/1.4/maven-jarsigner-plugin-1.4.pom
Downloaded: https://repo.maven.apache.org/maven2/org/apache/maven/plugins/maven-jarsigner-plugin/1.4/maven-jarsigner-plugin-1.4.pom
(5 KB at 130.1 KB/sec)
Downloading: https://repo.maven.apache.org/maven2/org/apache/maven/plugins/maven-javadoc-plugin/2.10.3/maven-javadoc-plugin-2.10.3.pom
Downloaded: https://repo.maven.apache.org/maven2/org/apache/maven/plugins/maven-javadoc-plugin/2.10.3/maven-javadoc-plugin-2.10.3.pom
(16 KB at 429.9 KB/sec)
Downloading: https://repo.maven.apache.org/maven2/org/apache/maven/plugins/maven-linkcheck-plugin/1.2/maven-linkcheck-plugin-1.2.pom
Downloaded: https://repo.maven.apache.org/maven2/org/apache/maven/plugins/maven-linkcheck-plugin/1.2/maven-linkcheck-plugin-1.2.pom
(8 KB at 122.2 KB/sec)
Downloading: https://repo.maven.apache.org/maven2/org/apache/maven/plugins/maven-patch-plugin/1.2/maven-patch-plugin-1.2.pom
Downloaded: https://repo.maven.apache.org/maven2/org/apache/maven/plugins/maven-patch-plugin/1.2/maven-patch-plugin-1.2.pom
(5 KB at 64.6 KB/sec)
Downloading: https://repo.maven.apache.org/maven2/org/apache/maven/plugins/maven-pdf-plugin/1.3/maven-pdf-plugin-1.3.pom
Downloaded: https://repo.maven.apache.org/maven2/org/apache/maven/plugins/maven-pdf-plugin/1.3/maven-pdf-plugin-1.3.pom
(12 KB at 309.4 KB/sec)
Downloading: https://repo.maven.apache.org/maven2/org/apache/maven/plugins/maven-pmd-plugin/3.4/maven-pmd-plugin-3.4.pom
Downloaded: https://repo.maven.apache.org/maven2/org/apache/maven/plugins/maven-pmd-plugin/3.4/maven-pmd-plugin-3.4.pom
(12 KB at 293.6 KB/sec)
Downloading: https://repo.maven.apache.org/maven2/org/apache/maven/plugins/maven-project-info-reports-plugin/2.8/maven-project-info-reports-plugin-2.8.pom
Downloaded: https://repo.maven.apache.org/maven2/org/apache/maven/plugins/maven-project-info-reports-plugin/2.8/maven-project-info-reports-plugin-2.8.pom
(19 KB at 504.6 KB/sec)
Downloading: https://repo.maven.apache.org/maven2/org/apache/maven/plugins/maven-rar-plugin/2.4/maven-rar-plugin-2.4.pom
Downloaded: https://repo.maven.apache.org/maven2/org/apache/maven/plugins/maven-rar-plugin/2.4/maven-rar-plugin-2.4.pom
(7 KB at 73.8 KB/sec)
Downloading: https://repo.maven.apache.org/maven2/org/apache/maven/plugins/maven-repository-plugin/2.4/maven-repository-plugin-2.4.pom
Downloaded: https://repo.maven.apache.org/maven2/org/apache/maven/plugins/maven-repository-plugin/2.4/maven-repository-plugin-2.4.pom
(10 KB at 142.7 KB/sec)
Downloading: https://repo.maven.apache.org/maven2/org/apache/maven/plugins/maven-shade-plugin/2.4/maven-shade-plugin-2.4.pom
Downloaded: https://repo.maven.apache.org/maven2/org/apache/maven/plugins/maven-shade-plugin/2.4/maven-shade-plugin-2.4.pom
(9 KB at 205.9 KB/sec)
Downloading: https://repo.maven.apache.org/maven2/org/apache/maven/plugins/maven-stage-plugin/1.0/maven-stage-plugin-1.0.pom
Downloaded: https://repo.maven.apache.org/maven2/org/apache/maven/plugins/maven-stage-plugin/1.0/maven-stage-plugin-1.0.pom
(7 KB at 42.6 KB/sec)
Downloading: https://repo.maven.apache.org/maven2/org/apache/maven/plugins/maven-toolchains-plugin/1.1/maven-toolchains-plugin-1.1.pom
Downloaded: https://repo.maven.apache.org/maven2/org/apache/maven/plugins/maven-toolchains-plugin/1.1/maven-toolchains-plugin-1.1.pom
(4 KB at 61.0 KB/sec)
Downloading: https://repo.maven.apache.org/maven2/org/apache/maven/plugins/maven-verifier-plugin/1.1/maven-verifier-plugin-1.1.pom
Downloaded: https://repo.maven.apache.org/maven2/org/apache/maven/plugins/maven-verifier-plugin/1.1/maven-verifier-plugin-1.1.pom
(5 KB at 135.7 KB/sec)
Downloading: https://repo.maven.apache.org/maven2/org/apache/maven/plugins/maven-war-plugin/2.6/maven-war-plugin-2.6.pom
Downloaded: https://repo.maven.apache.org/maven2/org/apache/maven/plugins/maven-war-plugin/2.6/maven-war-plugin-2.6.pom
(9 KB at 229.5 KB/sec)
Downloading: https://repo.maven.apache.org/maven2/org/apache/apache/17/apache-17.pom
Downloaded: https://repo.maven.apache.org/maven2/org/apache/apache/17/apache-17.pom (16 KB
at 423.8 KB/sec)
Downloading: https://repo.maven.apache.org/maven2/org/apache/maven/release/maven-release/2.5.2/maven-release-2.5.2.pom
Downloaded: https://repo.maven.apache.org/maven2/org/apache/maven/release/maven-release/2.5.2/maven-release-2.5.2.pom
(5 KB at 124.1 KB/sec)
Downloading: https://repo.maven.apache.org/maven2/org/apache/apache/resources/apache-resource-bundles/5/apache-resource-bundles-5.pom
Downloaded: https://repo.maven.apache.org/maven2/org/apache/apache/resources/apache-resource-bundles/5/apache-resource-bundles-5.pom
(3 KB at 45.6 KB/sec)
Downloading: https://repo.maven.apache.org/maven2/org/apache/apache/resources/apache-source-release-assembly-descriptor/1.0.5/apache-source-release-assembly-descriptor-1.0.5.pom
Downloaded: https://repo.maven.apache.org/maven2/org/apache/apache/resources/apache-source-release-assembly-descriptor/1.0.5/apache-source-release-assembly-descriptor-1.0.5.pom
(8 KB at 106.5 KB/sec)
Downloading: https://repo.maven.apache.org/maven2/org/apache/apache-incubator-disclaimer-resource-bundle/1.1/apache-incubator-disclaimer-resource-bundle-1.1.pom
[WARNING] Checksum validation failed, expected da39a3ee5e6b4b0d3255bfef95601890afd80709 but
is 6e0b74ff3d2da9bfe1126608f7e937537e628a5f for https://repo.maven.apache.org/maven2/org/apache/apache-incubator-disclaimer-resource-bundle/1.1/apache-incubator-disclaimer-resource-bundle-1.1.pom
[WARNING] Checksum validation failed, expected da39a3ee5e6b4b0d3255bfef95601890afd80709 but
is 6e0b74ff3d2da9bfe1126608f7e937537e628a5f for https://repo.maven.apache.org/maven2/org/apache/apache-incubator-disclaimer-resource-bundle/1.1/apache-incubator-disclaimer-resource-bundle-1.1.pom
Downloaded: https://repo.maven.apache.org/maven2/org/apache/apache-incubator-disclaimer-resource-bundle/1.1/apache-incubator-disclaimer-resource-bundle-1.1.pom
(722 B at 4.6 KB/sec)
Downloading: https://repo.maven.apache.org/maven2/org/apache/apache-resource-bundles/2/apache-resource-bundles-2.pom
[WARNING] Checksum validation failed, expected da39a3ee5e6b4b0d3255bfef95601890afd80709 but
is bfadc7db5b215805d531144732c80692de9780e1 for https://repo.maven.apache.org/maven2/org/apache/apache-resource-bundles/2/apache-resource-bundles-2.pom
[WARNING] Checksum validation failed, expected da39a3ee5e6b4b0d3255bfef95601890afd80709 but
is bfadc7db5b215805d531144732c80692de9780e1 for https://repo.maven.apache.org/maven2/org/apache/apache-resource-bundles/2/apache-resource-bundles-2.pom
Downloaded: https://repo.maven.apache.org/maven2/org/apache/apache-resource-bundles/2/apache-resource-bundles-2.pom
(2 KB at 22.6 KB/sec)
Downloading: https://repo.maven.apache.org/maven2/org/apache/apache-jar-resource-bundle/1.4/apache-jar-resource-bundle-1.4.pom
Downloaded: https://repo.maven.apache.org/maven2/org/apache/apache-jar-resource-bundle/1.4/apache-jar-resource-bundle-1.4.pom
(2 KB at 11.1 KB/sec)
Downloading: https://repo.maven.apache.org/maven2/org/apache/apache-license-header-resource-bundle/1.1/apache-license-header-resource-bundle-1.1.pom
[WARNING] Checksum validation failed, expected da39a3ee5e6b4b0d3255bfef95601890afd80709 but
is 923c05b225d7a5a8a614b5fca846b1776e18b98a for https://repo.maven.apache.org/maven2/org/apache/apache-license-header-resource-bundle/1.1/apache-license-header-resource-bundle-1.1.pom
[WARNING] Checksum validation failed, expected da39a3ee5e6b4b0d3255bfef95601890afd80709 but
is 923c05b225d7a5a8a614b5fca846b1776e18b98a for https://repo.maven.apache.org/maven2/org/apache/apache-license-header-resource-bundle/1.1/apache-license-header-resource-bundle-1.1.pom
Downloaded: https://repo.maven.apache.org/maven2/org/apache/apache-license-header-resource-bundle/1.1/apache-license-header-resource-bundle-1.1.pom
(694 B at 4.6 KB/sec)
Downloading: https://repo.maven.apache.org/maven2/org/apache/maven/scm/maven-scm/1.9.4/maven-scm-1.9.4.pom
Downloaded: https://repo.maven.apache.org/maven2/org/apache/maven/scm/maven-scm/1.9.4/maven-scm-1.9.4.pom
(22 KB at 568.2 KB/sec)
Downloading: https://repo.maven.apache.org/maven2/org/apache/maven/shared/maven-shared-components/21/maven-shared-components-21.pom
Downloaded: https://repo.maven.apache.org/maven2/org/apache/maven/shared/maven-shared-components/21/maven-shared-components-21.pom
(5 KB at 142.5 KB/sec)
Downloading: https://repo.maven.apache.org/maven2/org/apache/maven/shared/maven-dependency-analyzer/1.6/maven-dependency-analyzer-1.6.pom
Downloaded: https://repo.maven.apache.org/maven2/org/apache/maven/shared/maven-dependency-analyzer/1.6/maven-dependency-analyzer-1.6.pom
(6 KB at 143.8 KB/sec)
Downloading: https://repo.maven.apache.org/maven2/org/apache/maven/shared/maven-dependency-tree/2.2/maven-dependency-tree-2.2.pom
Downloaded: https://repo.maven.apache.org/maven2/org/apache/maven/shared/maven-dependency-tree/2.2/maven-dependency-tree-2.2.pom
(8 KB at 191.7 KB/sec)
Downloading: https://repo.maven.apache.org/maven2/org/apache/maven/shared/maven-filtering/1.3/maven-filtering-1.3.pom
Downloaded: https://repo.maven.apache.org/maven2/org/apache/maven/shared/maven-filtering/1.3/maven-filtering-1.3.pom
(7 KB at 168.1 KB/sec)
Downloading: https://repo.maven.apache.org/maven2/org/apache/maven/shared/maven-invoker/2.2/maven-invoker-2.2.pom
Downloaded: https://repo.maven.apache.org/maven2/org/apache/maven/shared/maven-invoker/2.2/maven-invoker-2.2.pom
(6 KB at 93.7 KB/sec)
Downloading: https://repo.maven.apache.org/maven2/org/apache/maven/shared/maven-jarsigner/1.4/maven-jarsigner-1.4.pom
Downloaded: https://repo.maven.apache.org/maven2/org/apache/maven/shared/maven-jarsigner/1.4/maven-jarsigner-1.4.pom
(4 KB at 103.4 KB/sec)
Downloading: https://repo.maven.apache.org/maven2/org/apache/maven/shared/maven-mapping/1.0/maven-mapping-1.0.pom
Downloaded: https://repo.maven.apache.org/maven2/org/apache/maven/shared/maven-mapping/1.0/maven-mapping-1.0.pom
(5 KB at 117.6 KB/sec)
Downloading: https://repo.maven.apache.org/maven2/org/apache/maven/shared/maven-repository-builder/1.0/maven-repository-builder-1.0.pom
Downloaded: https://repo.maven.apache.org/maven2/org/apache/maven/shared/maven-repository-builder/1.0/maven-repository-builder-1.0.pom
(5 KB at 123.5 KB/sec)
Downloading: https://repo.maven.apache.org/maven2/org/apache/maven/shared/maven-runtime/1.0-alpha-3/maven-runtime-1.0-alpha-3.pom
Downloaded: https://repo.maven.apache.org/maven2/org/apache/maven/shared/maven-runtime/1.0-alpha-3/maven-runtime-1.0-alpha-3.pom
(6 KB at 151.9 KB/sec)
Downloading: https://repo.maven.apache.org/maven2/org/apache/maven/shared/maven-script-interpreter/1.1/maven-script-interpreter-1.1.pom
Downloaded: https://repo.maven.apache.org/maven2/org/apache/maven/shared/maven-script-interpreter/1.1/maven-script-interpreter-1.1.pom
(4 KB at 103.5 KB/sec)
Downloading: https://repo.maven.apache.org/maven2/org/apache/maven/shared/maven-shared-resources/2/maven-shared-resources-2.pom
Downloaded: https://repo.maven.apache.org/maven2/org/apache/maven/shared/maven-shared-resources/2/maven-shared-resources-2.pom
(3 KB at 82.5 KB/sec)
Downloading: https://repo.maven.apache.org/maven2/org/apache/maven/shared/maven-shared-utils/0.8/maven-shared-utils-0.8.pom
Downloaded: https://repo.maven.apache.org/maven2/org/apache/maven/shared/maven-shared-utils/0.8/maven-shared-utils-0.8.pom
(6 KB at 170.3 KB/sec)
Downloading: https://repo.maven.apache.org/maven2/org/apache/maven/shared/maven-verifier/1.6/maven-verifier-1.6.pom
Downloaded: https://repo.maven.apache.org/maven2/org/apache/maven/shared/maven-verifier/1.6/maven-verifier-1.6.pom
(4 KB at 89.3 KB/sec)
Downloading: https://repo.maven.apache.org/maven2/org/apache/maven/maven-archiver/2.6/maven-archiver-2.6.pom
Downloaded: https://repo.maven.apache.org/maven2/org/apache/maven/maven-archiver/2.6/maven-archiver-2.6.pom
(5 KB at 114.1 KB/sec)
Downloading: https://repo.maven.apache.org/maven2/org/apache/maven/skins/maven-skins/10/maven-skins-10.pom
Downloaded: https://repo.maven.apache.org/maven2/org/apache/maven/skins/maven-skins/10/maven-skins-10.pom
(4 KB at 41.3 KB/sec)
Downloading: https://repo.maven.apache.org/maven2/org/apache/maven/skins/maven-application-skin/1.0/maven-application-skin-1.0.pom
Downloaded: https://repo.maven.apache.org/maven2/org/apache/maven/skins/maven-application-skin/1.0/maven-application-skin-1.0.pom
(5 KB at 34.3 KB/sec)
Downloading: https://repo.maven.apache.org/maven2/org/apache/maven/skins/maven-skins/6/maven-skins-6.pom
Downloaded: https://repo.maven.apache.org/maven2/org/apache/maven/skins/maven-skins/6/maven-skins-6.pom
(4 KB at 27.6 KB/sec)
Downloading: https://repo.maven.apache.org/maven2/org/apache/maven/skins/maven-classic-skin/1.1/maven-classic-skin-1.1.pom
Downloaded: https://repo.maven.apache.org/maven2/org/apache/maven/skins/maven-classic-skin/1.1/maven-classic-skin-1.1.pom
(5 KB at 29.2 KB/sec)
Downloading: https://repo.maven.apache.org/maven2/org/apache/maven/skins/maven-default-skin/1.1/maven-default-skin-1.1.pom
Downloaded: https://repo.maven.apache.org/maven2/org/apache/maven/skins/maven-default-skin/1.1/maven-default-skin-1.1.pom
(5 KB at 28.7 KB/sec)
Downloading: https://repo.maven.apache.org/maven2/org/apache/maven/skins/maven-fluido-skin/1.4/maven-fluido-skin-1.4.pom
Downloaded: https://repo.maven.apache.org/maven2/org/apache/maven/skins/maven-fluido-skin/1.4/maven-fluido-skin-1.4.pom
(27 KB at 410.7 KB/sec)
Downloading: https://repo.maven.apache.org/maven2/org/apache/maven/skins/maven-stylus-skin/1.5/maven-stylus-skin-1.5.pom
Downloaded: https://repo.maven.apache.org/maven2/org/apache/maven/skins/maven-stylus-skin/1.5/maven-stylus-skin-1.5.pom
(6 KB at 84.5 KB/sec)
Downloading: https://repo.maven.apache.org/maven2/org/apache/maven/wagon/wagon/2.9/wagon-2.9.pom
Downloaded: https://repo.maven.apache.org/maven2/org/apache/maven/wagon/wagon/2.9/wagon-2.9.pom
(21 KB at 500.8 KB/sec)
[INFO] Generating "Dist Tool> Check Source Release" report --- dist-tool-plugin:1.0-SNAPSHOT:check-source-release
[WARNING] Missing file for doxia-linkcheck in https://repo.maven.apache.org/maven2/org/apache/maven/doxia/doxia-linkcheck/1.2/
[WARNING]  > doxia-linkcheck-1.2-source-release.zip <
[WARNING]  > doxia-linkcheck-1.2-source-release.zip.asc <
[WARNING]  > doxia-linkcheck-1.2-source-release.zip.md5 <
[WARNING] Missing file for doxia-linkcheck in http://www.apache.org/dist/maven/doxia
[WARNING]  > doxia-linkcheck-1.2-source-release.zip <
[WARNING]  > doxia-linkcheck-1.2-source-release.zip.asc <
[WARNING]  > doxia-linkcheck-1.2-source-release.zip.md5 <
[WARNING] Missing file for apache-incubator-disclaimer-resource-bundle in https://repo.maven.apache.org/maven2/org/apache/apache-incubator-disclaimer-resource-bundle/1.1/
[WARNING]  > apache-incubator-disclaimer-resource-bundle-1.1-source-release.zip <
[WARNING]  > apache-incubator-disclaimer-resource-bundle-1.1-source-release.zip.asc <
[WARNING]  > apache-incubator-disclaimer-resource-bundle-1.1-source-release.zip.md5 <
[WARNING] Missing file for apache-incubator-disclaimer-resource-bundle in http://www.apache.org/dist/maven/resources
[WARNING]  > apache-incubator-disclaimer-resource-bundle-1.1-source-release.zip <
[WARNING]  > apache-incubator-disclaimer-resource-bundle-1.1-source-release.zip.asc <
[WARNING]  > apache-incubator-disclaimer-resource-bundle-1.1-source-release.zip.md5 <
[WARNING] Missing file for apache-jar-resource-bundle in https://repo.maven.apache.org/maven2/org/apache/apache-jar-resource-bundle/1.4/
[WARNING]  > apache-jar-resource-bundle-1.4-source-release.zip <
[WARNING]  > apache-jar-resource-bundle-1.4-source-release.zip.asc <
[WARNING]  > apache-jar-resource-bundle-1.4-source-release.zip.md5 <
[WARNING] Missing file for apache-jar-resource-bundle in http://www.apache.org/dist/maven/resources
[WARNING]  > apache-jar-resource-bundle-1.4-source-release.zip <
[WARNING]  > apache-jar-resource-bundle-1.4-source-release.zip.asc <
[WARNING]  > apache-jar-resource-bundle-1.4-source-release.zip.md5 <
[WARNING] Missing file for apache-license-header-resource-bundle in https://repo.maven.apache.org/maven2/org/apache/apache-license-header-resource-bundle/1.1/
[WARNING]  > apache-license-header-resource-bundle-1.1-source-release.zip <
[WARNING]  > apache-license-header-resource-bundle-1.1-source-release.zip.asc <
[WARNING]  > apache-license-header-resource-bundle-1.1-source-release.zip.md5 <
[WARNING] Missing file for apache-license-header-resource-bundle in http://www.apache.org/dist/maven/resources
[WARNING]  > apache-license-header-resource-bundle-1.1-source-release.zip <
[WARNING]  > apache-license-header-resource-bundle-1.1-source-release.zip.asc <
[WARNING]  > apache-license-header-resource-bundle-1.1-source-release.zip.md5 <
[WARNING] Missing file for file-management in https://repo.maven.apache.org/maven2/org/apache/maven/shared/file-management/1.2.1/
[WARNING]  > file-management-1.2.1-source-release.zip <
[WARNING]  > file-management-1.2.1-source-release.zip.asc <
[WARNING]  > file-management-1.2.1-source-release.zip.md5 <
[WARNING] Missing file for file-management in http://www.apache.org/dist/maven/shared
[WARNING]  > file-management-1.2.1-source-release.zip <
[WARNING]  > file-management-1.2.1-source-release.zip.asc <
[WARNING]  > file-management-1.2.1-source-release.zip.md5 <
[INFO] Generating "Dist Tool> Check Index Pages" report --- dist-tool-plugin:1.0-SNAPSHOT:check-index-page
[ERROR] maven-ear-plugin: found 2.10 instead of 2.10.1 in http://maven.apache.org/plugins/
[ERROR] maven-invoker-plugin: found 1.10 instead of 2.0.0 in http://maven.apache.org/plugins/
[INFO] Generating "Dist Tool> List Plugins Prerequisites" report --- dist-tool-plugin:1.0-SNAPSHOT:list-plugins-prerequisites
[INFO] Generating "Dist Tool> Failure Hack" report --- dist-tool-plugin:1.0-SNAPSHOT:failure-report
[ERROR] check-index-page.log error log not empty:
maven-ear-plugin: found 2.10 instead of 2.10.1 in http://maven.apache.org/plugins/
maven-invoker-plugin: found 1.10 instead of 2.0.0 in http://maven.apache.org/plugins/

[JENKINS] Archiving site from <https://builds.apache.org/job/dist-tool-plugin/ws/target/site>
to /x1/jenkins/jenkins-home/jobs/dist-tool-plugin/site
[INFO] ------------------------------------------------------------------------
[INFO] BUILD FAILURE
[INFO] ------------------------------------------------------------------------
[INFO] Total time: 3:08.556s
[INFO] Finished at: Sat Jul 04 10:22:33 UTC 2015
[INFO] Final Memory: 69M/786M
[INFO] ------------------------------------------------------------------------
[WARNING] The requested profile "apache.snapshots" could not be activated because it does
not exist.
Waiting for Jenkins to finish collecting data
[ERROR] Failed to execute goal org.apache.maven.plugins:maven-site-plugin:3.4:site (default-site)
on project dist-tool-plugin: Error generating dist-tool-plugin:1.0-SNAPSHOT:failure-report:
Dist tools check reports found inconsistencies in some released artifacts, see https://builds.apache.org/job/dist-tool-plugin/site/
for more information -> [Help 1]
[ERROR] 
[ERROR] To see the full stack trace of the errors, re-run Maven with the -e switch.
[ERROR] Re-run Maven using the -X switch to enable full debug logging.
[ERROR] 
[ERROR] For more information about the errors and possible solutions, please read the following
articles:
[ERROR] [Help 1] http://cwiki.apache.org/confluence/display/MAVEN/MojoExecutionException
[JENKINS] Archiving <https://builds.apache.org/job/dist-tool-plugin/ws/pom.xml> to org.apache.maven.dist.tools/dist-tool-plugin/1.0-SNAPSHOT/dist-tool-plugin-1.0-SNAPSHOT.pom
[JENKINS] Archiving <https://builds.apache.org/job/dist-tool-plugin/ws/target/dist-tool-plugin-1.0-SNAPSHOT.jar>
to org.apache.maven.dist.tools/dist-tool-plugin/1.0-SNAPSHOT/dist-tool-plugin-1.0-SNAPSHOT.jar
Sending artifact delta relative to dist-tool-plugin ยป dist-tool-plugin #913
Archived 2 artifacts
Archive block size is 32768
Received 0 blocks and 82104 bytes
Compression is 0.0%
Took 0.31 sec
channel stopped

Mime
View raw message