maven-notifications mailing list archives

Site index · List index
Message view « Date » · « Thread »
Top « Date » · « Thread »
From Apache Jenkins Server <jenk...@builds.apache.org>
Subject Build failed in Jenkins: maven-plugins-ITs-m3.0.4 #1252
Date Mon, 06 Jul 2015 22:16:36 GMT
See <https://builds.apache.org/job/maven-plugins-ITs-m3.0.4/1252/changes>

Changes:

[Robert Scholte] [MDEP-494] Remove/replace Maven2 specific code
use new signatures of ArtifactResolver
change version to 3.0

------------------------------------------
[...truncated 6347 lines...]
[INFO] Processing war project
[INFO] Copying webapp resources [/x1/jenkins/jenkins-slave/workspace/maven-plugins-ITs-m3.0.4/maven-war-plugin/target/test-classes/unit/warziptest/one-zip-overlay-skip-test-data/source]
[INFO] Webapp assembled in [4 msecs]
[INFO] Building war: /x1/jenkins/jenkins-slave/workspace/maven-plugins-ITs-m3.0.4/maven-war-plugin/target/test-classes/unit/warziptest/one-zip-overlay-skip-output/simple.war
[INFO] Packaging webapp
[INFO] Assembling webapp [maven-war-plugin-test] in [/x1/jenkins/jenkins-slave/workspace/maven-plugins-ITs-m3.0.4/maven-war-plugin/target/test-classes/unit/warziptest/one-zip-overlay-skip]
[INFO] Processing war project
[INFO] Copying webapp resources [/x1/jenkins/jenkins-slave/workspace/maven-plugins-ITs-m3.0.4/maven-war-plugin/target/test-classes/unit/warziptest/one-zip-overlay-skip-test-data/source]
[INFO] Skipping overlay [ id zipGroupId:zipId]
[INFO] Webapp assembled in [3 msecs]
[INFO] Building war: /x1/jenkins/jenkins-slave/workspace/maven-plugins-ITs-m3.0.4/maven-war-plugin/target/test-classes/unit/warziptest/one-zip-overlay-skip-output/simple.war
[INFO] Packaging webapp
[INFO] Assembling webapp [maven-war-plugin-test] in [/x1/jenkins/jenkins-slave/workspace/maven-plugins-ITs-m3.0.4/maven-war-plugin/target/test-classes/unit/warziptest/one-zip-overlay-targetPath]
[INFO] Processing war project
[INFO] Copying webapp resources [/x1/jenkins/jenkins-slave/workspace/maven-plugins-ITs-m3.0.4/maven-war-plugin/target/test-classes/unit/warziptest/one-zip-overlay-targetPath-test-data/source]
[INFO] Processing overlay [ id zipGroupId:zipId]
[INFO] Webapp assembled in [8 msecs]
[INFO] Building war: /x1/jenkins/jenkins-slave/workspace/maven-plugins-ITs-m3.0.4/maven-war-plugin/target/test-classes/unit/warziptest/one-zip-overlay-targetPath-output/simple.war
[INFO] Packaging webapp
[INFO] Assembling webapp [maven-war-plugin-test] in [/x1/jenkins/jenkins-slave/workspace/maven-plugins-ITs-m3.0.4/maven-war-plugin/target/test-classes/unit/warziptest/one-zip]
[INFO] Processing war project
[INFO] Copying webapp resources [/x1/jenkins/jenkins-slave/workspace/maven-plugins-ITs-m3.0.4/maven-war-plugin/target/test-classes/unit/warziptest/one-zip-test-data/source]
[INFO] Processing overlay [ id zipGroupId:zipId]
[INFO] Webapp assembled in [6 msecs]
[INFO] Building war: /x1/jenkins/jenkins-slave/workspace/maven-plugins-ITs-m3.0.4/maven-war-plugin/target/test-classes/unit/warziptest/one-zip-output/simple.war
Tests run: 4, Failures: 0, Errors: 0, Skipped: 0, Time elapsed: 1.947 sec - in org.apache.maven.plugin.war.WarZipTest
Running org.apache.maven.plugin.war.overlay.OverlayManagerTest
Tests run: 5, Failures: 0, Errors: 0, Skipped: 0, Time elapsed: 0.208 sec - in org.apache.maven.plugin.war.overlay.OverlayManagerTest
Running org.apache.maven.plugin.war.util.WebappStructureTest
Tests run: 7, Failures: 0, Errors: 0, Skipped: 0, Time elapsed: 0.002 sec - in org.apache.maven.plugin.war.util.WebappStructureTest
Running org.apache.maven.plugin.war.util.WarUtilsTest
Tests run: 1, Failures: 0, Errors: 0, Skipped: 0, Time elapsed: 0 sec - in org.apache.maven.plugin.war.util.WarUtilsTest
Running org.apache.maven.plugin.war.util.PathSetTest
Tests run: 5, Failures: 0, Errors: 0, Skipped: 0, Time elapsed: 0.002 sec - in org.apache.maven.plugin.war.util.PathSetTest

Results :

Tests run: 80, Failures: 0, Errors: 0, Skipped: 0

[INFO] 
[INFO] --- maven-jar-plugin:2.5:jar (default-jar) @ maven-war-plugin ---
[INFO] Building jar: /x1/jenkins/jenkins-slave/workspace/maven-plugins-ITs-m3.0.4/maven-war-plugin/target/maven-war-plugin-2.7-SNAPSHOT.jar
[INFO] 
[INFO] --- maven-plugin-plugin:3.3:addPluginArtifactMetadata (default-addPluginArtifactMetadata)
@ maven-war-plugin ---
[INFO] 
[INFO] --- maven-invoker-plugin:1.10:install (integration-test) @ maven-war-plugin ---
[INFO] Installing /x1/jenkins/jenkins-slave/workspace/maven-plugins-ITs-m3.0.4/maven-acr-plugin/pom.xml
to /x1/jenkins/jenkins-slave/workspace/maven-plugins-ITs-m3.0.4/maven-war-plugin/target/local-repo/org/apache/maven/plugins/maven-acr-plugin/1.2-SNAPSHOT/maven-acr-plugin-1.2-SNAPSHOT.pom
[INFO] Installing /x1/jenkins/jenkins-slave/workspace/maven-plugins-ITs-m3.0.4/maven-acr-plugin/target/maven-acr-plugin-1.2-SNAPSHOT.jar
to /x1/jenkins/jenkins-slave/workspace/maven-plugins-ITs-m3.0.4/maven-war-plugin/target/local-repo/org/apache/maven/plugins/maven-acr-plugin/1.2-SNAPSHOT/maven-acr-plugin-1.2-SNAPSHOT.jar
[INFO] Installing /x1/jenkins/jenkins-slave/workspace/maven-plugins-ITs-m3.0.4/maven-acr-plugin/pom.xml
to /x1/jenkins/jenkins-slave/workspace/maven-plugins-ITs-m3.0.4/maven-war-plugin/target/local-repo/org/apache/maven/plugins/maven-acr-plugin/1.2-SNAPSHOT/maven-acr-plugin-1.2-SNAPSHOT.pom
[INFO] Installing /x1/jenkins/jenkins-slave/workspace/maven-plugins-ITs-m3.0.4/maven-ant-plugin/pom.xml
to /x1/jenkins/jenkins-slave/workspace/maven-plugins-ITs-m3.0.4/maven-war-plugin/target/local-repo/org/apache/maven/plugins/maven-ant-plugin/2.5-SNAPSHOT/maven-ant-plugin-2.5-SNAPSHOT.pom
[INFO] Installing /x1/jenkins/jenkins-slave/workspace/maven-plugins-ITs-m3.0.4/maven-ant-plugin/target/maven-ant-plugin-2.5-SNAPSHOT.jar
to /x1/jenkins/jenkins-slave/workspace/maven-plugins-ITs-m3.0.4/maven-war-plugin/target/local-repo/org/apache/maven/plugins/maven-ant-plugin/2.5-SNAPSHOT/maven-ant-plugin-2.5-SNAPSHOT.jar
[INFO] Installing /x1/jenkins/jenkins-slave/workspace/maven-plugins-ITs-m3.0.4/maven-antrun-plugin/pom.xml
to /x1/jenkins/jenkins-slave/workspace/maven-plugins-ITs-m3.0.4/maven-war-plugin/target/local-repo/org/apache/maven/plugins/maven-antrun-plugin/1.9-SNAPSHOT/maven-antrun-plugin-1.9-SNAPSHOT.pom
[INFO] Installing /x1/jenkins/jenkins-slave/workspace/maven-plugins-ITs-m3.0.4/maven-antrun-plugin/target/maven-antrun-plugin-1.9-SNAPSHOT.jar
to /x1/jenkins/jenkins-slave/workspace/maven-plugins-ITs-m3.0.4/maven-war-plugin/target/local-repo/org/apache/maven/plugins/maven-antrun-plugin/1.9-SNAPSHOT/maven-antrun-plugin-1.9-SNAPSHOT.jar
[INFO] Installing /x1/jenkins/jenkins-slave/workspace/maven-plugins-ITs-m3.0.4/maven-eclipse-plugin/pom.xml
to /x1/jenkins/jenkins-slave/workspace/maven-plugins-ITs-m3.0.4/maven-war-plugin/target/local-repo/org/apache/maven/plugins/maven-eclipse-plugin/3.0-SNAPSHOT/maven-eclipse-plugin-3.0-SNAPSHOT.pom
[INFO] Installing /x1/jenkins/jenkins-slave/workspace/maven-plugins-ITs-m3.0.4/maven-eclipse-plugin/target/maven-eclipse-plugin-3.0-SNAPSHOT.jar
to /x1/jenkins/jenkins-slave/workspace/maven-plugins-ITs-m3.0.4/maven-war-plugin/target/local-repo/org/apache/maven/plugins/maven-eclipse-plugin/3.0-SNAPSHOT/maven-eclipse-plugin-3.0-SNAPSHOT.jar
[INFO] Installing /x1/jenkins/jenkins-slave/workspace/maven-plugins-ITs-m3.0.4/maven-changelog-plugin/pom.xml
to /x1/jenkins/jenkins-slave/workspace/maven-plugins-ITs-m3.0.4/maven-war-plugin/target/local-repo/org/apache/maven/plugins/maven-changelog-plugin/2.4-SNAPSHOT/maven-changelog-plugin-2.4-SNAPSHOT.pom
[INFO] Installing /x1/jenkins/jenkins-slave/workspace/maven-plugins-ITs-m3.0.4/maven-changelog-plugin/target/maven-changelog-plugin-2.4-SNAPSHOT.jar
to /x1/jenkins/jenkins-slave/workspace/maven-plugins-ITs-m3.0.4/maven-war-plugin/target/local-repo/org/apache/maven/plugins/maven-changelog-plugin/2.4-SNAPSHOT/maven-changelog-plugin-2.4-SNAPSHOT.jar
[INFO] Installing /x1/jenkins/jenkins-slave/workspace/maven-plugins-ITs-m3.0.4/maven-changes-plugin/pom.xml
to /x1/jenkins/jenkins-slave/workspace/maven-plugins-ITs-m3.0.4/maven-war-plugin/target/local-repo/org/apache/maven/plugins/maven-changes-plugin/2.12-SNAPSHOT/maven-changes-plugin-2.12-SNAPSHOT.pom
[INFO]                                                                         
[INFO] ------------------------------------------------------------------------
[INFO] Building Apache Maven GPG Plugin 1.7-SNAPSHOT
[INFO] ------------------------------------------------------------------------
[INFO] 
[INFO] --- maven-clean-plugin:2.5:clean (default-clean) @ maven-gpg-plugin ---
[INFO] Deleting /x1/jenkins/jenkins-slave/workspace/maven-plugins-ITs-m3.0.4/maven-gpg-plugin/target
[INFO] 
[INFO] --- maven-enforcer-plugin:1.3.1:enforce (enforce-bytecode-version) @ maven-gpg-plugin
---
[INFO] 
[INFO] --- maven-enforcer-plugin:1.3.1:enforce (ban-known-bad-maven-versions) @ maven-gpg-plugin
---
[INFO] 
[INFO] --- maven-enforcer-plugin:1.3.1:enforce (ensure-no-container-api) @ maven-gpg-plugin
---
[INFO] 
[INFO] --- apache-rat-plugin:0.11:check (rat-check) @ maven-gpg-plugin ---
[INFO] 51 implicit excludes (use -debug for more details).
[INFO] Exclude: src/test/resources/gnupg/*
[INFO] Exclude: DEPENDENCIES
[INFO] 66 resources included (use -debug for more details)
[INFO] Rat check: Summary of files. Unapproved: 0 unknown: 0 generated: 0 approved: 54 licence.
[INFO] 
[INFO] --- maven-plugin-plugin:3.3:helpmojo (generated-helpmojo) @ maven-gpg-plugin ---
[INFO] Using 'UTF-8' encoding to read mojo metadata.
[INFO] Applying mojo extractor for language: java
[INFO] Mojo extractor for language: java found 0 mojo descriptors.
[INFO] Applying mojo extractor for language: bsh
[INFO] Mojo extractor for language: bsh found 0 mojo descriptors.
[INFO] Applying mojo extractor for language: java-annotations
[INFO] Mojo extractor for language: java-annotations found 0 mojo descriptors.
[INFO] 
[INFO] --- maven-remote-resources-plugin:1.5:process (default) @ maven-gpg-plugin ---
[INFO] 
[INFO] --- maven-resources-plugin:2.6:resources (default-resources) @ maven-gpg-plugin ---
[INFO] Using 'UTF-8' encoding to copy filtered resources.
[INFO] Copying 1 resource
[INFO] Copying 3 resources
[INFO] 
[INFO] --- maven-compiler-plugin:3.1:compile (default-compile) @ maven-gpg-plugin ---
[INFO] Changes detected - recompiling the module!
[INFO] Compiling 9 source files to /x1/jenkins/jenkins-slave/workspace/maven-plugins-ITs-m3.0.4/maven-gpg-plugin/target/classes
[INFO] 
[INFO] --- maven-plugin-plugin:3.3:descriptor (default-descriptor) @ maven-gpg-plugin ---
[INFO] Using 'UTF-8' encoding to read mojo metadata.
[INFO] Applying mojo extractor for language: java
[INFO] Mojo extractor for language: java found 0 mojo descriptors.
[INFO] Applying mojo extractor for language: bsh
[INFO] Mojo extractor for language: bsh found 0 mojo descriptors.
[INFO] Applying mojo extractor for language: java-annotations
[INFO] Mojo extractor for language: java-annotations found 3 mojo descriptors.
[INFO] 
[INFO] --- maven-resources-plugin:2.6:testResources (default-testResources) @ maven-gpg-plugin
---
[INFO] Using 'UTF-8' encoding to copy filtered resources.
[INFO] Copying 8 resources
[INFO] Copying 3 resources
[INFO] 
[INFO] --- maven-compiler-plugin:3.1:testCompile (default-testCompile) @ maven-gpg-plugin
---
[INFO] No sources to compile
[INFO] 
[INFO] --- maven-surefire-plugin:2.17:test (default-test) @ maven-gpg-plugin ---
[INFO] 
[INFO] --- maven-jar-plugin:2.5:jar (default-jar) @ maven-gpg-plugin ---
[INFO] Building jar: /x1/jenkins/jenkins-slave/workspace/maven-plugins-ITs-m3.0.4/maven-gpg-plugin/target/maven-gpg-plugin-1.7-SNAPSHOT.jar
[INFO] 
[INFO] --- maven-plugin-plugin:3.3:addPluginArtifactMetadata (default-addPluginArtifactMetadata)
@ maven-gpg-plugin ---
[INFO] 
[INFO] --- maven-invoker-plugin:1.9:install (integration-test) @ maven-gpg-plugin ---
[INFO] Installing /x1/jenkins/jenkins-slave/workspace/maven-plugins-ITs-m3.0.4/maven-acr-plugin/pom.xml
to /x1/jenkins/jenkins-slave/workspace/maven-plugins-ITs-m3.0.4/maven-gpg-plugin/target/local-repo/org/apache/maven/plugins/maven-acr-plugin/1.2-SNAPSHOT/maven-acr-plugin-1.2-SNAPSHOT.pom
[INFO] Installing /x1/jenkins/jenkins-slave/workspace/maven-plugins-ITs-m3.0.4/maven-acr-plugin/target/maven-acr-plugin-1.2-SNAPSHOT.jar
to /x1/jenkins/jenkins-slave/workspace/maven-plugins-ITs-m3.0.4/maven-gpg-plugin/target/local-repo/org/apache/maven/plugins/maven-acr-plugin/1.2-SNAPSHOT/maven-acr-plugin-1.2-SNAPSHOT.jar
[INFO] Installing /x1/jenkins/jenkins-slave/workspace/maven-plugins-ITs-m3.0.4/maven-acr-plugin/pom.xml
to /x1/jenkins/jenkins-slave/workspace/maven-plugins-ITs-m3.0.4/maven-gpg-plugin/target/local-repo/org/apache/maven/plugins/maven-acr-plugin/1.2-SNAPSHOT/maven-acr-plugin-1.2-SNAPSHOT.pom
[INFO] Installing /x1/jenkins/jenkins-slave/workspace/maven-plugins-ITs-m3.0.4/maven-ant-plugin/pom.xml
to /x1/jenkins/jenkins-slave/workspace/maven-plugins-ITs-m3.0.4/maven-gpg-plugin/target/local-repo/org/apache/maven/plugins/maven-ant-plugin/2.5-SNAPSHOT/maven-ant-plugin-2.5-SNAPSHOT.pom
[INFO] Installing /x1/jenkins/jenkins-slave/workspace/maven-plugins-ITs-m3.0.4/maven-ant-plugin/target/maven-ant-plugin-2.5-SNAPSHOT.jar
to /x1/jenkins/jenkins-slave/workspace/maven-plugins-ITs-m3.0.4/maven-gpg-plugin/target/local-repo/org/apache/maven/plugins/maven-ant-plugin/2.5-SNAPSHOT/maven-ant-plugin-2.5-SNAPSHOT.jar
[INFO] Installing /x1/jenkins/jenkins-slave/workspace/maven-plugins-ITs-m3.0.4/maven-antrun-plugin/pom.xml
to /x1/jenkins/jenkins-slave/workspace/maven-plugins-ITs-m3.0.4/maven-gpg-plugin/target/local-repo/org/apache/maven/plugins/maven-antrun-plugin/1.9-SNAPSHOT/maven-antrun-plugin-1.9-SNAPSHOT.pom
[INFO] Installing /x1/jenkins/jenkins-slave/workspace/maven-plugins-ITs-m3.0.4/maven-antrun-plugin/target/maven-antrun-plugin-1.9-SNAPSHOT.jar
to /x1/jenkins/jenkins-slave/workspace/maven-plugins-ITs-m3.0.4/maven-gpg-plugin/target/local-repo/org/apache/maven/plugins/maven-antrun-plugin/1.9-SNAPSHOT/maven-antrun-plugin-1.9-SNAPSHOT.jar
[INFO] Installing /x1/jenkins/jenkins-slave/workspace/maven-plugins-ITs-m3.0.4/maven-eclipse-plugin/pom.xml
to /x1/jenkins/jenkins-slave/workspace/maven-plugins-ITs-m3.0.4/maven-gpg-plugin/target/local-repo/org/apache/maven/plugins/maven-eclipse-plugin/3.0-SNAPSHOT/maven-eclipse-plugin-3.0-SNAPSHOT.pom
[INFO] Installing /x1/jenkins/jenkins-slave/workspace/maven-plugins-ITs-m3.0.4/maven-eclipse-plugin/target/maven-eclipse-plugin-3.0-SNAPSHOT.jar
to /x1/jenkins/jenkins-slave/workspace/maven-plugins-ITs-m3.0.4/maven-gpg-plugin/target/local-repo/org/apache/maven/plugins/maven-eclipse-plugin/3.0-SNAPSHOT/maven-eclipse-plugin-3.0-SNAPSHOT.jar
[INFO] Installing /x1/jenkins/jenkins-slave/workspace/maven-plugins-ITs-m3.0.4/maven-changelog-plugin/pom.xml
to /x1/jenkins/jenkins-slave/workspace/maven-plugins-ITs-m3.0.4/maven-gpg-plugin/target/local-repo/org/apache/maven/plugins/maven-changelog-plugin/2.4-SNAPSHOT/maven-changelog-plugin-2.4-SNAPSHOT.pom
[INFO] Installing /x1/jenkins/jenkins-slave/workspace/maven-plugins-ITs-m3.0.4/maven-changelog-plugin/target/maven-changelog-plugin-2.4-SNAPSHOT.jar
to /x1/jenkins/jenkins-slave/workspace/maven-plugins-ITs-m3.0.4/maven-gpg-plugin/target/local-repo/org/apache/maven/plugins/maven-changelog-plugin/2.4-SNAPSHOT/maven-changelog-plugin-2.4-SNAPSHOT.jar
[INFO] Installing /x1/jenkins/jenkins-slave/workspace/maven-plugins-ITs-m3.0.4/maven-changes-plugin/pom.xml
to /x1/jenkins/jenkins-slave/workspace/maven-plugins-ITs-m3.0.4/maven-gpg-plugin/target/local-repo/org/apache/maven/plugins/maven-changes-plugin/2.12-SNAPSHOT/maven-changes-plugin-2.12-SNAPSHOT.pom
[INFO]                                                                         
[INFO] ------------------------------------------------------------------------
[INFO] Building Apache Maven Plugins Aggregator 1-SNAPSHOT
[INFO] ------------------------------------------------------------------------
[INFO] 
[INFO] --- maven-clean-plugin:2.5:clean (default-clean) @ maven-plugins-aggregator ---
[INFO] Deleting /x1/jenkins/jenkins-slave/workspace/maven-plugins-ITs-m3.0.4/target
[INFO] 
[INFO] --- maven-enforcer-plugin:1.3.1:enforce (enforce-bytecode-version) @ maven-plugins-aggregator
---
[INFO] 
[INFO] --- maven-enforcer-plugin:1.3.1:enforce (ban-known-bad-maven-versions) @ maven-plugins-aggregator
---
[INFO] 
[INFO] --- maven-remote-resources-plugin:1.5:process (default) @ maven-plugins-aggregator
---
[INFO] 
[INFO] --- maven-site-plugin:3.3:attach-descriptor (attach-descriptor) @ maven-plugins-aggregator
---
[INFO] 
[INFO] --- maven-install-plugin:2.5.1:install (default-install) @ maven-plugins-aggregator
---
[INFO] Installing /x1/jenkins/jenkins-slave/workspace/maven-plugins-ITs-m3.0.4/pom.xml to
/home/jenkins/.m2/repository/org/apache/maven/plugins/maven-plugins-aggregator/1-SNAPSHOT/maven-plugins-aggregator-1-SNAPSHOT.pom
[INFO] ------------------------------------------------------------------------
[INFO] Reactor Summary:
[INFO] 
[INFO] Apache Maven ACR Plugin ........................... SUCCESS [1:12.729s]
[INFO] Apache Maven Ant Plugin ........................... FAILURE [1:12.042s]
[INFO] Apache Maven AntRun Plugin ........................ FAILURE [52.503s]
[INFO] Apache Maven Eclipse Plugin ....................... FAILURE [5:31.425s]
[INFO] Apache Maven Changelog Plugin ..................... FAILURE [28.172s]
[INFO] Apache Maven Changes Plugin ....................... FAILURE [9.680s]
[INFO] Apache Maven Clean Plugin ......................... FAILURE [2.546s]
[INFO] Apache Maven Compiler Plugin ...................... FAILURE [10.593s]
[INFO] Apache Maven Deploy Plugin ........................ FAILURE [3.224s]
[INFO] Apache Maven Documentation Checker Plugin ......... FAILURE [1.268s]
[INFO] Apache Maven EAR Plugin ........................... FAILURE [9.680s]
[INFO] Apache Maven EJB Plugin ........................... FAILURE [10.575s]
[INFO] Apache Maven Help Plugin .......................... FAILURE [3.244s]
[INFO] Apache Maven Install Plugin ....................... FAILURE [3.340s]
[INFO] Apache Maven JAR Plugin ........................... FAILURE [3.948s]
[INFO] Apache Maven Jarsigner Plugin ..................... FAILURE [1.963s]
[INFO] Apache Maven Javadoc Plugin ....................... FAILURE [57.776s]
[INFO] Apache Maven Linkcheck Plugin ..................... FAILURE [3.125s]
[INFO] Apache Maven Patch Plugin ......................... FAILURE [0.699s]
[INFO] Apache Maven PDF Plugin ........................... FAILURE [7.116s]
[INFO] Apache Maven RAR Plugin ........................... FAILURE [3.400s]
[INFO] Apache Maven Repository Plugin .................... FAILURE [3.375s]
[INFO] Apache Maven Resources Plugin ..................... FAILURE [4.417s]
[INFO] Apache Maven Site Plugin .......................... FAILURE [23.643s]
[INFO] Apache Maven Source Plugin ........................ FAILURE [4.992s]
[INFO] Apache Maven Stage Plugin ......................... FAILURE [2.120s]
[INFO] Apache Maven Toolchains Plugin .................... FAILURE [1.579s]
[INFO] Apache Maven Verifier Plugin ...................... FAILURE [1.168s]
[INFO] Apache Maven WAR Plugin ........................... FAILURE [15.444s]
[INFO] Apache Maven GPG Plugin ........................... FAILURE [1.217s]
[INFO] Apache Maven Plugins Aggregator ................... SUCCESS [0.254s]
[INFO] ------------------------------------------------------------------------
[INFO] BUILD FAILURE
[INFO] ------------------------------------------------------------------------
[INFO] Total time: 12:28.189s
[INFO] Finished at: Mon Jul 06 22:16:39 GMT 2015
[INFO] Final Memory: 70M/443M
[INFO] ------------------------------------------------------------------------
[WARNING] The requested profile "apache.snapshots" could not be activated because it does
not exist.
[ERROR] Failed to execute goal org.apache.maven.plugins:maven-invoker-plugin:1.9:verify (integration-test)
on project maven-ant-plugin: 1 build failed. See console output above for details. -> [Help
1]
[ERROR] Failed to execute goal org.apache.maven.plugins:maven-invoker-plugin:1.9:verify (integration-test)
on project maven-antrun-plugin: 1 build failed. See console output above for details. ->
[Help 1]
[ERROR] Failed to execute goal org.apache.maven.plugins:maven-failsafe-plugin:2.18.1:verify
(default) on project maven-eclipse-plugin: There are test failures.
[ERROR] 
[ERROR] Please refer to /x1/jenkins/jenkins-slave/workspace/maven-plugins-ITs-m3.0.4/maven-eclipse-plugin/target/failsafe-reports
for the individual test results.
[ERROR] -> [Help 1]
[ERROR] Failed to execute goal org.apache.maven.plugins:maven-invoker-plugin:1.9:verify (integration-test)
on project maven-changelog-plugin: 2 builds failed. See console output above for details.
-> [Help 1]
[ERROR] Failed to execute goal org.apache.maven.plugins:maven-surefire-plugin:2.17:test (default-test)
on project maven-changes-plugin: There are test failures.
[ERROR] 
[ERROR] Please refer to /x1/jenkins/jenkins-slave/workspace/maven-plugins-ITs-m3.0.4/maven-changes-plugin/target/surefire-reports
for the individual test results.
[ERROR] -> [Help 1]
[ERROR] Failed to execute goal org.apache.maven.plugins:maven-invoker-plugin:1.9:install (integration-test)
on project maven-clean-plugin: Failed to install project dependencies: MavenProject: org.apache.maven.plugins:maven-clean-plugin:2.6.2-SNAPSHOT
@ /x1/jenkins/jenkins-slave/workspace/maven-plugins-ITs-m3.0.4/maven-clean-plugin/pom.xml:
Failed to install project artifacts: MavenProject: org.apache.maven.plugins:maven-changes-plugin:2.12-SNAPSHOT
@ /x1/jenkins/jenkins-slave/workspace/maven-plugins-ITs-m3.0.4/maven-changes-plugin/pom.xml:
Failed to install artifact: org.apache.maven.plugins:maven-changes-plugin:maven-plugin:2.12-SNAPSHOT:
Artifact is not fully assembled: /x1/jenkins/jenkins-slave/workspace/maven-plugins-ITs-m3.0.4/maven-changes-plugin/target/classes
-> [Help 2]
[ERROR] Failed to execute goal org.apache.maven.plugins:maven-invoker-plugin:1.9:install (integration-test)
on project maven-compiler-plugin: Failed to install project dependencies: MavenProject: org.apache.maven.plugins:maven-compiler-plugin:3.4-SNAPSHOT
@ /x1/jenkins/jenkins-slave/workspace/maven-plugins-ITs-m3.0.4/maven-compiler-plugin/pom.xml:
Failed to install project artifacts: MavenProject: org.apache.maven.plugins:maven-changes-plugin:2.12-SNAPSHOT
@ /x1/jenkins/jenkins-slave/workspace/maven-plugins-ITs-m3.0.4/maven-changes-plugin/pom.xml:
Failed to install artifact: org.apache.maven.plugins:maven-changes-plugin:maven-plugin:2.12-SNAPSHOT:
Artifact is not fully assembled: /x1/jenkins/jenkins-slave/workspace/maven-plugins-ITs-m3.0.4/maven-changes-plugin/target/classes
-> [Help 2]
[ERROR] Failed to execute goal org.apache.maven.plugins:maven-invoker-plugin:1.9:install (integration-test)
on project maven-deploy-plugin: Failed to install project dependencies: MavenProject: org.apache.maven.plugins:maven-deploy-plugin:2.8.3-SNAPSHOT
@ /x1/jenkins/jenkins-slave/workspace/maven-plugins-ITs-m3.0.4/maven-deploy-plugin/pom.xml:
Failed to install project artifacts: MavenProject: org.apache.maven.plugins:maven-changes-plugin:2.12-SNAPSHOT
@ /x1/jenkins/jenkins-slave/workspace/maven-plugins-ITs-m3.0.4/maven-changes-plugin/pom.xml:
Failed to install artifact: org.apache.maven.plugins:maven-changes-plugin:maven-plugin:2.12-SNAPSHOT:
Artifact is not fully assembled: /x1/jenkins/jenkins-slave/workspace/maven-plugins-ITs-m3.0.4/maven-changes-plugin/target/classes
-> [Help 2]
[ERROR] Failed to execute goal org.apache.maven.plugins:maven-invoker-plugin:1.9:install (integration-test)
on project maven-docck-plugin: Failed to install project dependencies: MavenProject: org.apache.maven.plugins:maven-docck-plugin:1.2-SNAPSHOT
@ /x1/jenkins/jenkins-slave/workspace/maven-plugins-ITs-m3.0.4/maven-docck-plugin/pom.xml:
Failed to install project artifacts: MavenProject: org.apache.maven.plugins:maven-changes-plugin:2.12-SNAPSHOT
@ /x1/jenkins/jenkins-slave/workspace/maven-plugins-ITs-m3.0.4/maven-changes-plugin/pom.xml:
Failed to install artifact: org.apache.maven.plugins:maven-changes-plugin:maven-plugin:2.12-SNAPSHOT:
Artifact is not fully assembled: /x1/jenkins/jenkins-slave/workspace/maven-plugins-ITs-m3.0.4/maven-changes-plugin/target/classes
-> [Help 2]
[ERROR] Failed to execute goal org.apache.maven.plugins:maven-invoker-plugin:1.9:install (integration-test)
on project maven-ear-plugin: Failed to install project dependencies: MavenProject: org.apache.maven.plugins:maven-ear-plugin:2.10.2-SNAPSHOT
@ /x1/jenkins/jenkins-slave/workspace/maven-plugins-ITs-m3.0.4/maven-ear-plugin/pom.xml: Failed
to install project artifacts: MavenProject: org.apache.maven.plugins:maven-changes-plugin:2.12-SNAPSHOT
@ /x1/jenkins/jenkins-slave/workspace/maven-plugins-ITs-m3.0.4/maven-changes-plugin/pom.xml:
Failed to install artifact: org.apache.maven.plugins:maven-changes-plugin:maven-plugin:2.12-SNAPSHOT:
Artifact is not fully assembled: /x1/jenkins/jenkins-slave/workspace/maven-plugins-ITs-m3.0.4/maven-changes-plugin/target/classes
-> [Help 2]
[ERROR] Failed to execute goal org.apache.maven.plugins:maven-invoker-plugin:1.9:install (integration-test)
on project maven-ejb-plugin: Failed to install project dependencies: MavenProject: org.apache.maven.plugins:maven-ejb-plugin:2.5.2-SNAPSHOT
@ /x1/jenkins/jenkins-slave/workspace/maven-plugins-ITs-m3.0.4/maven-ejb-plugin/pom.xml: Failed
to install project artifacts: MavenProject: org.apache.maven.plugins:maven-changes-plugin:2.12-SNAPSHOT
@ /x1/jenkins/jenkins-slave/workspace/maven-plugins-ITs-m3.0.4/maven-changes-plugin/pom.xml:
Failed to install artifact: org.apache.maven.plugins:maven-changes-plugin:maven-plugin:2.12-SNAPSHOT:
Artifact is not fully assembled: /x1/jenkins/jenkins-slave/workspace/maven-plugins-ITs-m3.0.4/maven-changes-plugin/target/classes
-> [Help 2]
[ERROR] Failed to execute goal org.apache.maven.plugins:maven-invoker-plugin:1.9:install (integration-test)
on project maven-help-plugin: Failed to install project dependencies: MavenProject: org.apache.maven.plugins:maven-help-plugin:2.2.1-SNAPSHOT
@ /x1/jenkins/jenkins-slave/workspace/maven-plugins-ITs-m3.0.4/maven-help-plugin/pom.xml:
Failed to install project artifacts: MavenProject: org.apache.maven.plugins:maven-changes-plugin:2.12-SNAPSHOT
@ /x1/jenkins/jenkins-slave/workspace/maven-plugins-ITs-m3.0.4/maven-changes-plugin/pom.xml:
Failed to install artifact: org.apache.maven.plugins:maven-changes-plugin:maven-plugin:2.12-SNAPSHOT:
Artifact is not fully assembled: /x1/jenkins/jenkins-slave/workspace/maven-plugins-ITs-m3.0.4/maven-changes-plugin/target/classes
-> [Help 2]
[ERROR] Failed to execute goal org.apache.maven.plugins:maven-invoker-plugin:1.9:install (integration-test)
on project maven-install-plugin: Failed to install project dependencies: MavenProject: org.apache.maven.plugins:maven-install-plugin:2.5.3-SNAPSHOT
@ /x1/jenkins/jenkins-slave/workspace/maven-plugins-ITs-m3.0.4/maven-install-plugin/pom.xml:
Failed to install project artifacts: MavenProject: org.apache.maven.plugins:maven-changes-plugin:2.12-SNAPSHOT
@ /x1/jenkins/jenkins-slave/workspace/maven-plugins-ITs-m3.0.4/maven-changes-plugin/pom.xml:
Failed to install artifact: org.apache.maven.plugins:maven-changes-plugin:maven-plugin:2.12-SNAPSHOT:
Artifact is not fully assembled: /x1/jenkins/jenkins-slave/workspace/maven-plugins-ITs-m3.0.4/maven-changes-plugin/target/classes
-> [Help 2]
[ERROR] Failed to execute goal org.apache.maven.plugins:maven-invoker-plugin:1.9:install (integration-test)
on project maven-jar-plugin: Failed to install project dependencies: MavenProject: org.apache.maven.plugins:maven-jar-plugin:2.7-SNAPSHOT
@ /x1/jenkins/jenkins-slave/workspace/maven-plugins-ITs-m3.0.4/maven-jar-plugin/pom.xml: Failed
to install project artifacts: MavenProject: org.apache.maven.plugins:maven-changes-plugin:2.12-SNAPSHOT
@ /x1/jenkins/jenkins-slave/workspace/maven-plugins-ITs-m3.0.4/maven-changes-plugin/pom.xml:
Failed to install artifact: org.apache.maven.plugins:maven-changes-plugin:maven-plugin:2.12-SNAPSHOT:
Artifact is not fully assembled: /x1/jenkins/jenkins-slave/workspace/maven-plugins-ITs-m3.0.4/maven-changes-plugin/target/classes
-> [Help 2]
[ERROR] Failed to execute goal org.apache.maven.plugins:maven-invoker-plugin:1.9:install (integration-test)
on project maven-jarsigner-plugin: Failed to install project dependencies: MavenProject: org.apache.maven.plugins:maven-jarsigner-plugin:1.5-SNAPSHOT
@ /x1/jenkins/jenkins-slave/workspace/maven-plugins-ITs-m3.0.4/maven-jarsigner-plugin/pom.xml:
Failed to install project artifacts: MavenProject: org.apache.maven.plugins:maven-changes-plugin:2.12-SNAPSHOT
@ /x1/jenkins/jenkins-slave/workspace/maven-plugins-ITs-m3.0.4/maven-changes-plugin/pom.xml:
Failed to install artifact: org.apache.maven.plugins:maven-changes-plugin:maven-plugin:2.12-SNAPSHOT:
Artifact is not fully assembled: /x1/jenkins/jenkins-slave/workspace/maven-plugins-ITs-m3.0.4/maven-changes-plugin/target/classes
-> [Help 2]
[ERROR] Failed to execute goal org.apache.maven.plugins:maven-surefire-plugin:2.17:test (default-test)
on project maven-javadoc-plugin: There are test failures.
[ERROR] 
[ERROR] Please refer to /x1/jenkins/jenkins-slave/workspace/maven-plugins-ITs-m3.0.4/maven-javadoc-plugin/target/surefire-reports
for the individual test results.
[ERROR] -> [Help 1]
[ERROR] Failed to execute goal org.apache.maven.plugins:maven-invoker-plugin:1.9:install (integration-test)
on project maven-linkcheck-plugin: Failed to install project dependencies: MavenProject: org.apache.maven.plugins:maven-linkcheck-plugin:1.3-SNAPSHOT
@ /x1/jenkins/jenkins-slave/workspace/maven-plugins-ITs-m3.0.4/maven-linkcheck-plugin/pom.xml:
Failed to install project artifacts: MavenProject: org.apache.maven.plugins:maven-changes-plugin:2.12-SNAPSHOT
@ /x1/jenkins/jenkins-slave/workspace/maven-plugins-ITs-m3.0.4/maven-changes-plugin/pom.xml:
Failed to install artifact: org.apache.maven.plugins:maven-changes-plugin:maven-plugin:2.12-SNAPSHOT:
Artifact is not fully assembled: /x1/jenkins/jenkins-slave/workspace/maven-plugins-ITs-m3.0.4/maven-changes-plugin/target/classes
-> [Help 2]
[ERROR] Failed to execute goal org.apache.maven.plugins:maven-invoker-plugin:1.9:install (integration-test)
on project maven-patch-plugin: Failed to install project dependencies: MavenProject: org.apache.maven.plugins:maven-patch-plugin:1.3-SNAPSHOT
@ /x1/jenkins/jenkins-slave/workspace/maven-plugins-ITs-m3.0.4/maven-patch-plugin/pom.xml:
Failed to install project artifacts: MavenProject: org.apache.maven.plugins:maven-changes-plugin:2.12-SNAPSHOT
@ /x1/jenkins/jenkins-slave/workspace/maven-plugins-ITs-m3.0.4/maven-changes-plugin/pom.xml:
Failed to install artifact: org.apache.maven.plugins:maven-changes-plugin:maven-plugin:2.12-SNAPSHOT:
Artifact is not fully assembled: /x1/jenkins/jenkins-slave/workspace/maven-plugins-ITs-m3.0.4/maven-changes-plugin/target/classes
-> [Help 2]
[ERROR] Failed to execute goal org.apache.maven.plugins:maven-surefire-plugin:2.17:test (default-test)
on project maven-pdf-plugin: There are test failures.
[ERROR] 
[ERROR] Please refer to /x1/jenkins/jenkins-slave/workspace/maven-plugins-ITs-m3.0.4/maven-pdf-plugin/target/surefire-reports
for the individual test results.
[ERROR] -> [Help 1]
[ERROR] Failed to execute goal org.apache.maven.plugins:maven-invoker-plugin:1.9:install (integration-test)
on project maven-rar-plugin: Failed to install project dependencies: MavenProject: org.apache.maven.plugins:maven-rar-plugin:2.5-SNAPSHOT
@ /x1/jenkins/jenkins-slave/workspace/maven-plugins-ITs-m3.0.4/maven-rar-plugin/pom.xml: Failed
to install project artifacts: MavenProject: org.apache.maven.plugins:maven-changes-plugin:2.12-SNAPSHOT
@ /x1/jenkins/jenkins-slave/workspace/maven-plugins-ITs-m3.0.4/maven-changes-plugin/pom.xml:
Failed to install artifact: org.apache.maven.plugins:maven-changes-plugin:maven-plugin:2.12-SNAPSHOT:
Artifact is not fully assembled: /x1/jenkins/jenkins-slave/workspace/maven-plugins-ITs-m3.0.4/maven-changes-plugin/target/classes
-> [Help 2]
[ERROR] Failed to execute goal org.apache.maven.plugins:maven-invoker-plugin:1.9:install (integration-test)
on project maven-repository-plugin: Failed to install project dependencies: MavenProject:
org.apache.maven.plugins:maven-repository-plugin:2.5-SNAPSHOT @ /x1/jenkins/jenkins-slave/workspace/maven-plugins-ITs-m3.0.4/maven-repository-plugin/pom.xml:
Failed to install project artifacts: MavenProject: org.apache.maven.plugins:maven-changes-plugin:2.12-SNAPSHOT
@ /x1/jenkins/jenkins-slave/workspace/maven-plugins-ITs-m3.0.4/maven-changes-plugin/pom.xml:
Failed to install artifact: org.apache.maven.plugins:maven-changes-plugin:maven-plugin:2.12-SNAPSHOT:
Artifact is not fully assembled: /x1/jenkins/jenkins-slave/workspace/maven-plugins-ITs-m3.0.4/maven-changes-plugin/target/classes
-> [Help 2]
[ERROR] Failed to execute goal org.apache.maven.plugins:maven-invoker-plugin:1.9:install (integration-test)
on project maven-resources-plugin: Failed to install project dependencies: MavenProject: org.apache.maven.plugins:maven-resources-plugin:2.8-SNAPSHOT
@ /x1/jenkins/jenkins-slave/workspace/maven-plugins-ITs-m3.0.4/maven-resources-plugin/pom.xml:
Failed to install project artifacts: MavenProject: org.apache.maven.plugins:maven-changes-plugin:2.12-SNAPSHOT
@ /x1/jenkins/jenkins-slave/workspace/maven-plugins-ITs-m3.0.4/maven-changes-plugin/pom.xml:
Failed to install artifact: org.apache.maven.plugins:maven-changes-plugin:maven-plugin:2.12-SNAPSHOT:
Artifact is not fully assembled: /x1/jenkins/jenkins-slave/workspace/maven-plugins-ITs-m3.0.4/maven-changes-plugin/target/classes
-> [Help 2]
[ERROR] Failed to execute goal org.apache.maven.plugins:maven-invoker-plugin:1.9:install (integration-test)
on project maven-site-plugin: Failed to install project dependencies: MavenProject: org.apache.maven.plugins:maven-site-plugin:3.4.1-SNAPSHOT
@ /x1/jenkins/jenkins-slave/workspace/maven-plugins-ITs-m3.0.4/maven-site-plugin/dependency-reduced-pom.xml:
Failed to install project artifacts: MavenProject: org.apache.maven.plugins:maven-changes-plugin:2.12-SNAPSHOT
@ /x1/jenkins/jenkins-slave/workspace/maven-plugins-ITs-m3.0.4/maven-changes-plugin/pom.xml:
Failed to install artifact: org.apache.maven.plugins:maven-changes-plugin:maven-plugin:2.12-SNAPSHOT:
Artifact is not fully assembled: /x1/jenkins/jenkins-slave/workspace/maven-plugins-ITs-m3.0.4/maven-changes-plugin/target/classes
-> [Help 2]
[ERROR] Failed to execute goal org.apache.maven.plugins:maven-invoker-plugin:1.9:install (integration-test)
on project maven-source-plugin: Failed to install project dependencies: MavenProject: org.apache.maven.plugins:maven-source-plugin:2.5-SNAPSHOT
@ /x1/jenkins/jenkins-slave/workspace/maven-plugins-ITs-m3.0.4/maven-source-plugin/pom.xml:
Failed to install project artifacts: MavenProject: org.apache.maven.plugins:maven-changes-plugin:2.12-SNAPSHOT
@ /x1/jenkins/jenkins-slave/workspace/maven-plugins-ITs-m3.0.4/maven-changes-plugin/pom.xml:
Failed to install artifact: org.apache.maven.plugins:maven-changes-plugin:maven-plugin:2.12-SNAPSHOT:
Artifact is not fully assembled: /x1/jenkins/jenkins-slave/workspace/maven-plugins-ITs-m3.0.4/maven-changes-plugin/target/classes
-> [Help 2]
[ERROR] Failed to execute goal org.apache.maven.plugins:maven-invoker-plugin:1.9:install (integration-test)
on project maven-stage-plugin: Failed to install project dependencies: MavenProject: org.apache.maven.plugins:maven-stage-plugin:1.1-SNAPSHOT
@ /x1/jenkins/jenkins-slave/workspace/maven-plugins-ITs-m3.0.4/maven-stage-plugin/pom.xml:
Failed to install project artifacts: MavenProject: org.apache.maven.plugins:maven-changes-plugin:2.12-SNAPSHOT
@ /x1/jenkins/jenkins-slave/workspace/maven-plugins-ITs-m3.0.4/maven-changes-plugin/pom.xml:
Failed to install artifact: org.apache.maven.plugins:maven-changes-plugin:maven-plugin:2.12-SNAPSHOT:
Artifact is not fully assembled: /x1/jenkins/jenkins-slave/workspace/maven-plugins-ITs-m3.0.4/maven-changes-plugin/target/classes
-> [Help 2]
[ERROR] Failed to execute goal org.apache.maven.plugins:maven-invoker-plugin:1.9:install (integration-test)
on project maven-toolchains-plugin: Failed to install project dependencies: MavenProject:
org.apache.maven.plugins:maven-toolchains-plugin:1.2-SNAPSHOT @ /x1/jenkins/jenkins-slave/workspace/maven-plugins-ITs-m3.0.4/maven-toolchains-plugin/pom.xml:
Failed to install project artifacts: MavenProject: org.apache.maven.plugins:maven-changes-plugin:2.12-SNAPSHOT
@ /x1/jenkins/jenkins-slave/workspace/maven-plugins-ITs-m3.0.4/maven-changes-plugin/pom.xml:
Failed to install artifact: org.apache.maven.plugins:maven-changes-plugin:maven-plugin:2.12-SNAPSHOT:
Artifact is not fully assembled: /x1/jenkins/jenkins-slave/workspace/maven-plugins-ITs-m3.0.4/maven-changes-plugin/target/classes
-> [Help 2]
[ERROR] Failed to execute goal org.apache.maven.plugins:maven-invoker-plugin:1.10:install
(integration-test) on project maven-verifier-plugin: Failed to install project dependencies:
MavenProject: org.apache.maven.plugins:maven-verifier-plugin:1.2-SNAPSHOT @ /x1/jenkins/jenkins-slave/workspace/maven-plugins-ITs-m3.0.4/maven-verifier-plugin/pom.xml:
Failed to install project artifacts: MavenProject: org.apache.maven.plugins:maven-changes-plugin:2.12-SNAPSHOT
@ /x1/jenkins/jenkins-slave/workspace/maven-plugins-ITs-m3.0.4/maven-changes-plugin/pom.xml:
Failed to install artifact: org.apache.maven.plugins:maven-changes-plugin:maven-plugin:2.12-SNAPSHOT:
Artifact is not fully assembled: /x1/jenkins/jenkins-slave/workspace/maven-plugins-ITs-m3.0.4/maven-changes-plugin/target/classes
-> [Help 2]
[ERROR] Failed to execute goal org.apache.maven.plugins:maven-invoker-plugin:1.10:install
(integration-test) on project maven-war-plugin: Failed to install project dependencies: MavenProject:
org.apache.maven.plugins:maven-war-plugin:2.7-SNAPSHOT @ /x1/jenkins/jenkins-slave/workspace/maven-plugins-ITs-m3.0.4/maven-war-plugin/pom.xml:
Failed to install project artifacts: MavenProject: org.apache.maven.plugins:maven-changes-plugin:2.12-SNAPSHOT
@ /x1/jenkins/jenkins-slave/workspace/maven-plugins-ITs-m3.0.4/maven-changes-plugin/pom.xml:
Failed to install artifact: org.apache.maven.plugins:maven-changes-plugin:maven-plugin:2.12-SNAPSHOT:
Artifact is not fully assembled: /x1/jenkins/jenkins-slave/workspace/maven-plugins-ITs-m3.0.4/maven-changes-plugin/target/classes
-> [Help 2]
[ERROR] Failed to execute goal org.apache.maven.plugins:maven-invoker-plugin:1.9:install (integration-test)
on project maven-gpg-plugin: Failed to install project dependencies: MavenProject: org.apache.maven.plugins:maven-gpg-plugin:1.7-SNAPSHOT
@ /x1/jenkins/jenkins-slave/workspace/maven-plugins-ITs-m3.0.4/maven-gpg-plugin/pom.xml: Failed
to install project artifacts: MavenProject: org.apache.maven.plugins:maven-changes-plugin:2.12-SNAPSHOT
@ /x1/jenkins/jenkins-slave/workspace/maven-plugins-ITs-m3.0.4/maven-changes-plugin/pom.xml:
Failed to install artifact: org.apache.maven.plugins:maven-changes-plugin:maven-plugin:2.12-SNAPSHOT:
Artifact is not fully assembled: /x1/jenkins/jenkins-slave/workspace/maven-plugins-ITs-m3.0.4/maven-changes-plugin/target/classes
-> [Help 2]
[ERROR] 
[ERROR] To see the full stack trace of the errors, re-run Maven with the -e switch.
[ERROR] Re-run Maven using the -X switch to enable full debug logging.
[ERROR] 
[ERROR] For more information about the errors and possible solutions, please read the following
articles:
[ERROR] [Help 1] http://cwiki.apache.org/confluence/display/MAVEN/MojoFailureException
[ERROR] [Help 2] http://cwiki.apache.org/confluence/display/MAVEN/MojoExecutionException
[ERROR] 
[ERROR] After correcting the problems, you can resume the build with the command
[ERROR]   mvn <goals> -rf :maven-ant-plugin
Build step 'Invoke top-level Maven targets' marked build as failure
Recording test results

Mime
View raw message