maven-notifications mailing list archives

Site index · List index
Message view « Date » · « Thread »
Top « Date » · « Thread »
From Apache Jenkins Server <jenk...@builds.apache.org>
Subject Build failed in Jenkins: core-it-maven-3-win #997
Date Sun, 04 Oct 2015 14:19:56 GMT
See <https://builds.apache.org/job/core-it-maven-3-win/997/changes>

Changes:

[Robert Scholte] [MNG-5901] Export org.eclipse.aether.util.artifact.SubArtifact

------------------------------------------
[...truncated 11425 lines...]
Number of foreign imports: 1
import: Entry[import  from realm ClassRealm[maven.api, parent: null]]

-----------------------------------------------------

	at org.apache.maven.plugin.DefaultBuildPluginManager.executeMojo(DefaultBuildPluginManager.java:168)
	at org.apache.maven.lifecycle.internal.MojoExecutor.execute(MojoExecutor.java:207)
	... 20 more
Caused by: org.apache.maven.plugin.PluginContainerException: A required class was missing
while executing org.apache.maven.plugins:maven-site-plugin:3.3:site: org/eclipse/aether/util/filter/ExclusionsDependencyFilter
-----------------------------------------------------
realm =    plugin>org.apache.maven.plugins:maven-site-plugin:3.3
strategy = org.codehaus.plexus.classworlds.strategy.SelfFirstStrategy
urls[0] = <https://builds.apache.org/job/core-it-maven-3-win/ws/it-local-repo/org/apache/maven/plugins/maven-site-plugin/3.3/maven-site-plugin-3.3.jar>
urls[1] = <https://builds.apache.org/job/core-it-maven-3-win/ws/it-local-repo/org/apache/maven/reporting/maven-reporting-exec/1.1/maven-reporting-exec-1.1.jar>
urls[2] = <https://builds.apache.org/job/core-it-maven-3-win/ws/it-local-repo/org/apache/maven/reporting/maven-reporting-api/3.0/maven-reporting-api-3.0.jar>
urls[3] = <https://builds.apache.org/job/core-it-maven-3-win/ws/it-local-repo/org/apache/maven/shared/maven-shared-utils/0.3/maven-shared-utils-0.3.jar>
urls[4] = <https://builds.apache.org/job/core-it-maven-3-win/ws/it-local-repo/com/google/code/findbugs/jsr305/2.0.1/jsr305-2.0.1.jar>
urls[5] = <https://builds.apache.org/job/core-it-maven-3-win/ws/it-local-repo/org/codehaus/plexus/plexus-component-annotations/1.5.5/plexus-component-annotations-1.5.5.jar>
urls[6] = <https://builds.apache.org/job/core-it-maven-3-win/ws/it-local-repo/org/sonatype/aether/aether-util/1.7/aether-util-1.7.jar>
urls[7] = <https://builds.apache.org/job/core-it-maven-3-win/ws/it-local-repo/org/sonatype/sisu/sisu-inject-bean/1.4.2/sisu-inject-bean-1.4.2.jar>
urls[8] = <https://builds.apache.org/job/core-it-maven-3-win/ws/it-local-repo/org/sonatype/sisu/sisu-guice/2.1.7/sisu-guice-2.1.7-noaop.jar>
urls[9] = <https://builds.apache.org/job/core-it-maven-3-win/ws/it-local-repo/org/codehaus/plexus/plexus-interpolation/1.14/plexus-interpolation-1.14.jar>
urls[10] = <https://builds.apache.org/job/core-it-maven-3-win/ws/it-local-repo/org/sonatype/plexus/plexus-sec-dispatcher/1.3/plexus-sec-dispatcher-1.3.jar>
urls[11] = <https://builds.apache.org/job/core-it-maven-3-win/ws/it-local-repo/org/sonatype/plexus/plexus-cipher/1.4/plexus-cipher-1.4.jar>
urls[12] = <https://builds.apache.org/job/core-it-maven-3-win/ws/it-local-repo/org/apache/maven/maven-archiver/2.4.2/maven-archiver-2.4.2.jar>
urls[13] = <https://builds.apache.org/job/core-it-maven-3-win/ws/it-local-repo/org/apache/maven/doxia/doxia-sink-api/1.4/doxia-sink-api-1.4.jar>
urls[14] = <https://builds.apache.org/job/core-it-maven-3-win/ws/it-local-repo/org/apache/maven/doxia/doxia-logging-api/1.4/doxia-logging-api-1.4.jar>
urls[15] = <https://builds.apache.org/job/core-it-maven-3-win/ws/it-local-repo/junit/junit/3.8.1/junit-3.8.1.jar>
urls[16] = <https://builds.apache.org/job/core-it-maven-3-win/ws/it-local-repo/org/apache/maven/doxia/doxia-core/1.4/doxia-core-1.4.jar>
urls[17] = <https://builds.apache.org/job/core-it-maven-3-win/ws/it-local-repo/xerces/xercesImpl/2.9.1/xercesImpl-2.9.1.jar>
urls[18] = <https://builds.apache.org/job/core-it-maven-3-win/ws/it-local-repo/xml-apis/xml-apis/1.3.04/xml-apis-1.3.04.jar>
urls[19] = <https://builds.apache.org/job/core-it-maven-3-win/ws/it-local-repo/org/apache/httpcomponents/httpclient/4.0.2/httpclient-4.0.2.jar>
urls[20] = <https://builds.apache.org/job/core-it-maven-3-win/ws/it-local-repo/commons-logging/commons-logging/1.1.1/commons-logging-1.1.1.jar>
urls[21] = <https://builds.apache.org/job/core-it-maven-3-win/ws/it-local-repo/commons-codec/commons-codec/1.3/commons-codec-1.3.jar>
urls[22] = <https://builds.apache.org/job/core-it-maven-3-win/ws/it-local-repo/org/apache/httpcomponents/httpcore/4.0.1/httpcore-4.0.1.jar>
urls[23] = <https://builds.apache.org/job/core-it-maven-3-win/ws/it-local-repo/org/apache/maven/doxia/doxia-module-xhtml/1.4/doxia-module-xhtml-1.4.jar>
urls[24] = <https://builds.apache.org/job/core-it-maven-3-win/ws/it-local-repo/org/apache/maven/doxia/doxia-module-apt/1.4/doxia-module-apt-1.4.jar>
urls[25] = <https://builds.apache.org/job/core-it-maven-3-win/ws/it-local-repo/org/apache/maven/doxia/doxia-module-xdoc/1.4/doxia-module-xdoc-1.4.jar>
urls[26] = <https://builds.apache.org/job/core-it-maven-3-win/ws/it-local-repo/org/apache/maven/doxia/doxia-module-fml/1.4/doxia-module-fml-1.4.jar>
urls[27] = <https://builds.apache.org/job/core-it-maven-3-win/ws/it-local-repo/org/apache/maven/doxia/doxia-module-markdown/1.4/doxia-module-markdown-1.4.jar>
urls[28] = <https://builds.apache.org/job/core-it-maven-3-win/ws/it-local-repo/org/pegdown/pegdown/1.2.1/pegdown-1.2.1.jar>
urls[29] = <https://builds.apache.org/job/core-it-maven-3-win/ws/it-local-repo/org/parboiled/parboiled-java/1.1.4/parboiled-java-1.1.4.jar>
urls[30] = <https://builds.apache.org/job/core-it-maven-3-win/ws/it-local-repo/org/parboiled/parboiled-core/1.1.4/parboiled-core-1.1.4.jar>
urls[31] = <https://builds.apache.org/job/core-it-maven-3-win/ws/it-local-repo/org/ow2/asm/asm/4.1/asm-4.1.jar>
urls[32] = <https://builds.apache.org/job/core-it-maven-3-win/ws/it-local-repo/org/ow2/asm/asm-tree/4.1/asm-tree-4.1.jar>
urls[33] = <https://builds.apache.org/job/core-it-maven-3-win/ws/it-local-repo/org/ow2/asm/asm-analysis/4.1/asm-analysis-4.1.jar>
urls[34] = <https://builds.apache.org/job/core-it-maven-3-win/ws/it-local-repo/org/ow2/asm/asm-util/4.1/asm-util-4.1.jar>
urls[35] = <https://builds.apache.org/job/core-it-maven-3-win/ws/it-local-repo/javax/servlet/servlet-api/2.5/servlet-api-2.5.jar>
urls[36] = <https://builds.apache.org/job/core-it-maven-3-win/ws/it-local-repo/org/apache/maven/doxia/doxia-decoration-model/1.4/doxia-decoration-model-1.4.jar>
urls[37] = <https://builds.apache.org/job/core-it-maven-3-win/ws/it-local-repo/org/apache/maven/doxia/doxia-site-renderer/1.4/doxia-site-renderer-1.4.jar>
urls[38] = <https://builds.apache.org/job/core-it-maven-3-win/ws/it-local-repo/org/apache/velocity/velocity-tools/2.0/velocity-tools-2.0.jar>
urls[39] = <https://builds.apache.org/job/core-it-maven-3-win/ws/it-local-repo/commons-beanutils/commons-beanutils/1.7.0/commons-beanutils-1.7.0.jar>
urls[40] = <https://builds.apache.org/job/core-it-maven-3-win/ws/it-local-repo/commons-digester/commons-digester/1.8/commons-digester-1.8.jar>
urls[41] = <https://builds.apache.org/job/core-it-maven-3-win/ws/it-local-repo/commons-chain/commons-chain/1.1/commons-chain-1.1.jar>
urls[42] = <https://builds.apache.org/job/core-it-maven-3-win/ws/it-local-repo/commons-validator/commons-validator/1.3.1/commons-validator-1.3.1.jar>
urls[43] = <https://builds.apache.org/job/core-it-maven-3-win/ws/it-local-repo/dom4j/dom4j/1.1/dom4j-1.1.jar>
urls[44] = <https://builds.apache.org/job/core-it-maven-3-win/ws/it-local-repo/sslext/sslext/1.2-0/sslext-1.2-0.jar>
urls[45] = <https://builds.apache.org/job/core-it-maven-3-win/ws/it-local-repo/org/apache/struts/struts-core/1.3.8/struts-core-1.3.8.jar>
urls[46] = <https://builds.apache.org/job/core-it-maven-3-win/ws/it-local-repo/antlr/antlr/2.7.2/antlr-2.7.2.jar>
urls[47] = <https://builds.apache.org/job/core-it-maven-3-win/ws/it-local-repo/org/apache/struts/struts-taglib/1.3.8/struts-taglib-1.3.8.jar>
urls[48] = <https://builds.apache.org/job/core-it-maven-3-win/ws/it-local-repo/org/apache/struts/struts-tiles/1.3.8/struts-tiles-1.3.8.jar>
urls[49] = <https://builds.apache.org/job/core-it-maven-3-win/ws/it-local-repo/commons-collections/commons-collections/3.2.1/commons-collections-3.2.1.jar>
urls[50] = <https://builds.apache.org/job/core-it-maven-3-win/ws/it-local-repo/org/apache/maven/doxia/doxia-integration-tools/1.5/doxia-integration-tools-1.5.jar>
urls[51] = <https://builds.apache.org/job/core-it-maven-3-win/ws/it-local-repo/org/codehaus/plexus/plexus-archiver/1.0/plexus-archiver-1.0.jar>
urls[52] = <https://builds.apache.org/job/core-it-maven-3-win/ws/it-local-repo/org/codehaus/plexus/plexus-io/1.0/plexus-io-1.0.jar>
urls[53] = <https://builds.apache.org/job/core-it-maven-3-win/ws/it-local-repo/org/codehaus/plexus/plexus-i18n/1.0-beta-7/plexus-i18n-1.0-beta-7.jar>
urls[54] = <https://builds.apache.org/job/core-it-maven-3-win/ws/it-local-repo/org/apache/velocity/velocity/1.5/velocity-1.5.jar>
urls[55] = <https://builds.apache.org/job/core-it-maven-3-win/ws/it-local-repo/oro/oro/2.0.8/oro-2.0.8.jar>
urls[56] = <https://builds.apache.org/job/core-it-maven-3-win/ws/it-local-repo/org/codehaus/plexus/plexus-velocity/1.1.8/plexus-velocity-1.1.8.jar>
urls[57] = <https://builds.apache.org/job/core-it-maven-3-win/ws/it-local-repo/org/codehaus/plexus/plexus-utils/1.5.10/plexus-utils-1.5.10.jar>
urls[58] = <https://builds.apache.org/job/core-it-maven-3-win/ws/it-local-repo/org/mortbay/jetty/jetty/6.1.25/jetty-6.1.25.jar>
urls[59] = <https://builds.apache.org/job/core-it-maven-3-win/ws/it-local-repo/org/mortbay/jetty/servlet-api/2.5-20081211/servlet-api-2.5-20081211.jar>
urls[60] = <https://builds.apache.org/job/core-it-maven-3-win/ws/it-local-repo/org/mortbay/jetty/jetty-util/6.1.25/jetty-util-6.1.25.jar>
urls[61] = <https://builds.apache.org/job/core-it-maven-3-win/ws/it-local-repo/commons-lang/commons-lang/2.5/commons-lang-2.5.jar>
urls[62] = <https://builds.apache.org/job/core-it-maven-3-win/ws/it-local-repo/commons-io/commons-io/1.4/commons-io-1.4.jar>
Number of foreign imports: 1
import: Entry[import  from realm ClassRealm[maven.api, parent: null]]

-----------------------------------------------------

	at org.apache.maven.plugin.DefaultBuildPluginManager.executeMojo(DefaultBuildPluginManager.java:166)
	... 21 more
Caused by: java.lang.NoClassDefFoundError: org/eclipse/aether/util/filter/ExclusionsDependencyFilter
	at org.apache.maven.reporting.exec.DefaultMavenPluginManagerHelper.createExclusionsDependencyFilter(DefaultMavenPluginManagerHelper.java:124)
	at org.apache.maven.reporting.exec.DefaultMavenPluginManagerHelper.setupPluginRealm(DefaultMavenPluginManagerHelper.java:186)
	at org.apache.maven.reporting.exec.DefaultMavenReportExecutor.buildReportPlugin(DefaultMavenReportExecutor.java:243)
	at org.apache.maven.reporting.exec.DefaultMavenReportExecutor.buildMavenReports(DefaultMavenReportExecutor.java:154)
	at org.apache.maven.plugins.site.AbstractSiteRenderingMojo.getReports(AbstractSiteRenderingMojo.java:235)
	at org.apache.maven.plugins.site.SiteMojo.execute(SiteMojo.java:121)
	at org.apache.maven.plugin.DefaultBuildPluginManager.executeMojo(DefaultBuildPluginManager.java:134)
	... 21 more
Caused by: java.lang.ClassNotFoundException: org.eclipse.aether.util.filter.ExclusionsDependencyFilter
	at org.codehaus.plexus.classworlds.strategy.SelfFirstStrategy.loadClass(SelfFirstStrategy.java:50)
	at org.codehaus.plexus.classworlds.realm.ClassRealm.unsynchronizedLoadClass(ClassRealm.java:271)
	at org.codehaus.plexus.classworlds.realm.ClassRealm.loadClass(ClassRealm.java:247)
	at org.codehaus.plexus.classworlds.realm.ClassRealm.loadClass(ClassRealm.java:239)
	... 28 more
[ERROR] 
[ERROR] Re-run Maven using the -X switch to enable full debug logging.
[ERROR] 
[ERROR] For more information about the errors and possible solutions, please read the following
articles:
[ERROR] [Help 1] http://cwiki.apache.org/confluence/display/MAVEN/PluginContainerException

	at org.apache.maven.it.Verifier.executeGoals(Verifier.java:1369)
	at org.apache.maven.it.Verifier.executeGoal(Verifier.java:1254)
	at org.apache.maven.it.Verifier.executeGoal(Verifier.java:1248)
	at org.apache.maven.it.MavenITmng3684BuildPluginParameterTest.testitMNG3684(MavenITmng3684BuildPluginParameterTest.java:63)


Results :

Tests in error: 
  MavenITmng5019StringBasedCompLookupFromChildPluginRealmTest>AbstractMavenIntegrationTestCase.runTest:219->testit:56
» Verification
  MavenITmng3703ExecutionProjectWithRelativePathsTest>AbstractMavenIntegrationTestCase.runTest:219->testForkFromReport:86
» Verification
  MavenITmng3684BuildPluginParameterTest>AbstractMavenIntegrationTestCase.runTest:219->testitMNG3684:63
» Verification

Tests run: 767, Failures: 0, Errors: 3, Skipped: 0

[INFO] ------------------------------------------------------------------------
[INFO] Reactor Summary:
[INFO] 
[INFO] Maven Core ITs .................................... SUCCESS [48.031s]
[INFO] Maven IT Support .................................. SUCCESS [1.029s]
[INFO] Maven IT :: Plugins ............................... SUCCESS [0.664s]
[INFO] Maven IT Plugin :: Active Collection .............. SUCCESS [9.379s]
[INFO] Maven IT Plugin :: Ant-Based ...................... SUCCESS [6.346s]
[INFO] Maven IT Plugin :: Artifact ....................... SUCCESS [3.273s]
[INFO] Maven IT Plugin :: Class Loader :: Dependency A ... SUCCESS [0.568s]
[INFO] Maven IT Plugin :: Class Loader :: Dependency B ... SUCCESS [0.847s]
[INFO] Maven IT Plugin :: Class Loader :: Dependency C ... SUCCESS [0.570s]
[INFO] Maven IT Plugin :: Class Loader ................... SUCCESS [2.353s]
[INFO] Maven IT Plugin :: Class Loader :: Aggregator ..... SUCCESS [0.408s]
[INFO] Maven IT Plugin :: Configuration .................. SUCCESS [1.403s]
[INFO] Maven IT Plugin :: Context Passing ................ SUCCESS [0.565s]
[INFO] Maven ITs :: Core Plugin Stubs .................... SUCCESS [0.443s]
[INFO] Maven IT Clean Plugin Stub ........................ SUCCESS [0.973s]
[INFO] Maven IT Compiler Plugin Stub ..................... SUCCESS [1.000s]
[INFO] Maven IT Deploy Plugin Stub ....................... SUCCESS [1.119s]
[INFO] Maven IT EAR Plugin Stub .......................... SUCCESS [0.681s]
[INFO] Maven IT EJB Plugin Stub .......................... SUCCESS [0.692s]
[INFO] Maven IT Install Plugin Stub ...................... SUCCESS [0.654s]
[INFO] Maven IT JAR Plugin Stub .......................... SUCCESS [0.724s]
[INFO] Maven IT Javadoc Plugin Stub ...................... SUCCESS [0.674s]
[INFO] Maven IT Plugin Plugin Stub ....................... SUCCESS [0.767s]
[INFO] Maven IT RAR Plugin Stub .......................... SUCCESS [0.639s]
[INFO] Maven IT Resources Plugin Stub .................... SUCCESS [0.728s]
[INFO] Maven IT Site Plugin Stub ......................... SUCCESS [0.794s]
[INFO] Maven IT Source Plugin Stub ....................... SUCCESS [0.595s]
[INFO] Maven IT Surefire Plugin Stub ..................... SUCCESS [0.817s]
[INFO] Maven IT WAR Plugin Stub .......................... SUCCESS [0.645s]
[INFO] Maven IT Plugin :: Dependency Collection .......... SUCCESS [1.287s]
[INFO] Maven IT Plugin :: Dependency Resolution .......... SUCCESS [6.187s]
[INFO] Maven IT Plugin :: Expression ..................... SUCCESS [1.319s]
[INFO] Maven IT Plugin :: Error Mojos .................... SUCCESS [2.351s]
[INFO] Maven IT Component ................................ SUCCESS [0.520s]
[INFO] Maven IT Plugin :: Extension Consumer ............. SUCCESS [0.558s]
[INFO] Maven IT Plugin :: Extension Provider ............. SUCCESS [0.769s]
[INFO] Maven IT Plugin :: Fork ........................... SUCCESS [0.667s]
[INFO] Maven IT Plugin :: Invalid Descriptor ............. SUCCESS [0.503s]
[INFO] Maven IT Plugin :: Log File ....................... SUCCESS [0.539s]
[INFO] Maven IT Helper Library ........................... SUCCESS [1.756s]
[INFO] Maven IT Plugin :: Model Interpolation ............ SUCCESS [1.077s]
[INFO] Maven IT Plugin :: No Default Component ........... SUCCESS [0.649s]
[INFO] Maven IT Plugin :: No Project ..................... SUCCESS [0.563s]
[INFO] Maven IT Plugin :: Online ......................... SUCCESS [0.689s]
[INFO] Maven IT Plugin :: Optional Mojos ................. SUCCESS [0.582s]
[INFO] Maven IT Plugin :: Packaging ...................... SUCCESS [0.579s]
[INFO] Maven IT Plugin :: Parameter Implementation ....... SUCCESS [0.513s]
[INFO] Maven IT Plugin :: Plugin Dependency .............. SUCCESS [0.567s]
[INFO] Maven IT Plugin :: Project ........................ SUCCESS [0.810s]
[INFO] Maven IT Plugin :: Project Interpolation .......... SUCCESS [0.804s]
[INFO] Maven IT Plugin :: Setter ......................... SUCCESS [0.494s]
[INFO] Maven IT Plugin :: Singleton Component ............ SUCCESS [0.874s]
[INFO] Maven IT Plugin :: Site ........................... SUCCESS [2.636s]
[INFO] Maven IT Plugin :: Toolchain ...................... SUCCESS [5.917s]
[INFO] Maven IT Plugin :: Touch .......................... SUCCESS [0.878s]
[INFO] Maven IT Plugin :: Uses Properties Plugin ......... SUCCESS [0.435s]
[INFO] Maven IT Plugin :: Uses Wagon Plugin .............. SUCCESS [4.192s]
[INFO] Maven IT Plugin :: This plugin should contain the mojos needed by all tests.  SUCCESS
[0.434s]
[INFO] Maven IT Plugin :: Plexus Utils 1.1 ............... SUCCESS [0.746s]
[INFO] Maven IT Plugin :: Plexus Utils New ............... SUCCESS [0.642s]
[INFO] Maven IT Plugin :: Plexus Component API ........... SUCCESS [1.552s]
[INFO] Maven IT Plugin :: Log4J Client ................... SUCCESS [0.963s]
[INFO] Maven IT Plugin :: Extension 1 .................... SUCCESS [0.446s]
[INFO] Maven IT Plugin :: Extension 2 .................... SUCCESS [0.435s]
[INFO] Maven IT Plugin :: Plexus Lifecycle ............... SUCCESS [1.737s]
[INFO] Maven IT Plugin :: Settings ....................... SUCCESS [0.639s]
[INFO] Maven IT Plugin :: mng-5805 extension ............. SUCCESS [0.376s]
[INFO] Maven IT Plugin :: mng-5805 plugin ................ SUCCESS [0.549s]
[INFO] Maven IT Plugin :: mng-5805 plugin-dep ............ SUCCESS [0.459s]
[INFO] Maven IT Toolchain ................................ SUCCESS [0.910s]
[INFO] Maven IT Wagon .................................... SUCCESS [1.268s]
[INFO] Maven IT Support Artifacts ........................ SUCCESS [2.390s]
[INFO] Maven IT Extension ................................ SUCCESS [0.639s]
[INFO] Maven ITs ......................................... FAILURE [46:12.641s]
[INFO] ------------------------------------------------------------------------
[INFO] BUILD FAILURE
[INFO] ------------------------------------------------------------------------
[INFO] Total time: 48:35.874s
[INFO] Finished at: Sun Oct 04 07:20:28 PDT 2015
[INFO] Final Memory: 48M/742M
[INFO] ------------------------------------------------------------------------
[ERROR] Failed to execute goal org.apache.maven.plugins:maven-surefire-plugin:2.17:test (default-test)
on project core-it-suite: There are test failures.
[ERROR] 
[ERROR] Please refer to F:\ws\m3-its\core-integration-testing-trunk\core-it-suite\target\surefire-reports
for the individual test results.
[ERROR] -> [Help 1]
org.apache.maven.lifecycle.LifecycleExecutionException: Failed to execute goal org.apache.maven.plugins:maven-surefire-plugin:2.17:test
(default-test) on project core-it-suite: There are test failures.

Please refer to F:\ws\m3-its\core-integration-testing-trunk\core-it-suite\target\surefire-reports
for the individual test results.
	at org.apache.maven.lifecycle.internal.MojoExecutor.execute(MojoExecutor.java:213)
	at org.apache.maven.lifecycle.internal.MojoExecutor.execute(MojoExecutor.java:153)
	at org.apache.maven.lifecycle.internal.MojoExecutor.execute(MojoExecutor.java:145)
	at org.apache.maven.lifecycle.internal.LifecycleModuleBuilder.buildProject(LifecycleModuleBuilder.java:84)
	at org.apache.maven.lifecycle.internal.LifecycleModuleBuilder.buildProject(LifecycleModuleBuilder.java:59)
	at org.apache.maven.lifecycle.internal.LifecycleStarter.singleThreadedBuild(LifecycleStarter.java:183)
	at org.apache.maven.lifecycle.internal.LifecycleStarter.execute(LifecycleStarter.java:161)
	at org.apache.maven.DefaultMaven.doExecute(DefaultMaven.java:320)
	at org.apache.maven.DefaultMaven.execute(DefaultMaven.java:156)
	at org.apache.maven.cli.MavenCli.execute(MavenCli.java:537)
	at org.apache.maven.cli.MavenCli.doMain(MavenCli.java:196)
	at org.apache.maven.cli.MavenCli.main(MavenCli.java:141)
	at sun.reflect.NativeMethodAccessorImpl.invoke0(Native Method)
	at sun.reflect.NativeMethodAccessorImpl.invoke(NativeMethodAccessorImpl.java:57)
	at sun.reflect.DelegatingMethodAccessorImpl.invoke(DelegatingMethodAccessorImpl.java:43)
	at java.lang.reflect.Method.invoke(Method.java:601)
	at org.codehaus.plexus.classworlds.launcher.Launcher.launchEnhanced(Launcher.java:290)
	at org.codehaus.plexus.classworlds.launcher.Launcher.launch(Launcher.java:230)
	at org.codehaus.plexus.classworlds.launcher.Launcher.mainWithExitCode(Launcher.java:409)
	at org.codehaus.plexus.classworlds.launcher.Launcher.main(Launcher.java:352)
Caused by: org.apache.maven.plugin.MojoFailureException: There are test failures.

Please refer to F:\ws\m3-its\core-integration-testing-trunk\core-it-suite\target\surefire-reports
for the individual test results.
	at org.apache.maven.plugin.surefire.SurefireHelper.reportExecution(SurefireHelper.java:82)
	at org.apache.maven.plugin.surefire.SurefirePlugin.handleSummary(SurefirePlugin.java:195)
	at org.apache.maven.plugin.surefire.AbstractSurefireMojo.executeAfterPreconditionsChecked(AbstractSurefireMojo.java:861)
	at org.apache.maven.plugin.surefire.AbstractSurefireMojo.execute(AbstractSurefireMojo.java:729)
	at org.apache.maven.plugin.DefaultBuildPluginManager.executeMojo(DefaultBuildPluginManager.java:101)
	at org.apache.maven.lifecycle.internal.MojoExecutor.execute(MojoExecutor.java:209)
	... 19 more
[ERROR] 
[ERROR] Re-run Maven using the -X switch to enable full debug logging.
[ERROR] 
[ERROR] For more information about the errors and possible solutions, please read the following
articles:
[ERROR] [Help 1] http://cwiki.apache.org/confluence/display/MAVEN/MojoFailureException
[ERROR] 
[ERROR] After correcting the problems, you can resume the build with the command
[ERROR]   mvn <goals> -rf :core-it-suite
Build step 'Invoke top-level Maven targets' marked build as failure
Recording test results

Mime
View raw message