maven-notifications mailing list archives

Site index · List index
Message view « Date » · « Thread »
Top « Date » · « Thread »
From gmcdon...@apache.org
Subject Build failed in Jenkins: maven-shared #411
Date Mon, 05 Oct 2015 05:34:40 GMT
See <https://analysis.apache.org/jenkins/job/maven-shared/411/changes>

Changes:

[khmarbaise] Removed dependency-reduced-pom.xml from svn:ignore

[khmarbaise] Cleaned up warnings etc.

[khmarbaise] [MSHARED-442] followup removed dependency-reduced-pom.xml from rat-plugin configuration.

[khmarbaise] Cleaned up checkstyle issues.

[khmarbaise] Cleaned up checkstyle reported issues.

[khmarbaise] [MSHARED-442] Remove shading of artifact instead of using simple jar
Removed shading of artifact and commons-io which is defined as optional
dependency.

[khmarbaise] Cleaned up code.

[khmarbaise] Cleaned up checkstyle reported issues.

[khmarbaise] Fixed CI build.

[khmarbaise] Improved comment about using maven-core in provided scope.

[rfscholte] append rat configuration

[khmarbaise] Improved hint by adding explicit version

------------------------------------------
[...truncated 1800 lines...]
[INFO] Installing <https://analysis.apache.org/jenkins/job/maven-shared/ws/maven-common-artifact-filters/pom.xml>
to <https://analysis.apache.org/jenkins/job/maven-shared/ws/maven-reporting-exec/target/local-repo/org/apache/maven/shared/maven-common-artifact-filters/3.0-SNAPSHOT/maven-common-artifact-filters-3.0-SNAPSHOT.pom>
[INFO] Installing <https://analysis.apache.org/jenkins/job/maven-shared/ws/maven-common-artifact-filters/target/maven-common-artifact-filters-3.0-SNAPSHOT.jar>
to <https://analysis.apache.org/jenkins/job/maven-shared/ws/maven-reporting-exec/target/local-repo/org/apache/maven/shared/maven-common-artifact-filters/3.0-SNAPSHOT/maven-common-artifact-filters-3.0-SNAPSHOT.jar>
[INFO] Installing <https://analysis.apache.org/jenkins/job/maven-shared/ws/maven-common-artifact-filters/pom.xml>
to <https://analysis.apache.org/jenkins/job/maven-shared/ws/maven-reporting-exec/target/local-repo/org/apache/maven/shared/maven-common-artifact-filters/3.0-SNAPSHOT/maven-common-artifact-filters-3.0-SNAPSHOT.pom>
[INFO] Installing <https://analysis.apache.org/jenkins/job/maven-shared/ws/maven-dependency-analyzer/pom.xml>
to <https://analysis.apache.org/jenkins/job/maven-shared/ws/maven-reporting-exec/target/local-repo/org/apache/maven/shared/maven-dependency-analyzer/1.7-SNAPSHOT/maven-dependency-analyzer-1.7-SNAPSHOT.pom>
[INFO] Installing <https://analysis.apache.org/jenkins/job/maven-shared/ws/maven-dependency-analyzer/target/maven-dependency-analyzer-1.7-SNAPSHOT.jar>
to <https://analysis.apache.org/jenkins/job/maven-shared/ws/maven-reporting-exec/target/local-repo/org/apache/maven/shared/maven-dependency-analyzer/1.7-SNAPSHOT/maven-dependency-analyzer-1.7-SNAPSHOT.jar>
[INFO] Installing <https://analysis.apache.org/jenkins/job/maven-shared/ws/maven-dependency-analyzer/pom.xml>
to <https://analysis.apache.org/jenkins/job/maven-shared/ws/maven-reporting-exec/target/local-repo/org/apache/maven/shared/maven-dependency-analyzer/1.7-SNAPSHOT/maven-dependency-analyzer-1.7-SNAPSHOT.pom>
[INFO] Installing <https://analysis.apache.org/jenkins/job/maven-shared/ws/maven-dependency-tree/pom.xml>
to <https://analysis.apache.org/jenkins/job/maven-shared/ws/maven-reporting-exec/target/local-repo/org/apache/maven/shared/maven-dependency-tree/3.0-SNAPSHOT/maven-dependency-tree-3.0-SNAPSHOT.pom>
[INFO] Installing <https://analysis.apache.org/jenkins/job/maven-shared/ws/maven-downloader/pom.xml>
to <https://analysis.apache.org/jenkins/job/maven-shared/ws/maven-reporting-exec/target/local-repo/org/apache/maven/shared/maven-downloader/1.2-SNAPSHOT/maven-downloader-1.2-SNAPSHOT.pom>
[INFO] Installing <https://analysis.apache.org/jenkins/job/maven-shared/ws/maven-downloader/target/maven-downloader-1.2-SNAPSHOT.jar>
to <https://analysis.apache.org/jenkins/job/maven-shared/ws/maven-reporting-exec/target/local-repo/org/apache/maven/shared/maven-downloader/1.2-SNAPSHOT/maven-downloader-1.2-SNAPSHOT.jar>
[INFO] Installing <https://analysis.apache.org/jenkins/job/maven-shared/ws/maven-downloader/pom.xml>
to <https://analysis.apache.org/jenkins/job/maven-shared/ws/maven-reporting-exec/target/local-repo/org/apache/maven/shared/maven-downloader/1.2-SNAPSHOT/maven-downloader-1.2-SNAPSHOT.pom>
[INFO] Installing <https://analysis.apache.org/jenkins/job/maven-shared/ws/maven-filtering/pom.xml>
to <https://analysis.apache.org/jenkins/job/maven-shared/ws/maven-reporting-exec/target/local-repo/org/apache/maven/shared/maven-filtering/1.4-SNAPSHOT/maven-filtering-1.4-SNAPSHOT.pom>
[INFO] Installing <https://analysis.apache.org/jenkins/job/maven-shared/ws/maven-filtering/target/maven-filtering-1.4-SNAPSHOT.jar>
to <https://analysis.apache.org/jenkins/job/maven-shared/ws/maven-reporting-exec/target/local-repo/org/apache/maven/shared/maven-filtering/1.4-SNAPSHOT/maven-filtering-1.4-SNAPSHOT.jar>
[INFO] Installing <https://analysis.apache.org/jenkins/job/maven-shared/ws/maven-filtering/pom.xml>
to <https://analysis.apache.org/jenkins/job/maven-shared/ws/maven-reporting-exec/target/local-repo/org/apache/maven/shared/maven-filtering/1.4-SNAPSHOT/maven-filtering-1.4-SNAPSHOT.pom>
[INFO] Installing <https://analysis.apache.org/jenkins/job/maven-shared/ws/maven-invoker/pom.xml>
to <https://analysis.apache.org/jenkins/job/maven-shared/ws/maven-reporting-exec/target/local-repo/org/apache/maven/shared/maven-invoker/2.3-SNAPSHOT/maven-invoker-2.3-SNAPSHOT.pom>
[INFO] Installing <https://analysis.apache.org/jenkins/job/maven-shared/ws/maven-invoker/target/maven-invoker-2.3-SNAPSHOT.jar>
to <https://analysis.apache.org/jenkins/job/maven-shared/ws/maven-reporting-exec/target/local-repo/org/apache/maven/shared/maven-invoker/2.3-SNAPSHOT/maven-invoker-2.3-SNAPSHOT.jar>
[INFO] Installing <https://analysis.apache.org/jenkins/job/maven-shared/ws/maven-invoker/pom.xml>
to <https://analysis.apache.org/jenkins/job/maven-shared/ws/maven-reporting-exec/target/local-repo/org/apache/maven/shared/maven-invoker/2.3-SNAPSHOT/maven-invoker-2.3-SNAPSHOT.pom>
[INFO] Installing <https://analysis.apache.org/jenkins/job/maven-shared/ws/maven-mapping/pom.xml>
to <https://analysis.apache.org/jenkins/job/maven-shared/ws/maven-reporting-exec/target/local-repo/org/apache/maven/shared/maven-mapping/1.1-SNAPSHOT/maven-mapping-1.1-SNAPSHOT.pom>
[INFO] Installing <https://analysis.apache.org/jenkins/job/maven-shared/ws/maven-mapping/target/maven-mapping-1.1-SNAPSHOT.jar>
to <https://analysis.apache.org/jenkins/job/maven-shared/ws/maven-reporting-exec/target/local-repo/org/apache/maven/shared/maven-mapping/1.1-SNAPSHOT/maven-mapping-1.1-SNAPSHOT.jar>
[INFO] Installing <https://analysis.apache.org/jenkins/job/maven-shared/ws/maven-mapping/pom.xml>
to <https://analysis.apache.org/jenkins/job/maven-shared/ws/maven-reporting-exec/target/local-repo/org/apache/maven/shared/maven-mapping/1.1-SNAPSHOT/maven-mapping-1.1-SNAPSHOT.pom>
[INFO] Installing <https://analysis.apache.org/jenkins/job/maven-shared/ws/maven-osgi/pom.xml>
to <https://analysis.apache.org/jenkins/job/maven-shared/ws/maven-reporting-exec/target/local-repo/org/apache/maven/shared/maven-osgi/0.3.0-SNAPSHOT/maven-osgi-0.3.0-SNAPSHOT.pom>
[INFO] Installing <https://analysis.apache.org/jenkins/job/maven-shared/ws/maven-osgi/target/maven-osgi-0.3.0-SNAPSHOT.jar>
to <https://analysis.apache.org/jenkins/job/maven-shared/ws/maven-reporting-exec/target/local-repo/org/apache/maven/shared/maven-osgi/0.3.0-SNAPSHOT/maven-osgi-0.3.0-SNAPSHOT.jar>
[INFO] Installing <https://analysis.apache.org/jenkins/job/maven-shared/ws/maven-osgi/pom.xml>
to <https://analysis.apache.org/jenkins/job/maven-shared/ws/maven-reporting-exec/target/local-repo/org/apache/maven/shared/maven-osgi/0.3.0-SNAPSHOT/maven-osgi-0.3.0-SNAPSHOT.pom>
[INFO] Installing <https://analysis.apache.org/jenkins/job/maven-shared/ws/maven-project-utils/pom.xml>
to <https://analysis.apache.org/jenkins/job/maven-shared/ws/maven-reporting-exec/target/local-repo/org/apache/maven/shared/maven-project-utils/1.0-SNAPSHOT/maven-project-utils-1.0-SNAPSHOT.pom>
[INFO] Installing <https://analysis.apache.org/jenkins/job/maven-shared/ws/maven-project-utils/target/maven-project-utils-1.0-SNAPSHOT.jar>
to <https://analysis.apache.org/jenkins/job/maven-shared/ws/maven-reporting-exec/target/local-repo/org/apache/maven/shared/maven-project-utils/1.0-SNAPSHOT/maven-project-utils-1.0-SNAPSHOT.jar>
[INFO] Installing <https://analysis.apache.org/jenkins/job/maven-shared/ws/maven-project-utils/pom.xml>
to <https://analysis.apache.org/jenkins/job/maven-shared/ws/maven-reporting-exec/target/local-repo/org/apache/maven/shared/maven-project-utils/1.0-SNAPSHOT/maven-project-utils-1.0-SNAPSHOT.pom>
[INFO] Installing <https://analysis.apache.org/jenkins/job/maven-shared/ws/maven-reporting-api/pom.xml>
to <https://analysis.apache.org/jenkins/job/maven-shared/ws/maven-reporting-exec/target/local-repo/org/apache/maven/reporting/maven-reporting-api/3.1-SNAPSHOT/maven-reporting-api-3.1-SNAPSHOT.pom>
[INFO] Installing <https://analysis.apache.org/jenkins/job/maven-shared/ws/maven-reporting-api/target/maven-reporting-api-3.1-SNAPSHOT.jar>
to <https://analysis.apache.org/jenkins/job/maven-shared/ws/maven-reporting-exec/target/local-repo/org/apache/maven/reporting/maven-reporting-api/3.1-SNAPSHOT/maven-reporting-api-3.1-SNAPSHOT.jar>
[INFO] Installing <https://analysis.apache.org/jenkins/job/maven-shared/ws/maven-reporting-api/pom.xml>
to <https://analysis.apache.org/jenkins/job/maven-shared/ws/maven-reporting-exec/target/local-repo/org/apache/maven/reporting/maven-reporting-api/3.1-SNAPSHOT/maven-reporting-api-3.1-SNAPSHOT.pom>
[INFO] Installing <https://analysis.apache.org/jenkins/job/maven-shared/ws/maven-reporting-impl/pom.xml>
to <https://analysis.apache.org/jenkins/job/maven-shared/ws/maven-reporting-exec/target/local-repo/org/apache/maven/reporting/maven-reporting-impl/3.0-SNAPSHOT/maven-reporting-impl-3.0-SNAPSHOT.pom>
[INFO] Installing <https://analysis.apache.org/jenkins/job/maven-shared/ws/maven-reporting-impl/target/maven-reporting-impl-3.0-SNAPSHOT.jar>
to <https://analysis.apache.org/jenkins/job/maven-shared/ws/maven-reporting-exec/target/local-repo/org/apache/maven/reporting/maven-reporting-impl/3.0-SNAPSHOT/maven-reporting-impl-3.0-SNAPSHOT.jar>
[INFO] Installing <https://analysis.apache.org/jenkins/job/maven-shared/ws/maven-repository-builder/pom.xml>
to <https://analysis.apache.org/jenkins/job/maven-shared/ws/maven-reporting-exec/target/local-repo/org/apache/maven/shared/maven-repository-builder/1.1-SNAPSHOT/maven-repository-builder-1.1-SNAPSHOT.pom>
[INFO] Installing <https://analysis.apache.org/jenkins/job/maven-shared/ws/maven-repository-builder/target/maven-repository-builder-1.1-SNAPSHOT.jar>
to <https://analysis.apache.org/jenkins/job/maven-shared/ws/maven-reporting-exec/target/local-repo/org/apache/maven/shared/maven-repository-builder/1.1-SNAPSHOT/maven-repository-builder-1.1-SNAPSHOT.jar>
[INFO] Installing <https://analysis.apache.org/jenkins/job/maven-shared/ws/maven-repository-builder/pom.xml>
to <https://analysis.apache.org/jenkins/job/maven-shared/ws/maven-reporting-exec/target/local-repo/org/apache/maven/shared/maven-repository-builder/1.1-SNAPSHOT/maven-repository-builder-1.1-SNAPSHOT.pom>
[INFO] Installing <https://analysis.apache.org/jenkins/job/maven-shared/ws/maven-runtime/pom.xml>
to <https://analysis.apache.org/jenkins/job/maven-shared/ws/maven-reporting-exec/target/local-repo/org/apache/maven/shared/maven-runtime/1.0-alpha-4-SNAPSHOT/maven-runtime-1.0-alpha-4-SNAPSHOT.pom>
[INFO] Installing <https://analysis.apache.org/jenkins/job/maven-shared/ws/maven-runtime/target/maven-runtime-1.0-alpha-4-SNAPSHOT.jar>
to <https://analysis.apache.org/jenkins/job/maven-shared/ws/maven-reporting-exec/target/local-repo/org/apache/maven/shared/maven-runtime/1.0-alpha-4-SNAPSHOT/maven-runtime-1.0-alpha-4-SNAPSHOT.jar>
[INFO] Installing <https://analysis.apache.org/jenkins/job/maven-shared/ws/maven-runtime/pom.xml>
to <https://analysis.apache.org/jenkins/job/maven-shared/ws/maven-reporting-exec/target/local-repo/org/apache/maven/shared/maven-runtime/1.0-alpha-4-SNAPSHOT/maven-runtime-1.0-alpha-4-SNAPSHOT.pom>
[INFO] Installing <https://analysis.apache.org/jenkins/job/maven-shared/ws/maven-shared-io/pom.xml>
to <https://analysis.apache.org/jenkins/job/maven-shared/ws/maven-reporting-exec/target/local-repo/org/apache/maven/shared/maven-shared-io/1.2-SNAPSHOT/maven-shared-io-1.2-SNAPSHOT.pom>
[INFO] Installing <https://analysis.apache.org/jenkins/job/maven-shared/ws/maven-shared-io/target/maven-shared-io-1.2-SNAPSHOT.jar>
to <https://analysis.apache.org/jenkins/job/maven-shared/ws/maven-reporting-exec/target/local-repo/org/apache/maven/shared/maven-shared-io/1.2-SNAPSHOT/maven-shared-io-1.2-SNAPSHOT.jar>
[INFO] Installing <https://analysis.apache.org/jenkins/job/maven-shared/ws/maven-shared-io/pom.xml>
to <https://analysis.apache.org/jenkins/job/maven-shared/ws/maven-reporting-exec/target/local-repo/org/apache/maven/shared/maven-shared-io/1.2-SNAPSHOT/maven-shared-io-1.2-SNAPSHOT.pom>
[INFO] Installing <https://analysis.apache.org/jenkins/job/maven-shared/ws/maven-shared-jar/pom.xml>
to <https://analysis.apache.org/jenkins/job/maven-shared/ws/maven-reporting-exec/target/local-repo/org/apache/maven/shared/maven-shared-jar/1.2-SNAPSHOT/maven-shared-jar-1.2-SNAPSHOT.pom>
[INFO] Installing <https://analysis.apache.org/jenkins/job/maven-shared/ws/maven-shared-jar/target/maven-shared-jar-1.2-SNAPSHOT.jar>
to <https://analysis.apache.org/jenkins/job/maven-shared/ws/maven-reporting-exec/target/local-repo/org/apache/maven/shared/maven-shared-jar/1.2-SNAPSHOT/maven-shared-jar-1.2-SNAPSHOT.jar>
[INFO] Installing <https://analysis.apache.org/jenkins/job/maven-shared/ws/maven-shared-jar/pom.xml>
to <https://analysis.apache.org/jenkins/job/maven-shared/ws/maven-reporting-exec/target/local-repo/org/apache/maven/shared/maven-shared-jar/1.2-SNAPSHOT/maven-shared-jar-1.2-SNAPSHOT.pom>
[INFO] Installing <https://analysis.apache.org/jenkins/job/maven-shared/ws/maven-shared-resources/pom.xml>
to <https://analysis.apache.org/jenkins/job/maven-shared/ws/maven-reporting-exec/target/local-repo/org/apache/maven/shared/maven-shared-resources/3-SNAPSHOT/maven-shared-resources-3-SNAPSHOT.pom>
[INFO] Installing <https://analysis.apache.org/jenkins/job/maven-shared/ws/maven-shared-resources/target/maven-shared-resources-3-SNAPSHOT.jar>
to <https://analysis.apache.org/jenkins/job/maven-shared/ws/maven-reporting-exec/target/local-repo/org/apache/maven/shared/maven-shared-resources/3-SNAPSHOT/maven-shared-resources-3-SNAPSHOT.jar>
[INFO] Installing <https://analysis.apache.org/jenkins/job/maven-shared/ws/maven-shared-resources/pom.xml>
to <https://analysis.apache.org/jenkins/job/maven-shared/ws/maven-reporting-exec/target/local-repo/org/apache/maven/shared/maven-shared-resources/3-SNAPSHOT/maven-shared-resources-3-SNAPSHOT.pom>
[INFO] Installing <https://analysis.apache.org/jenkins/job/maven-shared/ws/maven-verifier/pom.xml>
to <https://analysis.apache.org/jenkins/job/maven-shared/ws/maven-reporting-exec/target/local-repo/org/apache/maven/shared/maven-verifier/1.7-SNAPSHOT/maven-verifier-1.7-SNAPSHOT.pom>
[INFO] Installing <https://analysis.apache.org/jenkins/job/maven-shared/ws/maven-verifier/target/maven-verifier-1.7-SNAPSHOT.jar>
to <https://analysis.apache.org/jenkins/job/maven-shared/ws/maven-reporting-exec/target/local-repo/org/apache/maven/shared/maven-verifier/1.7-SNAPSHOT/maven-verifier-1.7-SNAPSHOT.jar>
[INFO] Installing <https://analysis.apache.org/jenkins/job/maven-shared/ws/maven-verifier/pom.xml>
to <https://analysis.apache.org/jenkins/job/maven-shared/ws/maven-reporting-exec/target/local-repo/org/apache/maven/shared/maven-verifier/1.7-SNAPSHOT/maven-verifier-1.7-SNAPSHOT.pom>
[INFO] Installing <https://analysis.apache.org/jenkins/job/maven-shared/ws/maven-jarsigner/pom.xml>
to <https://analysis.apache.org/jenkins/job/maven-shared/ws/maven-reporting-exec/target/local-repo/org/apache/maven/shared/maven-jarsigner/1.5-SNAPSHOT/maven-jarsigner-1.5-SNAPSHOT.pom>
[INFO] Installing <https://analysis.apache.org/jenkins/job/maven-shared/ws/maven-jarsigner/target/maven-jarsigner-1.5-SNAPSHOT.jar>
to <https://analysis.apache.org/jenkins/job/maven-shared/ws/maven-reporting-exec/target/local-repo/org/apache/maven/shared/maven-jarsigner/1.5-SNAPSHOT/maven-jarsigner-1.5-SNAPSHOT.jar>
[INFO] Installing <https://analysis.apache.org/jenkins/job/maven-shared/ws/maven-jarsigner/pom.xml>
to <https://analysis.apache.org/jenkins/job/maven-shared/ws/maven-reporting-exec/target/local-repo/org/apache/maven/shared/maven-jarsigner/1.5-SNAPSHOT/maven-jarsigner-1.5-SNAPSHOT.pom>
[INFO] Installing <https://analysis.apache.org/jenkins/job/maven-shared/ws/maven-script-interpreter/pom.xml>
to <https://analysis.apache.org/jenkins/job/maven-shared/ws/maven-reporting-exec/target/local-repo/org/apache/maven/shared/maven-script-interpreter/1.2-SNAPSHOT/maven-script-interpreter-1.2-SNAPSHOT.pom>
[INFO] Installing <https://analysis.apache.org/jenkins/job/maven-shared/ws/maven-script-interpreter/target/maven-script-interpreter-1.2-SNAPSHOT.jar>
to <https://analysis.apache.org/jenkins/job/maven-shared/ws/maven-reporting-exec/target/local-repo/org/apache/maven/shared/maven-script-interpreter/1.2-SNAPSHOT/maven-script-interpreter-1.2-SNAPSHOT.jar>
[INFO] Installing <https://analysis.apache.org/jenkins/job/maven-shared/ws/maven-script-interpreter/pom.xml>
to <https://analysis.apache.org/jenkins/job/maven-shared/ws/maven-reporting-exec/target/local-repo/org/apache/maven/shared/maven-script-interpreter/1.2-SNAPSHOT/maven-script-interpreter-1.2-SNAPSHOT.pom>
[INFO] Installing <https://analysis.apache.org/jenkins/job/maven-shared/ws/maven-artifact-resolver/pom.xml>
to <https://analysis.apache.org/jenkins/job/maven-shared/ws/maven-reporting-exec/target/local-repo/org/apache/maven/shared/maven-artifact-resolver/1.1-SNAPSHOT/maven-artifact-resolver-1.1-SNAPSHOT.pom>
[INFO] Installing <https://analysis.apache.org/jenkins/job/maven-shared/ws/maven-artifact-resolver/target/maven-artifact-resolver-1.1-SNAPSHOT.jar>
to <https://analysis.apache.org/jenkins/job/maven-shared/ws/maven-reporting-exec/target/local-repo/org/apache/maven/shared/maven-artifact-resolver/1.1-SNAPSHOT/maven-artifact-resolver-1.1-SNAPSHOT.jar>
[INFO] Installing <https://analysis.apache.org/jenkins/job/maven-shared/ws/maven-artifact-resolver/pom.xml>
to <https://analysis.apache.org/jenkins/job/maven-shared/ws/maven-reporting-exec/target/local-repo/org/apache/maven/shared/maven-artifact-resolver/1.1-SNAPSHOT/maven-artifact-resolver-1.1-SNAPSHOT.pom>
[INFO] Installing <https://analysis.apache.org/jenkins/job/maven-shared/ws/maven-artifact-transfer/dependency-reduced-pom.xml>
to <https://analysis.apache.org/jenkins/job/maven-shared/ws/maven-reporting-exec/target/local-repo/org/apache/maven/shared/maven-artifact-transfer/3.0-SNAPSHOT/maven-artifact-transfer-3.0-SNAPSHOT.pom>
[INFO] Installing <https://analysis.apache.org/jenkins/job/maven-shared/ws/maven-artifact-transfer/target/maven-artifact-transfer-3.0-SNAPSHOT.jar>
to <https://analysis.apache.org/jenkins/job/maven-shared/ws/maven-reporting-exec/target/local-repo/org/apache/maven/shared/maven-artifact-transfer/3.0-SNAPSHOT/maven-artifact-transfer-3.0-SNAPSHOT.jar>
[INFO] Installing <https://analysis.apache.org/jenkins/job/maven-shared/ws/maven-artifact-transfer/dependency-reduced-pom.xml>
to <https://analysis.apache.org/jenkins/job/maven-shared/ws/maven-reporting-exec/target/local-repo/org/apache/maven/shared/maven-artifact-transfer/3.0-SNAPSHOT/maven-artifact-transfer-3.0-SNAPSHOT.pom>
[INFO] Installing <https://analysis.apache.org/jenkins/job/maven-shared/ws/maven-reporting-exec/pom.xml>
to <https://analysis.apache.org/jenkins/job/maven-shared/ws/maven-reporting-exec/target/local-repo/org/apache/maven/reporting/maven-reporting-exec/1.2.1-SNAPSHOT/maven-reporting-exec-1.2.1-SNAPSHOT.pom>
[INFO] Installing <https://analysis.apache.org/jenkins/job/maven-shared/ws/maven-reporting-exec/target/maven-reporting-exec-1.2.1-SNAPSHOT.jar>
to <https://analysis.apache.org/jenkins/job/maven-shared/ws/maven-reporting-exec/target/local-repo/org/apache/maven/reporting/maven-reporting-exec/1.2.1-SNAPSHOT/maven-reporting-exec-1.2.1-SNAPSHOT.jar>
[INFO] 
[INFO] --- maven-invoker-plugin:1.9:integration-test (integration-test) @ maven-reporting-exec
---
[INFO] Building: aether/pom.xml
[INFO] ..SUCCESS (67.9 s)
[INFO] Building: use-as-site-report/pom.xml
[INFO] ..SUCCESS (40.8 s)
[INFO] Building: forked-lifecycle/pom.xml
[INFO] run script verify.groovy
[INFO] ..SUCCESS (35.0 s)
[INFO] Building: use-as-direct-mojo/pom.xml
[INFO] ..SUCCESS (40.9 s)
[INFO] Building: reportConfig/pom.xml
[INFO] run script verify.groovy
[INFO] ..SUCCESS (36.3 s)
[JENKINS] Recording test results
log4j:WARN No appenders could be found for logger (org.apache.commons.beanutils.converters.BooleanConverter).
log4j:WARN Please initialize the log4j system properly.
[INFO] 
[INFO] --- maven-checkstyle-plugin:2.13:check (checkstyle-check) @ maven-reporting-impl ---
[INFO] 
[INFO] 
[INFO] --- maven-invoker-plugin:1.9:verify (integration-test) @ maven-reporting-impl ---
[INFO] -------------------------------------------------
[INFO] Build Summary:
[INFO]   Passed: 3, Failed: 0, Errors: 0, Skipped: 0
[INFO] -------------------------------------------------
[INFO] 
[INFO] --- maven-install-plugin:2.5.2:install (default-install) @ maven-reporting-impl ---
[INFO] Installing <https://analysis.apache.org/jenkins/job/maven-shared/ws/maven-reporting-impl/target/maven-reporting-impl-3.0-SNAPSHOT.jar>
to <https://analysis.apache.org/jenkins/job/maven-shared/ws/.repository/org/apache/maven/reporting/maven-reporting-impl/3.0-SNAPSHOT/maven-reporting-impl-3.0-SNAPSHOT.jar>
[INFO] Installing <https://analysis.apache.org/jenkins/job/maven-shared/ws/maven-reporting-impl/pom.xml>
to <https://analysis.apache.org/jenkins/job/maven-shared/ws/.repository/org/apache/maven/reporting/maven-reporting-impl/3.0-SNAPSHOT/maven-reporting-impl-3.0-SNAPSHOT.pom>
[JENKINS] Archiving disabled
[INFO] run script verify.groovy
[INFO] ..SUCCESS (37.3 s)
[JENKINS] Recording test results
[INFO] 
[INFO] --- maven-checkstyle-plugin:2.13:check (checkstyle-check) @ maven-reporting-exec ---
[INFO] 
[INFO] There are 1 checkstyle errors.
[INFO] 
[INFO] --- maven-invoker-plugin:1.9:verify (integration-test) @ maven-reporting-exec ---
[INFO] -------------------------------------------------
[INFO] Build Summary:
[INFO]   Passed: 3, Failed: 0, Errors: 0, Skipped: 0
[INFO] -------------------------------------------------
[INFO] 
[INFO] --- maven-install-plugin:2.5.2:install (default-install) @ maven-reporting-exec ---
[INFO] Installing <https://analysis.apache.org/jenkins/job/maven-shared/ws/maven-reporting-exec/target/maven-reporting-exec-1.2.1-SNAPSHOT.jar>
to <https://analysis.apache.org/jenkins/job/maven-shared/ws/.repository/org/apache/maven/reporting/maven-reporting-exec/1.2.1-SNAPSHOT/maven-reporting-exec-1.2.1-SNAPSHOT.jar>
[INFO] Installing <https://analysis.apache.org/jenkins/job/maven-shared/ws/maven-reporting-exec/pom.xml>
to <https://analysis.apache.org/jenkins/job/maven-shared/ws/.repository/org/apache/maven/reporting/maven-reporting-exec/1.2.1-SNAPSHOT/maven-reporting-exec-1.2.1-SNAPSHOT.pom>
[JENKINS] Archiving disabled
[JENKINS] Archiving disabled
[JENKINS] Archiving disabled
[JENKINS] Archiving disabled
[JENKINS] Archiving disabled
[JENKINS] Archiving disabled
[JENKINS] Archiving disabled
[JENKINS] Archiving disabled
[JENKINS] Archiving disabled
[JENKINS] Archiving disabled
[JENKINS] Archiving disabled
[JENKINS] Archiving disabled
[JENKINS] Archiving disabled
[JENKINS] Archiving disabled
[JENKINS] Archiving disabled
[JENKINS] Archiving disabled
[JENKINS] Archiving disabled
[JENKINS] Archiving disabled
[JENKINS] Archiving disabled
[JENKINS] Archiving disabled
[JENKINS] Archiving disabled
[JENKINS] Archiving disabled
[JENKINS] Archiving disabled
[JENKINS] Archiving disabled
[JENKINS] Archiving disabled
[JENKINS] Archiving disabled
[JENKINS] Archiving disabled
[JENKINS] Archiving disabled
[INFO] ------------------------------------------------------------------------
[INFO] Reactor Summary:
[INFO] 
[JENKINS] Archiving disabled
[INFO] Apache Maven Shared Components ..................... SUCCESS [ 42.224 s]
[INFO] Apache Maven Shared Utils .......................... FAILURE [ 33.871 s]
[INFO] Apache Maven Incremental Build Support Utilities ... SUCCESS [ 52.964 s]
[INFO] Apache Maven File Management API ................... SUCCESS [ 19.638 s]
[INFO] Apache Maven Archiver .............................. SUCCESS [ 11.360 s]
[INFO] Apache Maven Common Artifact Filters ............... SUCCESS [ 21.846 s]
[INFO] Apache Maven Dependency Analyzer ................... SUCCESS [ 19.345 s]
[INFO] Apache Maven Dependency Tree ....................... FAILURE [ 21.318 s]
[INFO] Apache Maven Downloader ............................ SUCCESS [  6.794 s]
[INFO] Apache Maven Filtering ............................. SUCCESS [ 19.996 s]
[INFO] Apache Maven Invoker ............................... SUCCESS [ 15.550 s]
[INFO] Apache Maven Mapping ............................... SUCCESS [  7.605 s]
[INFO] Apache Maven OSGi Integration ...................... SUCCESS [  8.173 s]
[INFO] Apache Maven Project Utils ......................... SUCCESS [ 16.015 s]
[INFO] Apache Maven Reporting API ......................... SUCCESS [ 11.098 s]
[INFO] Apache Maven Reporting Implementation .............. SUCCESS [03:13 min]
[INFO] Apache Maven Repository Builder .................... SUCCESS [ 18.158 s]
[INFO] Apache Maven Runtime ............................... SUCCESS [ 20.855 s]
[INFO] Apache Maven Shared I/O API ........................ SUCCESS [  7.112 s]
[INFO] Apache Maven JAR Utilities ......................... SUCCESS [  6.663 s]
[INFO] Apache Maven Shared Resources ...................... SUCCESS [  3.459 s]
[INFO] Apache Maven Verifier Component .................... SUCCESS [  8.951 s]
[INFO] Apache Maven Jarsigner ............................. SUCCESS [  9.694 s]
[INFO] Apache Maven Script Interpreter .................... SUCCESS [ 18.088 s]
[INFO] Apache Maven Artifact Resolution API ............... SUCCESS [ 14.760 s]
[INFO] Apache Maven Artifact Transfer ..................... SUCCESS [ 18.434 s]
[INFO] Apache Maven Reporting Executor .................... SUCCESS [02:29 min]
[INFO] Maven Shared Components Aggregator ................. SUCCESS [  3.984 s]
[INFO] ------------------------------------------------------------------------
[INFO] BUILD FAILURE
[INFO] ------------------------------------------------------------------------
[INFO] Total time: 05:15 min (Wall Clock)
[INFO] Finished at: 2015-10-05T05:34:34+00:00
[INFO] Final Memory: 84M/312M
[INFO] ------------------------------------------------------------------------
[ERROR] Failed to execute goal org.apache.rat:apache-rat-plugin:0.11:check (rat-check) on
project maven-shared-utils: Too many files with unapproved license: 1 See RAT report in: <https://analysis.apache.org/jenkins/job/maven-shared/ws/maven-shared-utils/target/rat.txt>
-> [Help 1]
[ERROR] Failed to execute goal org.apache.maven.plugins:maven-compiler-plugin:3.1:compile
(default-compile) on project maven-dependency-tree: Compilation failure: Compilation failure:
[ERROR] <https://analysis.apache.org/jenkins/job/maven-shared/ws/maven-dependency-tree/src/main/java/org/apache/maven/shared/dependency/tree/DependencyTreeBuilder.java>:[25,42]
cannot find symbol
[ERROR] symbol:   class ArtifactCollector
[ERROR] location: package org.apache.maven.artifact.resolver
[ERROR] <https://analysis.apache.org/jenkins/job/maven-shared/ws/maven-dependency-tree/src/main/java/org/apache/maven/shared/dependency/tree/DependencyTreeBuilder.java>:[64,80]
cannot find symbol
[ERROR] symbol:   class ArtifactCollector
[ERROR] location: interface org.apache.maven.shared.dependency.tree.DependencyTreeBuilder
[ERROR] <https://analysis.apache.org/jenkins/job/maven-shared/ws/maven-dependency-tree/src/main/java/org/apache/maven/shared/dependency/tree/DependencyTreeBuilder.java>:[82,41]
cannot find symbol
[ERROR] symbol:   class ArtifactCollector
[ERROR] location: interface org.apache.maven.shared.dependency.tree.DependencyTreeBuilder
[ERROR] <https://analysis.apache.org/jenkins/job/maven-shared/ws/maven-dependency-tree/src/main/java/org/apache/maven/shared/dependency/tree/DependencyTreeResolutionListener.java>:[31,42]
cannot find symbol
[ERROR] symbol:   class ResolutionListenerForDepMgmt
[ERROR] location: package org.apache.maven.artifact.resolver
[ERROR] <https://analysis.apache.org/jenkins/job/maven-shared/ws/maven-dependency-tree/src/main/java/org/apache/maven/shared/dependency/tree/DependencyTreeResolutionListener.java>:[43,36]
cannot find symbol
[ERROR] symbol: class ResolutionListenerForDepMgmt
[ERROR] <https://analysis.apache.org/jenkins/job/maven-shared/ws/maven-dependency-tree/src/main/java/org/apache/maven/shared/dependency/tree/DefaultDependencyTreeBuilder.java>:[30,42]
cannot find symbol
[ERROR] symbol:   class ArtifactCollector
[ERROR] location: package org.apache.maven.artifact.resolver
[ERROR] <https://analysis.apache.org/jenkins/job/maven-shared/ws/maven-dependency-tree/src/main/java/org/apache/maven/shared/dependency/tree/DefaultDependencyTreeBuilder.java>:[65,13]
cannot find symbol
[ERROR] symbol:   class ArtifactCollector
[ERROR] location: class org.apache.maven.shared.dependency.tree.DefaultDependencyTreeBuilder
[ERROR] <https://analysis.apache.org/jenkins/job/maven-shared/ws/maven-dependency-tree/src/main/java/org/apache/maven/shared/dependency/tree/DefaultDependencyTreeBuilder.java>:[80,48]
cannot find symbol
[ERROR] symbol:   class ArtifactCollector
[ERROR] location: class org.apache.maven.shared.dependency.tree.DefaultDependencyTreeBuilder
[ERROR] <https://analysis.apache.org/jenkins/job/maven-shared/ws/maven-dependency-tree/src/main/java/org/apache/maven/shared/dependency/tree/DefaultDependencyTreeBuilder.java>:[96,71]
cannot find symbol
[ERROR] symbol:   class ArtifactCollector
[ERROR] location: class org.apache.maven.shared.dependency.tree.DefaultDependencyTreeBuilder
[ERROR] <https://analysis.apache.org/jenkins/job/maven-shared/ws/maven-dependency-tree/src/main/java/org/apache/maven/shared/dependency/tree/DependencyTreeBuilder.java>:[25,42]
cannot find symbol
[ERROR] symbol:   class ArtifactCollector
[ERROR] location: package org.apache.maven.artifact.resolver
[ERROR] <https://analysis.apache.org/jenkins/job/maven-shared/ws/maven-dependency-tree/src/main/java/org/apache/maven/shared/dependency/tree/DependencyTreeBuilder.java>:[64,80]
cannot find symbol
[ERROR] symbol:   class ArtifactCollector
[ERROR] location: interface org.apache.maven.shared.dependency.tree.DependencyTreeBuilder
[ERROR] <https://analysis.apache.org/jenkins/job/maven-shared/ws/maven-dependency-tree/src/main/java/org/apache/maven/shared/dependency/tree/DependencyTreeBuilder.java>:[82,41]
cannot find symbol
[ERROR] symbol:   class ArtifactCollector
[ERROR] location: interface org.apache.maven.shared.dependency.tree.DependencyTreeBuilder
[ERROR] <https://analysis.apache.org/jenkins/job/maven-shared/ws/maven-dependency-tree/src/main/java/org/apache/maven/shared/dependency/tree/DependencyTreeResolutionListener.java>:[31,42]
cannot find symbol
[ERROR] symbol:   class ResolutionListenerForDepMgmt
[ERROR] location: package org.apache.maven.artifact.resolver
[ERROR] <https://analysis.apache.org/jenkins/job/maven-shared/ws/maven-dependency-tree/src/main/java/org/apache/maven/shared/dependency/tree/DependencyTreeResolutionListener.java>:[43,36]
cannot find symbol
[ERROR] symbol: class ResolutionListenerForDepMgmt
[ERROR] <https://analysis.apache.org/jenkins/job/maven-shared/ws/maven-dependency-tree/src/main/java/org/apache/maven/shared/dependency/tree/DefaultDependencyTreeBuilder.java>:[30,42]
cannot find symbol
[ERROR] symbol:   class ArtifactCollector
[ERROR] location: package org.apache.maven.artifact.resolver
[ERROR] <https://analysis.apache.org/jenkins/job/maven-shared/ws/maven-dependency-tree/src/main/java/org/apache/maven/shared/dependency/tree/DefaultDependencyTreeBuilder.java>:[65,13]
cannot find symbol
[ERROR] symbol:   class ArtifactCollector
[ERROR] location: class org.apache.maven.shared.dependency.tree.DefaultDependencyTreeBuilder
[ERROR] <https://analysis.apache.org/jenkins/job/maven-shared/ws/maven-dependency-tree/src/main/java/org/apache/maven/shared/dependency/tree/DefaultDependencyTreeBuilder.java>:[80,48]
cannot find symbol
[ERROR] symbol:   class ArtifactCollector
[ERROR] location: class org.apache.maven.shared.dependency.tree.DefaultDependencyTreeBuilder
[ERROR] <https://analysis.apache.org/jenkins/job/maven-shared/ws/maven-dependency-tree/src/main/java/org/apache/maven/shared/dependency/tree/DefaultDependencyTreeBuilder.java>:[96,71]
cannot find symbol
[ERROR] symbol:   class ArtifactCollector
[ERROR] location: class org.apache.maven.shared.dependency.tree.DefaultDependencyTreeBuilder
[ERROR] <https://analysis.apache.org/jenkins/job/maven-shared/ws/maven-dependency-tree/src/main/java/org/apache/maven/shared/dependency/graph/internal/Maven2DependencyGraphBuilder.java>:[46,8]
org.apache.maven.shared.dependency.graph.internal.Maven2DependencyGraphBuilder is not abstract
and does not override abstract method buildDependencyGraph(org.apache.maven.project.ProjectBuildingRequest,org.apache.maven.artifact.resolver.filter.ArtifactFilter,java.util.Collection<org.apache.maven.project.MavenProject>)
in org.apache.maven.shared.dependency.graph.DependencyGraphBuilder
[ERROR] <https://analysis.apache.org/jenkins/job/maven-shared/ws/maven-dependency-tree/src/main/java/org/apache/maven/shared/dependency/tree/DefaultDependencyTreeBuilder.java>:[146,53]
cannot find symbol
[ERROR] symbol:   method getProjectBuilderConfiguration()
[ERROR] location: variable project of type org.apache.maven.project.MavenProject
[ERROR] -> [Help 1]
[ERROR] 
[ERROR] To see the full stack trace of the errors, re-run Maven with the -e switch.
[ERROR] Re-run Maven using the -X switch to enable full debug logging.
[ERROR] 
[ERROR] For more information about the errors and possible solutions, please read the following
articles:
[ERROR] [Help 1] http://cwiki.apache.org/confluence/display/MAVEN/MojoFailureException
[ERROR] 
[ERROR] After correcting the problems, you can resume the build with the command
[ERROR]   mvn <goals> -rf :maven-shared-utils
Sending e-mails to: notifications@maven.apache.org
Sending e-mails to: notifications@maven.apache.org
channel stopped
Skipping sonar analysis due to bad build status FAILURE

Mime
View raw message