maven-notifications mailing list archives

Site index · List index
Message view « Date » · « Thread »
Top « Date » · « Thread »
From Apache Jenkins Server <jenk...@builds.apache.org>
Subject Build failed in Jenkins: maven-plugins-ITs-m3 #2105
Date Tue, 06 Oct 2015 22:42:48 GMT
See <https://builds.apache.org/job/maven-plugins-ITs-m3/2105/changes>

Changes:

[Michael Osipov] Slight improvements on log statements

------------------------------------------
[...truncated 34847 lines...]
[INFO] Exclude: DEPENDENCIES
[INFO] 66 resources included (use -debug for more details)
[INFO] Rat check: Summary of files. Unapproved: 0 unknown: 0 generated: 0 approved: 54 licence.
[INFO] 
[INFO] --- maven-plugin-plugin:3.4:helpmojo (generate-helpmojo) @ maven-gpg-plugin ---
[INFO] Using 'UTF-8' encoding to read mojo metadata.
[INFO] Mojo extractor with id: java-annotations found 0 mojo descriptors.
[INFO] Mojo extractor with id: java-javadoc found 0 mojo descriptors.
[INFO] 
[INFO] --- maven-remote-resources-plugin:1.5:process (default) @ maven-gpg-plugin ---
[INFO] 
[INFO] --- maven-resources-plugin:2.7:resources (default-resources) @ maven-gpg-plugin ---
[INFO] Using 'UTF-8' encoding to copy filtered resources.
[INFO] Copying 1 resource
[INFO] Copying 3 resources
[INFO] 
[INFO] --- maven-compiler-plugin:3.2:compile (default-compile) @ maven-gpg-plugin ---
[INFO] Changes detected - recompiling the module!
[INFO] Compiling 9 source files to <https://builds.apache.org/job/maven-plugins-ITs-m3/ws/maven-gpg-plugin/target/classes>
[INFO] Some input files use unchecked or unsafe operations.
[INFO] Recompile with -Xlint:unchecked for details.
[INFO] 
[INFO] --- maven-plugin-plugin:3.4:descriptor (default-descriptor) @ maven-gpg-plugin ---
[INFO] Using 'UTF-8' encoding to read mojo metadata.
[INFO] Mojo extractor with id: java-annotations found 3 mojo descriptors.
[INFO] Mojo extractor with id: java-javadoc found 0 mojo descriptors.
[INFO] 
[INFO] --- maven-resources-plugin:2.7:testResources (default-testResources) @ maven-gpg-plugin
---
[INFO] Using 'UTF-8' encoding to copy filtered resources.
[INFO] Copying 8 resources
[INFO] Copying 3 resources
[INFO] 
[INFO] --- maven-compiler-plugin:3.2:testCompile (default-testCompile) @ maven-gpg-plugin
---
[INFO] No sources to compile
[INFO] 
[INFO] --- maven-surefire-plugin:2.18.1:test (default-test) @ maven-gpg-plugin ---
[INFO] 
[INFO] --- maven-jar-plugin:2.5:jar (default-jar) @ maven-gpg-plugin ---
[INFO] Building jar: <https://builds.apache.org/job/maven-plugins-ITs-m3/ws/maven-gpg-plugin/target/maven-gpg-plugin-1.7-SNAPSHOT.jar>
[INFO] 
[INFO] --- maven-plugin-plugin:3.4:addPluginArtifactMetadata (default-addPluginArtifactMetadata)
@ maven-gpg-plugin ---
[INFO] 
[INFO] --- maven-invoker-plugin:2.0.0:install (integration-test) @ maven-gpg-plugin ---
[INFO] Installing <https://builds.apache.org/job/maven-plugins-ITs-m3/ws/maven-plugins/pom.xml>
to <https://builds.apache.org/job/maven-plugins-ITs-m3/ws/maven-gpg-plugin/target/local-repo/org/apache/maven/plugins/maven-plugins/28-SNAPSHOT/maven-plugins-28-SNAPSHOT.pom>
[INFO] Installing <https://builds.apache.org/job/maven-plugins-ITs-m3/ws/maven-plugins/target/maven-plugins-28-SNAPSHOT-site.xml>
to <https://builds.apache.org/job/maven-plugins-ITs-m3/ws/maven-gpg-plugin/target/local-repo/org/apache/maven/plugins/maven-plugins/28-SNAPSHOT/maven-plugins-28-SNAPSHOT-site.xml>
[INFO] Installing <https://builds.apache.org/job/maven-plugins-ITs-m3/ws/maven-acr-plugin/pom.xml>
to <https://builds.apache.org/job/maven-plugins-ITs-m3/ws/maven-gpg-plugin/target/local-repo/org/apache/maven/plugins/maven-acr-plugin/1.2-SNAPSHOT/maven-acr-plugin-1.2-SNAPSHOT.pom>
[INFO] Installing <https://builds.apache.org/job/maven-plugins-ITs-m3/ws/maven-acr-plugin/target/maven-acr-plugin-1.2-SNAPSHOT.jar>
to <https://builds.apache.org/job/maven-plugins-ITs-m3/ws/maven-gpg-plugin/target/local-repo/org/apache/maven/plugins/maven-acr-plugin/1.2-SNAPSHOT/maven-acr-plugin-1.2-SNAPSHOT.jar>
[INFO] Installing <https://builds.apache.org/job/maven-plugins-ITs-m3/ws/maven-acr-plugin/pom.xml>
to <https://builds.apache.org/job/maven-plugins-ITs-m3/ws/maven-gpg-plugin/target/local-repo/org/apache/maven/plugins/maven-acr-plugin/1.2-SNAPSHOT/maven-acr-plugin-1.2-SNAPSHOT.pom>
[INFO] Installing <https://builds.apache.org/job/maven-plugins-ITs-m3/ws/maven-ant-plugin/pom.xml>
to <https://builds.apache.org/job/maven-plugins-ITs-m3/ws/maven-gpg-plugin/target/local-repo/org/apache/maven/plugins/maven-ant-plugin/2.5-SNAPSHOT/maven-ant-plugin-2.5-SNAPSHOT.pom>
[INFO] Installing <https://builds.apache.org/job/maven-plugins-ITs-m3/ws/maven-ant-plugin/target/maven-ant-plugin-2.5-SNAPSHOT.jar>
to <https://builds.apache.org/job/maven-plugins-ITs-m3/ws/maven-gpg-plugin/target/local-repo/org/apache/maven/plugins/maven-ant-plugin/2.5-SNAPSHOT/maven-ant-plugin-2.5-SNAPSHOT.jar>
[INFO] Installing <https://builds.apache.org/job/maven-plugins-ITs-m3/ws/maven-ant-plugin/pom.xml>
to <https://builds.apache.org/job/maven-plugins-ITs-m3/ws/maven-gpg-plugin/target/local-repo/org/apache/maven/plugins/maven-ant-plugin/2.5-SNAPSHOT/maven-ant-plugin-2.5-SNAPSHOT.pom>
[INFO] Installing <https://builds.apache.org/job/maven-plugins-ITs-m3/ws/maven-antrun-plugin/pom.xml>
to <https://builds.apache.org/job/maven-plugins-ITs-m3/ws/maven-gpg-plugin/target/local-repo/org/apache/maven/plugins/maven-antrun-plugin/1.9-SNAPSHOT/maven-antrun-plugin-1.9-SNAPSHOT.pom>
[INFO] Installing <https://builds.apache.org/job/maven-plugins-ITs-m3/ws/maven-antrun-plugin/target/maven-antrun-plugin-1.9-SNAPSHOT.jar>
to <https://builds.apache.org/job/maven-plugins-ITs-m3/ws/maven-gpg-plugin/target/local-repo/org/apache/maven/plugins/maven-antrun-plugin/1.9-SNAPSHOT/maven-antrun-plugin-1.9-SNAPSHOT.jar>
[INFO] Installing <https://builds.apache.org/job/maven-plugins-ITs-m3/ws/maven-antrun-plugin/pom.xml>
to <https://builds.apache.org/job/maven-plugins-ITs-m3/ws/maven-gpg-plugin/target/local-repo/org/apache/maven/plugins/maven-antrun-plugin/1.9-SNAPSHOT/maven-antrun-plugin-1.9-SNAPSHOT.pom>
[INFO] Installing <https://builds.apache.org/job/maven-plugins-ITs-m3/ws/maven-changelog-plugin/pom.xml>
to <https://builds.apache.org/job/maven-plugins-ITs-m3/ws/maven-gpg-plugin/target/local-repo/org/apache/maven/plugins/maven-changelog-plugin/2.4-SNAPSHOT/maven-changelog-plugin-2.4-SNAPSHOT.pom>
[INFO] Installing <https://builds.apache.org/job/maven-plugins-ITs-m3/ws/maven-changelog-plugin/target/maven-changelog-plugin-2.4-SNAPSHOT.jar>
to <https://builds.apache.org/job/maven-plugins-ITs-m3/ws/maven-gpg-plugin/target/local-repo/org/apache/maven/plugins/maven-changelog-plugin/2.4-SNAPSHOT/maven-changelog-plugin-2.4-SNAPSHOT.jar>
[INFO] Installing <https://builds.apache.org/job/maven-plugins-ITs-m3/ws/maven-changelog-plugin/pom.xml>
to <https://builds.apache.org/job/maven-plugins-ITs-m3/ws/maven-gpg-plugin/target/local-repo/org/apache/maven/plugins/maven-changelog-plugin/2.4-SNAPSHOT/maven-changelog-plugin-2.4-SNAPSHOT.pom>
[INFO] Installing <https://builds.apache.org/job/maven-plugins-ITs-m3/ws/maven-changes-plugin/pom.xml>
to <https://builds.apache.org/job/maven-plugins-ITs-m3/ws/maven-gpg-plugin/target/local-repo/org/apache/maven/plugins/maven-changes-plugin/2.12-SNAPSHOT/maven-changes-plugin-2.12-SNAPSHOT.pom>
[INFO] Installing <https://builds.apache.org/job/maven-plugins-ITs-m3/ws/maven-changes-plugin/target/maven-changes-plugin-2.12-SNAPSHOT.jar>
to <https://builds.apache.org/job/maven-plugins-ITs-m3/ws/maven-gpg-plugin/target/local-repo/org/apache/maven/plugins/maven-changes-plugin/2.12-SNAPSHOT/maven-changes-plugin-2.12-SNAPSHOT.jar>
[INFO] Installing <https://builds.apache.org/job/maven-plugins-ITs-m3/ws/maven-changes-plugin/pom.xml>
to <https://builds.apache.org/job/maven-plugins-ITs-m3/ws/maven-gpg-plugin/target/local-repo/org/apache/maven/plugins/maven-changes-plugin/2.12-SNAPSHOT/maven-changes-plugin-2.12-SNAPSHOT.pom>
[INFO] Installing <https://builds.apache.org/job/maven-plugins-ITs-m3/ws/maven-clean-plugin/pom.xml>
to <https://builds.apache.org/job/maven-plugins-ITs-m3/ws/maven-gpg-plugin/target/local-repo/org/apache/maven/plugins/maven-clean-plugin/3.0.0-SNAPSHOT/maven-clean-plugin-3.0.0-SNAPSHOT.pom>
[INFO] Installing <https://builds.apache.org/job/maven-plugins-ITs-m3/ws/maven-clean-plugin/target/maven-clean-plugin-3.0.0-SNAPSHOT.jar>
to <https://builds.apache.org/job/maven-plugins-ITs-m3/ws/maven-gpg-plugin/target/local-repo/org/apache/maven/plugins/maven-clean-plugin/3.0.0-SNAPSHOT/maven-clean-plugin-3.0.0-SNAPSHOT.jar>
[INFO] Installing <https://builds.apache.org/job/maven-plugins-ITs-m3/ws/maven-clean-plugin/pom.xml>
to <https://builds.apache.org/job/maven-plugins-ITs-m3/ws/maven-gpg-plugin/target/local-repo/org/apache/maven/plugins/maven-clean-plugin/3.0.0-SNAPSHOT/maven-clean-plugin-3.0.0-SNAPSHOT.pom>
[INFO] Installing <https://builds.apache.org/job/maven-plugins-ITs-m3/ws/maven-compiler-plugin/pom.xml>
to <https://builds.apache.org/job/maven-plugins-ITs-m3/ws/maven-gpg-plugin/target/local-repo/org/apache/maven/plugins/maven-compiler-plugin/3.4-SNAPSHOT/maven-compiler-plugin-3.4-SNAPSHOT.pom>
[INFO] Installing <https://builds.apache.org/job/maven-plugins-ITs-m3/ws/maven-compiler-plugin/target/maven-compiler-plugin-3.4-SNAPSHOT.jar>
to <https://builds.apache.org/job/maven-plugins-ITs-m3/ws/maven-gpg-plugin/target/local-repo/org/apache/maven/plugins/maven-compiler-plugin/3.4-SNAPSHOT/maven-compiler-plugin-3.4-SNAPSHOT.jar>
[INFO] Installing <https://builds.apache.org/job/maven-plugins-ITs-m3/ws/maven-compiler-plugin/pom.xml>
to <https://builds.apache.org/job/maven-plugins-ITs-m3/ws/maven-gpg-plugin/target/local-repo/org/apache/maven/plugins/maven-compiler-plugin/3.4-SNAPSHOT/maven-compiler-plugin-3.4-SNAPSHOT.pom>
[INFO] Installing <https://builds.apache.org/job/maven-plugins-ITs-m3/ws/maven-deploy-plugin/pom.xml>
to <https://builds.apache.org/job/maven-plugins-ITs-m3/ws/maven-gpg-plugin/target/local-repo/org/apache/maven/plugins/maven-deploy-plugin/2.8.3-SNAPSHOT/maven-deploy-plugin-2.8.3-SNAPSHOT.pom>
[INFO] Installing <https://builds.apache.org/job/maven-plugins-ITs-m3/ws/maven-deploy-plugin/target/maven-deploy-plugin-2.8.3-SNAPSHOT.jar>
to <https://builds.apache.org/job/maven-plugins-ITs-m3/ws/maven-gpg-plugin/target/local-repo/org/apache/maven/plugins/maven-deploy-plugin/2.8.3-SNAPSHOT/maven-deploy-plugin-2.8.3-SNAPSHOT.jar>
[INFO] Installing <https://builds.apache.org/job/maven-plugins-ITs-m3/ws/maven-deploy-plugin/pom.xml>
to <https://builds.apache.org/job/maven-plugins-ITs-m3/ws/maven-gpg-plugin/target/local-repo/org/apache/maven/plugins/maven-deploy-plugin/2.8.3-SNAPSHOT/maven-deploy-plugin-2.8.3-SNAPSHOT.pom>
[INFO] Installing <https://builds.apache.org/job/maven-plugins-ITs-m3/ws/maven-docck-plugin/pom.xml>
to <https://builds.apache.org/job/maven-plugins-ITs-m3/ws/maven-gpg-plugin/target/local-repo/org/apache/maven/plugins/maven-docck-plugin/1.2-SNAPSHOT/maven-docck-plugin-1.2-SNAPSHOT.pom>
[INFO] Installing <https://builds.apache.org/job/maven-plugins-ITs-m3/ws/maven-docck-plugin/target/maven-docck-plugin-1.2-SNAPSHOT.jar>
to <https://builds.apache.org/job/maven-plugins-ITs-m3/ws/maven-gpg-plugin/target/local-repo/org/apache/maven/plugins/maven-docck-plugin/1.2-SNAPSHOT/maven-docck-plugin-1.2-SNAPSHOT.jar>
[INFO] Installing <https://builds.apache.org/job/maven-plugins-ITs-m3/ws/maven-docck-plugin/pom.xml>
to <https://builds.apache.org/job/maven-plugins-ITs-m3/ws/maven-gpg-plugin/target/local-repo/org/apache/maven/plugins/maven-docck-plugin/1.2-SNAPSHOT/maven-docck-plugin-1.2-SNAPSHOT.pom>
[INFO] Installing <https://builds.apache.org/job/maven-plugins-ITs-m3/ws/maven-ear-plugin/pom.xml>
to <https://builds.apache.org/job/maven-plugins-ITs-m3/ws/maven-gpg-plugin/target/local-repo/org/apache/maven/plugins/maven-ear-plugin/2.10.2-SNAPSHOT/maven-ear-plugin-2.10.2-SNAPSHOT.pom>
[INFO] Installing <https://builds.apache.org/job/maven-plugins-ITs-m3/ws/maven-ear-plugin/target/maven-ear-plugin-2.10.2-SNAPSHOT.jar>
to <https://builds.apache.org/job/maven-plugins-ITs-m3/ws/maven-gpg-plugin/target/local-repo/org/apache/maven/plugins/maven-ear-plugin/2.10.2-SNAPSHOT/maven-ear-plugin-2.10.2-SNAPSHOT.jar>
[INFO] Installing <https://builds.apache.org/job/maven-plugins-ITs-m3/ws/maven-ear-plugin/pom.xml>
to <https://builds.apache.org/job/maven-plugins-ITs-m3/ws/maven-gpg-plugin/target/local-repo/org/apache/maven/plugins/maven-ear-plugin/2.10.2-SNAPSHOT/maven-ear-plugin-2.10.2-SNAPSHOT.pom>
[INFO] Installing <https://builds.apache.org/job/maven-plugins-ITs-m3/ws/maven-ejb-plugin/pom.xml>
to <https://builds.apache.org/job/maven-plugins-ITs-m3/ws/maven-gpg-plugin/target/local-repo/org/apache/maven/plugins/maven-ejb-plugin/2.5.2-SNAPSHOT/maven-ejb-plugin-2.5.2-SNAPSHOT.pom>
[INFO] Installing <https://builds.apache.org/job/maven-plugins-ITs-m3/ws/maven-ejb-plugin/target/maven-ejb-plugin-2.5.2-SNAPSHOT.jar>
to <https://builds.apache.org/job/maven-plugins-ITs-m3/ws/maven-gpg-plugin/target/local-repo/org/apache/maven/plugins/maven-ejb-plugin/2.5.2-SNAPSHOT/maven-ejb-plugin-2.5.2-SNAPSHOT.jar>
[INFO] Installing <https://builds.apache.org/job/maven-plugins-ITs-m3/ws/maven-ejb-plugin/pom.xml>
to <https://builds.apache.org/job/maven-plugins-ITs-m3/ws/maven-gpg-plugin/target/local-repo/org/apache/maven/plugins/maven-ejb-plugin/2.5.2-SNAPSHOT/maven-ejb-plugin-2.5.2-SNAPSHOT.pom>
[INFO] Installing <https://builds.apache.org/job/maven-plugins-ITs-m3/ws/maven-help-plugin/pom.xml>
to <https://builds.apache.org/job/maven-plugins-ITs-m3/ws/maven-gpg-plugin/target/local-repo/org/apache/maven/plugins/maven-help-plugin/2.2.1-SNAPSHOT/maven-help-plugin-2.2.1-SNAPSHOT.pom>
[INFO] Installing <https://builds.apache.org/job/maven-plugins-ITs-m3/ws/maven-help-plugin/target/maven-help-plugin-2.2.1-SNAPSHOT.jar>
to <https://builds.apache.org/job/maven-plugins-ITs-m3/ws/maven-gpg-plugin/target/local-repo/org/apache/maven/plugins/maven-help-plugin/2.2.1-SNAPSHOT/maven-help-plugin-2.2.1-SNAPSHOT.jar>
[INFO] Installing <https://builds.apache.org/job/maven-plugins-ITs-m3/ws/maven-help-plugin/pom.xml>
to <https://builds.apache.org/job/maven-plugins-ITs-m3/ws/maven-gpg-plugin/target/local-repo/org/apache/maven/plugins/maven-help-plugin/2.2.1-SNAPSHOT/maven-help-plugin-2.2.1-SNAPSHOT.pom>
[INFO] Installing <https://builds.apache.org/job/maven-plugins-ITs-m3/ws/maven-install-plugin/pom.xml>
to <https://builds.apache.org/job/maven-plugins-ITs-m3/ws/maven-gpg-plugin/target/local-repo/org/apache/maven/plugins/maven-install-plugin/2.5.3-SNAPSHOT/maven-install-plugin-2.5.3-SNAPSHOT.pom>
[INFO] Installing <https://builds.apache.org/job/maven-plugins-ITs-m3/ws/maven-install-plugin/target/maven-install-plugin-2.5.3-SNAPSHOT.jar>
to <https://builds.apache.org/job/maven-plugins-ITs-m3/ws/maven-gpg-plugin/target/local-repo/org/apache/maven/plugins/maven-install-plugin/2.5.3-SNAPSHOT/maven-install-plugin-2.5.3-SNAPSHOT.jar>
[INFO] Installing <https://builds.apache.org/job/maven-plugins-ITs-m3/ws/maven-install-plugin/pom.xml>
to <https://builds.apache.org/job/maven-plugins-ITs-m3/ws/maven-gpg-plugin/target/local-repo/org/apache/maven/plugins/maven-install-plugin/2.5.3-SNAPSHOT/maven-install-plugin-2.5.3-SNAPSHOT.pom>
[INFO] Installing <https://builds.apache.org/job/maven-plugins-ITs-m3/ws/maven-jar-plugin/pom.xml>
to <https://builds.apache.org/job/maven-plugins-ITs-m3/ws/maven-gpg-plugin/target/local-repo/org/apache/maven/plugins/maven-jar-plugin/2.7-SNAPSHOT/maven-jar-plugin-2.7-SNAPSHOT.pom>
[INFO] Installing <https://builds.apache.org/job/maven-plugins-ITs-m3/ws/maven-jar-plugin/target/maven-jar-plugin-2.7-SNAPSHOT.jar>
to <https://builds.apache.org/job/maven-plugins-ITs-m3/ws/maven-gpg-plugin/target/local-repo/org/apache/maven/plugins/maven-jar-plugin/2.7-SNAPSHOT/maven-jar-plugin-2.7-SNAPSHOT.jar>
[INFO] Installing <https://builds.apache.org/job/maven-plugins-ITs-m3/ws/maven-jar-plugin/pom.xml>
to <https://builds.apache.org/job/maven-plugins-ITs-m3/ws/maven-gpg-plugin/target/local-repo/org/apache/maven/plugins/maven-jar-plugin/2.7-SNAPSHOT/maven-jar-plugin-2.7-SNAPSHOT.pom>
[INFO] Installing <https://builds.apache.org/job/maven-plugins-ITs-m3/ws/maven-jarsigner-plugin/pom.xml>
to <https://builds.apache.org/job/maven-plugins-ITs-m3/ws/maven-gpg-plugin/target/local-repo/org/apache/maven/plugins/maven-jarsigner-plugin/1.5-SNAPSHOT/maven-jarsigner-plugin-1.5-SNAPSHOT.pom>
[INFO] Installing <https://builds.apache.org/job/maven-plugins-ITs-m3/ws/maven-jarsigner-plugin/target/maven-jarsigner-plugin-1.5-SNAPSHOT.jar>
to <https://builds.apache.org/job/maven-plugins-ITs-m3/ws/maven-gpg-plugin/target/local-repo/org/apache/maven/plugins/maven-jarsigner-plugin/1.5-SNAPSHOT/maven-jarsigner-plugin-1.5-SNAPSHOT.jar>
[INFO] Installing <https://builds.apache.org/job/maven-plugins-ITs-m3/ws/maven-jarsigner-plugin/pom.xml>
to <https://builds.apache.org/job/maven-plugins-ITs-m3/ws/maven-gpg-plugin/target/local-repo/org/apache/maven/plugins/maven-jarsigner-plugin/1.5-SNAPSHOT/maven-jarsigner-plugin-1.5-SNAPSHOT.pom>
[INFO] Installing <https://builds.apache.org/job/maven-plugins-ITs-m3/ws/maven-javadoc-plugin/pom.xml>
to <https://builds.apache.org/job/maven-plugins-ITs-m3/ws/maven-gpg-plugin/target/local-repo/org/apache/maven/plugins/maven-javadoc-plugin/2.10.4-SNAPSHOT/maven-javadoc-plugin-2.10.4-SNAPSHOT.pom>
[INFO] Installing <https://builds.apache.org/job/maven-plugins-ITs-m3/ws/maven-javadoc-plugin/target/maven-javadoc-plugin-2.10.4-SNAPSHOT.jar>
to <https://builds.apache.org/job/maven-plugins-ITs-m3/ws/maven-gpg-plugin/target/local-repo/org/apache/maven/plugins/maven-javadoc-plugin/2.10.4-SNAPSHOT/maven-javadoc-plugin-2.10.4-SNAPSHOT.jar>
[INFO] Installing <https://builds.apache.org/job/maven-plugins-ITs-m3/ws/maven-javadoc-plugin/pom.xml>
to <https://builds.apache.org/job/maven-plugins-ITs-m3/ws/maven-gpg-plugin/target/local-repo/org/apache/maven/plugins/maven-javadoc-plugin/2.10.4-SNAPSHOT/maven-javadoc-plugin-2.10.4-SNAPSHOT.pom>
[INFO] Installing <https://builds.apache.org/job/maven-plugins-ITs-m3/ws/maven-linkcheck-plugin/pom.xml>
to <https://builds.apache.org/job/maven-plugins-ITs-m3/ws/maven-gpg-plugin/target/local-repo/org/apache/maven/plugins/maven-linkcheck-plugin/1.3-SNAPSHOT/maven-linkcheck-plugin-1.3-SNAPSHOT.pom>
[INFO] Installing <https://builds.apache.org/job/maven-plugins-ITs-m3/ws/maven-linkcheck-plugin/target/maven-linkcheck-plugin-1.3-SNAPSHOT.jar>
to <https://builds.apache.org/job/maven-plugins-ITs-m3/ws/maven-gpg-plugin/target/local-repo/org/apache/maven/plugins/maven-linkcheck-plugin/1.3-SNAPSHOT/maven-linkcheck-plugin-1.3-SNAPSHOT.jar>
[INFO] Installing <https://builds.apache.org/job/maven-plugins-ITs-m3/ws/maven-linkcheck-plugin/pom.xml>
to <https://builds.apache.org/job/maven-plugins-ITs-m3/ws/maven-gpg-plugin/target/local-repo/org/apache/maven/plugins/maven-linkcheck-plugin/1.3-SNAPSHOT/maven-linkcheck-plugin-1.3-SNAPSHOT.pom>
[INFO] Installing <https://builds.apache.org/job/maven-plugins-ITs-m3/ws/maven-patch-plugin/pom.xml>
to <https://builds.apache.org/job/maven-plugins-ITs-m3/ws/maven-gpg-plugin/target/local-repo/org/apache/maven/plugins/maven-patch-plugin/1.3-SNAPSHOT/maven-patch-plugin-1.3-SNAPSHOT.pom>
[INFO] Installing <https://builds.apache.org/job/maven-plugins-ITs-m3/ws/maven-patch-plugin/target/maven-patch-plugin-1.3-SNAPSHOT.jar>
to <https://builds.apache.org/job/maven-plugins-ITs-m3/ws/maven-gpg-plugin/target/local-repo/org/apache/maven/plugins/maven-patch-plugin/1.3-SNAPSHOT/maven-patch-plugin-1.3-SNAPSHOT.jar>
[INFO] Installing <https://builds.apache.org/job/maven-plugins-ITs-m3/ws/maven-patch-plugin/pom.xml>
to <https://builds.apache.org/job/maven-plugins-ITs-m3/ws/maven-gpg-plugin/target/local-repo/org/apache/maven/plugins/maven-patch-plugin/1.3-SNAPSHOT/maven-patch-plugin-1.3-SNAPSHOT.pom>
[INFO] Installing <https://builds.apache.org/job/maven-plugins-ITs-m3/ws/maven-pdf-plugin/pom.xml>
to <https://builds.apache.org/job/maven-plugins-ITs-m3/ws/maven-gpg-plugin/target/local-repo/org/apache/maven/plugins/maven-pdf-plugin/1.4-SNAPSHOT/maven-pdf-plugin-1.4-SNAPSHOT.pom>
[INFO] Installing <https://builds.apache.org/job/maven-plugins-ITs-m3/ws/maven-pdf-plugin/target/maven-pdf-plugin-1.4-SNAPSHOT.jar>
to <https://builds.apache.org/job/maven-plugins-ITs-m3/ws/maven-gpg-plugin/target/local-repo/org/apache/maven/plugins/maven-pdf-plugin/1.4-SNAPSHOT/maven-pdf-plugin-1.4-SNAPSHOT.jar>
[INFO] Installing <https://builds.apache.org/job/maven-plugins-ITs-m3/ws/maven-pdf-plugin/pom.xml>
to <https://builds.apache.org/job/maven-plugins-ITs-m3/ws/maven-gpg-plugin/target/local-repo/org/apache/maven/plugins/maven-pdf-plugin/1.4-SNAPSHOT/maven-pdf-plugin-1.4-SNAPSHOT.pom>
[INFO] Installing <https://builds.apache.org/job/maven-plugins-ITs-m3/ws/maven-rar-plugin/pom.xml>
to <https://builds.apache.org/job/maven-plugins-ITs-m3/ws/maven-gpg-plugin/target/local-repo/org/apache/maven/plugins/maven-rar-plugin/2.5-SNAPSHOT/maven-rar-plugin-2.5-SNAPSHOT.pom>
[INFO] Installing <https://builds.apache.org/job/maven-plugins-ITs-m3/ws/maven-rar-plugin/target/maven-rar-plugin-2.5-SNAPSHOT.jar>
to <https://builds.apache.org/job/maven-plugins-ITs-m3/ws/maven-gpg-plugin/target/local-repo/org/apache/maven/plugins/maven-rar-plugin/2.5-SNAPSHOT/maven-rar-plugin-2.5-SNAPSHOT.jar>
[INFO] Installing <https://builds.apache.org/job/maven-plugins-ITs-m3/ws/maven-rar-plugin/pom.xml>
to <https://builds.apache.org/job/maven-plugins-ITs-m3/ws/maven-gpg-plugin/target/local-repo/org/apache/maven/plugins/maven-rar-plugin/2.5-SNAPSHOT/maven-rar-plugin-2.5-SNAPSHOT.pom>
[INFO] Installing <https://builds.apache.org/job/maven-plugins-ITs-m3/ws/maven-repository-plugin/pom.xml>
to <https://builds.apache.org/job/maven-plugins-ITs-m3/ws/maven-gpg-plugin/target/local-repo/org/apache/maven/plugins/maven-repository-plugin/2.5-SNAPSHOT/maven-repository-plugin-2.5-SNAPSHOT.pom>
[INFO] Installing <https://builds.apache.org/job/maven-plugins-ITs-m3/ws/maven-repository-plugin/target/maven-repository-plugin-2.5-SNAPSHOT.jar>
to <https://builds.apache.org/job/maven-plugins-ITs-m3/ws/maven-gpg-plugin/target/local-repo/org/apache/maven/plugins/maven-repository-plugin/2.5-SNAPSHOT/maven-repository-plugin-2.5-SNAPSHOT.jar>
[INFO] Installing <https://builds.apache.org/job/maven-plugins-ITs-m3/ws/maven-repository-plugin/pom.xml>
to <https://builds.apache.org/job/maven-plugins-ITs-m3/ws/maven-gpg-plugin/target/local-repo/org/apache/maven/plugins/maven-repository-plugin/2.5-SNAPSHOT/maven-repository-plugin-2.5-SNAPSHOT.pom>
[INFO] Installing <https://builds.apache.org/job/maven-plugins-ITs-m3/ws/maven-resources-plugin/pom.xml>
to <https://builds.apache.org/job/maven-plugins-ITs-m3/ws/maven-gpg-plugin/target/local-repo/org/apache/maven/plugins/maven-resources-plugin/2.8-SNAPSHOT/maven-resources-plugin-2.8-SNAPSHOT.pom>
[INFO] Installing <https://builds.apache.org/job/maven-plugins-ITs-m3/ws/maven-resources-plugin/target/maven-resources-plugin-2.8-SNAPSHOT.jar>
to <https://builds.apache.org/job/maven-plugins-ITs-m3/ws/maven-gpg-plugin/target/local-repo/org/apache/maven/plugins/maven-resources-plugin/2.8-SNAPSHOT/maven-resources-plugin-2.8-SNAPSHOT.jar>
[INFO] Installing <https://builds.apache.org/job/maven-plugins-ITs-m3/ws/maven-resources-plugin/pom.xml>
to <https://builds.apache.org/job/maven-plugins-ITs-m3/ws/maven-gpg-plugin/target/local-repo/org/apache/maven/plugins/maven-resources-plugin/2.8-SNAPSHOT/maven-resources-plugin-2.8-SNAPSHOT.pom>
[INFO] Installing <https://builds.apache.org/job/maven-plugins-ITs-m3/ws/maven-resources-plugin/target/maven-resources-plugin-2.8-SNAPSHOT-tests.jar>
to <https://builds.apache.org/job/maven-plugins-ITs-m3/ws/maven-gpg-plugin/target/local-repo/org/apache/maven/plugins/maven-resources-plugin/2.8-SNAPSHOT/maven-resources-plugin-2.8-SNAPSHOT-tests.jar>
[INFO] Installing <https://builds.apache.org/job/maven-plugins-ITs-m3/ws/maven-site-plugin/dependency-reduced-pom.xml>
to <https://builds.apache.org/job/maven-plugins-ITs-m3/ws/maven-gpg-plugin/target/local-repo/org/apache/maven/plugins/maven-site-plugin/3.4.1-SNAPSHOT/maven-site-plugin-3.4.1-SNAPSHOT.pom>
[INFO] Installing <https://builds.apache.org/job/maven-plugins-ITs-m3/ws/maven-site-plugin/target/maven-site-plugin-3.4.1-SNAPSHOT.jar>
to <https://builds.apache.org/job/maven-plugins-ITs-m3/ws/maven-gpg-plugin/target/local-repo/org/apache/maven/plugins/maven-site-plugin/3.4.1-SNAPSHOT/maven-site-plugin-3.4.1-SNAPSHOT.jar>
[INFO] Installing <https://builds.apache.org/job/maven-plugins-ITs-m3/ws/maven-site-plugin/dependency-reduced-pom.xml>
to <https://builds.apache.org/job/maven-plugins-ITs-m3/ws/maven-gpg-plugin/target/local-repo/org/apache/maven/plugins/maven-site-plugin/3.4.1-SNAPSHOT/maven-site-plugin-3.4.1-SNAPSHOT.pom>
[INFO] Installing <https://builds.apache.org/job/maven-plugins-ITs-m3/ws/maven-source-plugin/pom.xml>
to <https://builds.apache.org/job/maven-plugins-ITs-m3/ws/maven-gpg-plugin/target/local-repo/org/apache/maven/plugins/maven-source-plugin/3.0.0-SNAPSHOT/maven-source-plugin-3.0.0-SNAPSHOT.pom>
[INFO]                                                                         
[INFO] ------------------------------------------------------------------------
[INFO] Building Apache Maven Plugins Aggregator 1-SNAPSHOT
[INFO] ------------------------------------------------------------------------
[INFO] Downloading: http://repo.maven.apache.org/maven2/org/apache/maven/plugins/maven-site-plugin/3.3/maven-site-plugin-3.3.pom
[INFO] Downloaded: http://repo.maven.apache.org/maven2/org/apache/maven/plugins/maven-site-plugin/3.3/maven-site-plugin-3.3.pom
(21 KB at 967.9 KB/sec)
[INFO] Downloading: http://repo.maven.apache.org/maven2/org/apache/maven/plugins/maven-site-plugin/3.3/maven-site-plugin-3.3.jar
[INFO] Downloaded: http://repo.maven.apache.org/maven2/org/apache/maven/plugins/maven-site-plugin/3.3/maven-site-plugin-3.3.jar
(122 KB at 4337.2 KB/sec)
[INFO] Downloading: http://repo.maven.apache.org/maven2/org/apache/maven/plugins/maven-install-plugin/2.5.1/maven-install-plugin-2.5.1.pom
[INFO] Downloaded: http://repo.maven.apache.org/maven2/org/apache/maven/plugins/maven-install-plugin/2.5.1/maven-install-plugin-2.5.1.pom
(8 KB at 355.7 KB/sec)
[INFO] Downloading: http://repo.maven.apache.org/maven2/org/apache/maven/plugins/maven-install-plugin/2.5.1/maven-install-plugin-2.5.1.jar
[INFO] Downloaded: http://repo.maven.apache.org/maven2/org/apache/maven/plugins/maven-install-plugin/2.5.1/maven-install-plugin-2.5.1.jar
(33 KB at 1529.3 KB/sec)
[INFO] 
[INFO] --- maven-clean-plugin:2.5:clean (default-clean) @ maven-plugins-aggregator ---
[INFO] 
[INFO] --- maven-enforcer-plugin:1.3.1:enforce (enforce-bytecode-version) @ maven-plugins-aggregator
---
[INFO] Downloading: http://repo.maven.apache.org/maven2/org/codehaus/mojo/extra-enforcer-rules/1.0-beta-2/extra-enforcer-rules-1.0-beta-2.pom
[INFO] Downloaded: http://repo.maven.apache.org/maven2/org/codehaus/mojo/extra-enforcer-rules/1.0-beta-2/extra-enforcer-rules-1.0-beta-2.pom
(7 KB at 310.0 KB/sec)
[INFO] Downloading: http://repo.maven.apache.org/maven2/org/codehaus/mojo/extra-enforcer-rules/1.0-beta-2/extra-enforcer-rules-1.0-beta-2.jar
[INFO] Downloaded: http://repo.maven.apache.org/maven2/org/codehaus/mojo/extra-enforcer-rules/1.0-beta-2/extra-enforcer-rules-1.0-beta-2.jar
(30 KB at 1426.2 KB/sec)
[INFO] 
[INFO] --- maven-enforcer-plugin:1.3.1:enforce (ban-known-bad-maven-versions) @ maven-plugins-aggregator
---
[INFO] 
[INFO] --- maven-remote-resources-plugin:1.5:process (default) @ maven-plugins-aggregator
---
[INFO] 
[INFO] --- maven-site-plugin:3.3:attach-descriptor (attach-descriptor) @ maven-plugins-aggregator
---
[INFO] Downloading: http://repo.maven.apache.org/maven2/org/apache/maven/reporting/maven-reporting-exec/1.1/maven-reporting-exec-1.1.pom
[INFO] Downloaded: http://repo.maven.apache.org/maven2/org/apache/maven/reporting/maven-reporting-exec/1.1/maven-reporting-exec-1.1.pom
(11 KB at 509.6 KB/sec)
[INFO] Downloading: http://repo.maven.apache.org/maven2/org/apache/maven/doxia/doxia-module-apt/1.4/doxia-module-apt-1.4.pom
[INFO] Downloaded: http://repo.maven.apache.org/maven2/org/apache/maven/doxia/doxia-module-apt/1.4/doxia-module-apt-1.4.pom
(2 KB at 80.0 KB/sec)
[INFO] Downloading: http://repo.maven.apache.org/maven2/org/apache/maven/doxia/doxia-module-xdoc/1.4/doxia-module-xdoc-1.4.pom
[INFO] Downloaded: http://repo.maven.apache.org/maven2/org/apache/maven/doxia/doxia-module-xdoc/1.4/doxia-module-xdoc-1.4.pom
(5 KB at 225.1 KB/sec)
[INFO] Downloading: http://repo.maven.apache.org/maven2/org/apache/maven/doxia/doxia-module-markdown/1.4/doxia-module-markdown-1.4.pom
[INFO] Downloaded: http://repo.maven.apache.org/maven2/org/apache/maven/doxia/doxia-module-markdown/1.4/doxia-module-markdown-1.4.pom
(3 KB at 107.3 KB/sec)
[INFO] Downloading: http://repo.maven.apache.org/maven2/org/apache/maven/doxia/doxia-integration-tools/1.5/doxia-integration-tools-1.5.pom
[INFO] Downloaded: http://repo.maven.apache.org/maven2/org/apache/maven/doxia/doxia-integration-tools/1.5/doxia-integration-tools-1.5.pom
(7 KB at 337.4 KB/sec)
[INFO] Downloading: http://repo.maven.apache.org/maven2/org/apache/maven/doxia/doxia-tools/2/doxia-tools-2.pom
[INFO] Downloaded: http://repo.maven.apache.org/maven2/org/apache/maven/doxia/doxia-tools/2/doxia-tools-2.pom
(12 KB at 440.8 KB/sec)
[INFO] Downloading: http://repo.maven.apache.org/maven2/org/apache/maven/reporting/maven-reporting-exec/1.1/maven-reporting-exec-1.1.jar
[INFO] Downloading: http://repo.maven.apache.org/maven2/org/apache/maven/doxia/doxia-module-apt/1.4/doxia-module-apt-1.4.jar
[INFO] Downloading: http://repo.maven.apache.org/maven2/org/apache/maven/doxia/doxia-module-xdoc/1.4/doxia-module-xdoc-1.4.jar
[INFO] Downloading: http://repo.maven.apache.org/maven2/org/apache/maven/doxia/doxia-module-markdown/1.4/doxia-module-markdown-1.4.jar
[INFO] Downloading: http://repo.maven.apache.org/maven2/org/apache/maven/doxia/doxia-integration-tools/1.5/doxia-integration-tools-1.5.jar
[INFO] Downloaded: http://repo.maven.apache.org/maven2/org/apache/maven/doxia/doxia-module-markdown/1.4/doxia-module-markdown-1.4.jar
(12 KB at 569.2 KB/sec)
[INFO] Downloaded: http://repo.maven.apache.org/maven2/org/apache/maven/doxia/doxia-integration-tools/1.5/doxia-integration-tools-1.5.jar
(45 KB at 2097.5 KB/sec)
[INFO] Downloaded: http://repo.maven.apache.org/maven2/org/apache/maven/doxia/doxia-module-xdoc/1.4/doxia-module-xdoc-1.4.jar
(36 KB at 151.7 KB/sec)
[INFO] Downloaded: http://repo.maven.apache.org/maven2/org/apache/maven/doxia/doxia-module-apt/1.4/doxia-module-apt-1.4.jar
(51 KB at 214.7 KB/sec)
[INFO] Downloaded: http://repo.maven.apache.org/maven2/org/apache/maven/reporting/maven-reporting-exec/1.1/maven-reporting-exec-1.1.jar
(26 KB at 85.5 KB/sec)
[INFO] 
[INFO] --- maven-install-plugin:2.5.1:install (default-install) @ maven-plugins-aggregator
---
[INFO] Installing <https://builds.apache.org/job/maven-plugins-ITs-m3/ws/pom.xml> to
/home/jenkins/.m2/repository/org/apache/maven/plugins/maven-plugins-aggregator/1-SNAPSHOT/maven-plugins-aggregator-1-SNAPSHOT.pom
[INFO] ------------------------------------------------------------------------
[INFO] Reactor Summary:
[INFO] 
[INFO] Apache Maven Plugins .............................. SUCCESS [ 34.760 s]
[INFO] Apache Maven ACR Plugin ........................... SUCCESS [ 28.830 s]
[INFO] Apache Maven Ant Plugin ........................... SUCCESS [01:34 min]
[INFO] Apache Maven AntRun Plugin ........................ SUCCESS [01:02 min]
[INFO] Apache Maven Changelog Plugin ..................... SUCCESS [ 57.726 s]
[INFO] Apache Maven Changes Plugin ....................... SUCCESS [01:09 min]
[INFO] Apache Maven Clean Plugin ......................... SUCCESS [ 26.933 s]
[INFO] Apache Maven Compiler Plugin ...................... SUCCESS [02:22 min]
[INFO] Apache Maven Deploy Plugin ........................ SUCCESS [01:31 min]
[INFO] Apache Maven Documentation Checker Plugin ......... SUCCESS [  5.465 s]
[INFO] Apache Maven EAR Plugin ........................... SUCCESS [06:03 min]
[INFO] Apache Maven EJB Plugin ........................... SUCCESS [ 33.239 s]
[INFO] Apache Maven Help Plugin .......................... SUCCESS [ 53.010 s]
[INFO] Apache Maven Install Plugin ....................... SUCCESS [01:12 min]
[INFO] Apache Maven JAR Plugin ........................... SUCCESS [01:30 min]
[INFO] Apache Maven Jarsigner Plugin ..................... SUCCESS [ 42.834 s]
[INFO] Apache Maven Javadoc Plugin ....................... SUCCESS [04:05 min]
[INFO] Apache Maven Linkcheck Plugin ..................... SUCCESS [  4.158 s]
[INFO] Apache Maven Patch Plugin ......................... SUCCESS [ 14.462 s]
[INFO] Apache Maven PDF Plugin ........................... SUCCESS [01:38 min]
[INFO] Apache Maven RAR Plugin ........................... SUCCESS [ 12.762 s]
[INFO] Apache Maven Repository Plugin .................... SUCCESS [ 46.185 s]
[INFO] Apache Maven Resources Plugin ..................... SUCCESS [01:08 min]
[INFO] Apache Maven Site Plugin .......................... SUCCESS [08:01 min]
[INFO] Apache Maven Source Plugin ........................ FAILURE [  5.096 s]
[INFO] Apache Maven Stage Plugin ......................... FAILURE [  3.119 s]
[INFO] Apache Maven Toolchains Plugin .................... FAILURE [  1.662 s]
[INFO] Apache Maven Verifier Plugin ...................... FAILURE [  1.093 s]
[INFO] Apache Maven WAR Plugin ........................... FAILURE [  8.907 s]
[INFO] Apache Maven DOAP Plugin .......................... FAILURE [  5.078 s]
[INFO] Apache Maven PMD Plugin ........................... FAILURE [ 18.012 s]
[INFO] Apache Maven Invoker Plugin ....................... FAILURE [  8.475 s]
[INFO] Apache Maven Project Info Reports Plugin .......... FAILURE [ 40.704 s]
[INFO] Apache Maven Remote Resources Plugin .............. FAILURE [  4.403 s]
[INFO] Apache Maven Shade Plugin ......................... FAILURE [  6.338 s]
[INFO] Apache Maven SCM Publish Plugin ................... FAILURE [  5.287 s]
[INFO] Apache Maven Assembly Plugin ...................... FAILURE [ 22.137 s]
[INFO] Apache Maven Dependency Plugin .................... FAILURE [ 53.633 s]
[INFO] Apache Maven GPG Plugin ........................... FAILURE [  0.875 s]
[INFO] Apache Maven Plugins Aggregator ................... SUCCESS [  1.033 s]
[INFO] ------------------------------------------------------------------------
[INFO] BUILD FAILURE
[INFO] ------------------------------------------------------------------------
[INFO] Total time: 40:30 min
[INFO] Finished at: 2015-10-06T22:43:13+00:00
[INFO] Final Memory: 90M/374M
[INFO] ------------------------------------------------------------------------
[WARNING] The requested profile "apache.snapshots" could not be activated because it does
not exist.
[ERROR] Failed to execute goal org.apache.maven.plugins:maven-surefire-plugin:2.18.1:test
(default-test) on project maven-source-plugin: There are test failures.
[ERROR] 
[ERROR] Please refer to <https://builds.apache.org/job/maven-plugins-ITs-m3/ws/maven-source-plugin/target/surefire-reports>
for the individual test results.
[ERROR] -> [Help 1]
[ERROR] Failed to execute goal org.apache.maven.plugins:maven-invoker-plugin:2.0.0:install
(integration-test) on project maven-stage-plugin: Failed to install project dependencies:
MavenProject: org.apache.maven.plugins:maven-stage-plugin:1.1-SNAPSHOT @ <https://builds.apache.org/job/maven-plugins-ITs-m3/ws/maven-stage-plugin/pom.xml>:
Failed to install project artifacts: MavenProject: org.apache.maven.plugins:maven-source-plugin:3.0.0-SNAPSHOT
@ <https://builds.apache.org/job/maven-plugins-ITs-m3/ws/maven-source-plugin/pom.xml>:
Failed to install artifact: org.apache.maven.plugins:maven-source-plugin:maven-plugin:3.0.0-SNAPSHOT:
Artifact is not fully assembled: <https://builds.apache.org/job/maven-plugins-ITs-m3/ws/maven-source-plugin/target/classes>
-> [Help 2]
[ERROR] Failed to execute goal org.apache.maven.plugins:maven-invoker-plugin:2.0.0:install
(integration-test) on project maven-toolchains-plugin: Failed to install project dependencies:
MavenProject: org.apache.maven.plugins:maven-toolchains-plugin:1.2-SNAPSHOT @ <https://builds.apache.org/job/maven-plugins-ITs-m3/ws/maven-toolchains-plugin/pom.xml>:
Failed to install project artifacts: MavenProject: org.apache.maven.plugins:maven-source-plugin:3.0.0-SNAPSHOT
@ <https://builds.apache.org/job/maven-plugins-ITs-m3/ws/maven-source-plugin/pom.xml>:
Failed to install artifact: org.apache.maven.plugins:maven-source-plugin:maven-plugin:3.0.0-SNAPSHOT:
Artifact is not fully assembled: <https://builds.apache.org/job/maven-plugins-ITs-m3/ws/maven-source-plugin/target/classes>
-> [Help 2]
[ERROR] Failed to execute goal org.apache.maven.plugins:maven-invoker-plugin:2.0.0:install
(integration-test) on project maven-verifier-plugin: Failed to install project dependencies:
MavenProject: org.apache.maven.plugins:maven-verifier-plugin:3.0.0-SNAPSHOT @ <https://builds.apache.org/job/maven-plugins-ITs-m3/ws/maven-verifier-plugin/pom.xml>:
Failed to install project artifacts: MavenProject: org.apache.maven.plugins:maven-source-plugin:3.0.0-SNAPSHOT
@ <https://builds.apache.org/job/maven-plugins-ITs-m3/ws/maven-source-plugin/pom.xml>:
Failed to install artifact: org.apache.maven.plugins:maven-source-plugin:maven-plugin:3.0.0-SNAPSHOT:
Artifact is not fully assembled: <https://builds.apache.org/job/maven-plugins-ITs-m3/ws/maven-source-plugin/target/classes>
-> [Help 2]
[ERROR] Failed to execute goal org.apache.maven.plugins:maven-invoker-plugin:1.10:install
(integration-test) on project maven-war-plugin: Failed to install project dependencies: MavenProject:
org.apache.maven.plugins:maven-war-plugin:2.7-SNAPSHOT @ <https://builds.apache.org/job/maven-plugins-ITs-m3/ws/maven-war-plugin/pom.xml>:
Failed to install project artifacts: MavenProject: org.apache.maven.plugins:maven-source-plugin:3.0.0-SNAPSHOT
@ <https://builds.apache.org/job/maven-plugins-ITs-m3/ws/maven-source-plugin/pom.xml>:
Failed to install artifact: org.apache.maven.plugins:maven-source-plugin:maven-plugin:3.0.0-SNAPSHOT:
Artifact is not fully assembled: <https://builds.apache.org/job/maven-plugins-ITs-m3/ws/maven-source-plugin/target/classes>
-> [Help 2]
[ERROR] Failed to execute goal org.apache.maven.plugins:maven-invoker-plugin:2.0.0:install
(integration-test) on project maven-doap-plugin: Failed to install project dependencies: MavenProject:
org.apache.maven.plugins:maven-doap-plugin:1.3-SNAPSHOT @ <https://builds.apache.org/job/maven-plugins-ITs-m3/ws/maven-doap-plugin/pom.xml>:
Failed to install project artifacts: MavenProject: org.apache.maven.plugins:maven-source-plugin:3.0.0-SNAPSHOT
@ <https://builds.apache.org/job/maven-plugins-ITs-m3/ws/maven-source-plugin/pom.xml>:
Failed to install artifact: org.apache.maven.plugins:maven-source-plugin:maven-plugin:3.0.0-SNAPSHOT:
Artifact is not fully assembled: <https://builds.apache.org/job/maven-plugins-ITs-m3/ws/maven-source-plugin/target/classes>
-> [Help 2]
[ERROR] Failed to execute goal org.apache.maven.plugins:maven-invoker-plugin:2.0.0:install
(integration-test) on project maven-pmd-plugin: Failed to install project dependencies: MavenProject:
org.apache.maven.plugins:maven-pmd-plugin:3.6-SNAPSHOT @ <https://builds.apache.org/job/maven-plugins-ITs-m3/ws/maven-pmd-plugin/pom.xml>:
Failed to install project artifacts: MavenProject: org.apache.maven.plugins:maven-source-plugin:3.0.0-SNAPSHOT
@ <https://builds.apache.org/job/maven-plugins-ITs-m3/ws/maven-source-plugin/pom.xml>:
Failed to install artifact: org.apache.maven.plugins:maven-source-plugin:maven-plugin:3.0.0-SNAPSHOT:
Artifact is not fully assembled: <https://builds.apache.org/job/maven-plugins-ITs-m3/ws/maven-source-plugin/target/classes>
-> [Help 2]
[ERROR] Failed to execute goal org.apache.maven.plugins:maven-invoker-plugin:1.9:install (integration-test)
on project maven-invoker-plugin: Failed to install project dependencies: MavenProject: org.apache.maven.plugins:maven-invoker-plugin:2.0.1-SNAPSHOT
@ <https://builds.apache.org/job/maven-plugins-ITs-m3/ws/maven-invoker-plugin/pom.xml>:
Failed to install project artifacts: MavenProject: org.apache.maven.plugins:maven-source-plugin:3.0.0-SNAPSHOT
@ <https://builds.apache.org/job/maven-plugins-ITs-m3/ws/maven-source-plugin/pom.xml>:
Failed to install artifact: org.apache.maven.plugins:maven-source-plugin:maven-plugin:3.0.0-SNAPSHOT:
Artifact is not fully assembled: <https://builds.apache.org/job/maven-plugins-ITs-m3/ws/maven-source-plugin/target/classes>
-> [Help 2]
[ERROR] Failed to execute goal org.apache.maven.plugins:maven-invoker-plugin:2.0.0:install
(integration-test) on project maven-project-info-reports-plugin: Failed to install project
dependencies: MavenProject: org.apache.maven.plugins:maven-project-info-reports-plugin:2.8.2-SNAPSHOT
@ <https://builds.apache.org/job/maven-plugins-ITs-m3/ws/maven-project-info-reports-plugin/pom.xml>:
Failed to install project artifacts: MavenProject: org.apache.maven.plugins:maven-source-plugin:3.0.0-SNAPSHOT
@ <https://builds.apache.org/job/maven-plugins-ITs-m3/ws/maven-source-plugin/pom.xml>:
Failed to install artifact: org.apache.maven.plugins:maven-source-plugin:maven-plugin:3.0.0-SNAPSHOT:
Artifact is not fully assembled: <https://builds.apache.org/job/maven-plugins-ITs-m3/ws/maven-source-plugin/target/classes>
-> [Help 2]
[ERROR] Failed to execute goal org.apache.maven.plugins:maven-invoker-plugin:2.0.0:install
(integration-test) on project maven-remote-resources-plugin: Failed to install project dependencies:
MavenProject: org.apache.maven.plugins:maven-remote-resources-plugin:1.6-SNAPSHOT @ <https://builds.apache.org/job/maven-plugins-ITs-m3/ws/maven-remote-resources-plugin/pom.xml>:
Failed to install project artifacts: MavenProject: org.apache.maven.plugins:maven-source-plugin:3.0.0-SNAPSHOT
@ <https://builds.apache.org/job/maven-plugins-ITs-m3/ws/maven-source-plugin/pom.xml>:
Failed to install artifact: org.apache.maven.plugins:maven-source-plugin:maven-plugin:3.0.0-SNAPSHOT:
Artifact is not fully assembled: <https://builds.apache.org/job/maven-plugins-ITs-m3/ws/maven-source-plugin/target/classes>
-> [Help 2]
[ERROR] Failed to execute goal org.apache.maven.plugins:maven-invoker-plugin:1.10:install
(integration-test) on project maven-shade-plugin: Failed to install project dependencies:
MavenProject: org.apache.maven.plugins:maven-shade-plugin:2.4.2-SNAPSHOT @ <https://builds.apache.org/job/maven-plugins-ITs-m3/ws/maven-shade-plugin/pom.xml>:
Failed to install project artifacts: MavenProject: org.apache.maven.plugins:maven-source-plugin:3.0.0-SNAPSHOT
@ <https://builds.apache.org/job/maven-plugins-ITs-m3/ws/maven-source-plugin/pom.xml>:
Failed to install artifact: org.apache.maven.plugins:maven-source-plugin:maven-plugin:3.0.0-SNAPSHOT:
Artifact is not fully assembled: <https://builds.apache.org/job/maven-plugins-ITs-m3/ws/maven-source-plugin/target/classes>
-> [Help 2]
[ERROR] Failed to execute goal org.apache.maven.plugins:maven-invoker-plugin:2.0.0:install
(integration-test) on project maven-scm-publish-plugin: Failed to install project dependencies:
MavenProject: org.apache.maven.plugins:maven-scm-publish-plugin:1.2-SNAPSHOT @ <https://builds.apache.org/job/maven-plugins-ITs-m3/ws/maven-scm-publish-plugin/pom.xml>:
Failed to install project artifacts: MavenProject: org.apache.maven.plugins:maven-source-plugin:3.0.0-SNAPSHOT
@ <https://builds.apache.org/job/maven-plugins-ITs-m3/ws/maven-source-plugin/pom.xml>:
Failed to install artifact: org.apache.maven.plugins:maven-source-plugin:maven-plugin:3.0.0-SNAPSHOT:
Artifact is not fully assembled: <https://builds.apache.org/job/maven-plugins-ITs-m3/ws/maven-source-plugin/target/classes>
-> [Help 2]
[ERROR] Failed to execute goal org.apache.maven.plugins:maven-invoker-plugin:3.0.0-SNAPSHOT:install
(integration-test) on project maven-assembly-plugin: Failed to install project dependencies:
MavenProject: org.apache.maven.plugins:maven-assembly-plugin:3.0.0-SNAPSHOT @ <https://builds.apache.org/job/maven-plugins-ITs-m3/ws/maven-assembly-plugin/pom.xml>:
Failed to install project artifacts: MavenProject: org.apache.maven.plugins:maven-source-plugin:3.0.0-SNAPSHOT
@ <https://builds.apache.org/job/maven-plugins-ITs-m3/ws/maven-source-plugin/pom.xml>:
Failed to install artifact: org.apache.maven.plugins:maven-source-plugin:maven-plugin:3.0.0-SNAPSHOT:
Artifact is not fully assembled: <https://builds.apache.org/job/maven-plugins-ITs-m3/ws/maven-source-plugin/target/classes>
-> [Help 2]
[ERROR] Failed to execute goal org.apache.maven.plugins:maven-invoker-plugin:2.0.0:install
(integration-test) on project maven-dependency-plugin: Failed to install project dependencies:
MavenProject: org.apache.maven.plugins:maven-dependency-plugin:3.0-SNAPSHOT @ <https://builds.apache.org/job/maven-plugins-ITs-m3/ws/maven-dependency-plugin/pom.xml>:
Failed to install project artifacts: MavenProject: org.apache.maven.plugins:maven-source-plugin:3.0.0-SNAPSHOT
@ <https://builds.apache.org/job/maven-plugins-ITs-m3/ws/maven-source-plugin/pom.xml>:
Failed to install artifact: org.apache.maven.plugins:maven-source-plugin:maven-plugin:3.0.0-SNAPSHOT:
Artifact is not fully assembled: <https://builds.apache.org/job/maven-plugins-ITs-m3/ws/maven-source-plugin/target/classes>
-> [Help 2]
[ERROR] Failed to execute goal org.apache.maven.plugins:maven-invoker-plugin:2.0.0:install
(integration-test) on project maven-gpg-plugin: Failed to install project dependencies: MavenProject:
org.apache.maven.plugins:maven-gpg-plugin:1.7-SNAPSHOT @ <https://builds.apache.org/job/maven-plugins-ITs-m3/ws/maven-gpg-plugin/pom.xml>:
Failed to install project artifacts: MavenProject: org.apache.maven.plugins:maven-source-plugin:3.0.0-SNAPSHOT
@ <https://builds.apache.org/job/maven-plugins-ITs-m3/ws/maven-source-plugin/pom.xml>:
Failed to install artifact: org.apache.maven.plugins:maven-source-plugin:maven-plugin:3.0.0-SNAPSHOT:
Artifact is not fully assembled: <https://builds.apache.org/job/maven-plugins-ITs-m3/ws/maven-source-plugin/target/classes>
-> [Help 2]
[ERROR] 
[ERROR] To see the full stack trace of the errors, re-run Maven with the -e switch.
[ERROR] Re-run Maven using the -X switch to enable full debug logging.
[ERROR] 
[ERROR] For more information about the errors and possible solutions, please read the following
articles:
[ERROR] [Help 1] http://cwiki.apache.org/confluence/display/MAVEN/MojoFailureException
[ERROR] [Help 2] http://cwiki.apache.org/confluence/display/MAVEN/MojoExecutionException
[ERROR] 
[ERROR] After correcting the problems, you can resume the build with the command
[ERROR]   mvn <goals> -rf :maven-source-plugin
Build step 'Invoke top-level Maven targets' marked build as failure
Deleting 1 temporary files
Recording test results

Mime
View raw message