maven-notifications mailing list archives

Site index · List index
Message view « Date » · « Thread »
Top « Date » · « Thread »
From Apache Jenkins Server <jenk...@builds.apache.org>
Subject Build failed in Jenkins: maven-enforcer #236
Date Sat, 14 Nov 2015 12:53:56 GMT
See <https://builds.apache.org/job/maven-enforcer/236/changes>

Changes:

[khmarbaise] Refactoring code.

------------------------------------------
[...truncated 1037 lines...]
[INFO] Installing <https://builds.apache.org/job/maven-enforcer/ws/enforcer-rules/pom.xml>
to <https://builds.apache.org/job/maven-enforcer/ws/maven-enforcer-plugin/target/local-repo/org/apache/maven/enforcer/enforcer-rules/1.4.2-SNAPSHOT/enforcer-rules-1.4.2-SNAPSHOT.pom>
[INFO] Installing <https://builds.apache.org/job/maven-enforcer/ws/enforcer-rules/target/enforcer-rules-1.4.2-SNAPSHOT.jar>
to <https://builds.apache.org/job/maven-enforcer/ws/maven-enforcer-plugin/target/local-repo/org/apache/maven/enforcer/enforcer-rules/1.4.2-SNAPSHOT/enforcer-rules-1.4.2-SNAPSHOT.jar>
[INFO] Installing <https://builds.apache.org/job/maven-enforcer/ws/enforcer-rules/pom.xml>
to <https://builds.apache.org/job/maven-enforcer/ws/maven-enforcer-plugin/target/local-repo/org/apache/maven/enforcer/enforcer-rules/1.4.2-SNAPSHOT/enforcer-rules-1.4.2-SNAPSHOT.pom>
[INFO] Installing <https://builds.apache.org/job/maven-enforcer/ws/enforcer-rules/target/enforcer-rules-1.4.2-SNAPSHOT-tests.jar>
to <https://builds.apache.org/job/maven-enforcer/ws/maven-enforcer-plugin/target/local-repo/org/apache/maven/enforcer/enforcer-rules/1.4.2-SNAPSHOT/enforcer-rules-1.4.2-SNAPSHOT-tests.jar>
[INFO] Installing <https://builds.apache.org/job/maven-enforcer/ws/maven-enforcer-plugin/pom.xml>
to <https://builds.apache.org/job/maven-enforcer/ws/maven-enforcer-plugin/target/local-repo/org/apache/maven/plugins/maven-enforcer-plugin/1.4.2-SNAPSHOT/maven-enforcer-plugin-1.4.2-SNAPSHOT.pom>
[INFO] Installing <https://builds.apache.org/job/maven-enforcer/ws/maven-enforcer-plugin/target/maven-enforcer-plugin-1.4.2-SNAPSHOT.jar>
to <https://builds.apache.org/job/maven-enforcer/ws/maven-enforcer-plugin/target/local-repo/org/apache/maven/plugins/maven-enforcer-plugin/1.4.2-SNAPSHOT/maven-enforcer-plugin-1.4.2-SNAPSHOT.jar>
[INFO] 
[INFO] --- mrm-maven-plugin:1.0-beta-2:start (default) @ maven-enforcer-plugin ---
[INFO] Configuring Mock Repository Manager...
[INFO]   Mock content (source: <https://builds.apache.org/job/maven-enforcer/ws/maven-enforcer-plugin/src/it/mrm/repository)>
[INFO]   Proxy (source: this Maven session)
[INFO] Starting Mock Repository Manager
[INFO] Logging to org.slf4j.impl.JDK14LoggerAdapter(org.mortbay.log) via org.mortbay.log.Slf4jLog
[INFO] jetty-6.1.5
[INFO] Started SocketConnector@0.0.0.0:42673
[INFO] Mock Repository Manager http://localhost:42673 is started.
[INFO] Setting property 'repository.proxy.url' to 'http://localhost:42673'.
[INFO] 
[INFO] --- maven-invoker-plugin:2.0.0:run (integration-test) @ maven-enforcer-plugin ---
[INFO] Building: banned-dependencies-versionrange/pom.xml
[INFO] snapshot org.apache.maven.plugins:maven-enforcer-plugin:1.4.2-SNAPSHOT: checking for
updates from Nexus
[INFO] artifact org.apache.maven.plugins.maven-enforcer-plugin:1.4.2-SNAPSHOT: checking for
updates from central
[INFO] org.apache.maven.plugins.maven-enforcer-plugin.1.4.2-SNAPSHOT: checking for updates
from central
[INFO] artifact org.apache.maven.enforcer.enforcer:1.4.2-SNAPSHOT: checking for updates from
central
[INFO] org.apache.maven.enforcer.enforcer.1.4.2-SNAPSHOT: checking for updates from central
[INFO] artifact org.apache.maven.enforcer.enforcer-api:1.4.2-SNAPSHOT: checking for updates
from central
[INFO] org.apache.maven.enforcer.enforcer-api.1.4.2-SNAPSHOT: checking for updates from central
[INFO] artifact org.apache.maven.enforcer.enforcer-rules:1.4.2-SNAPSHOT: checking for updates
from central
[INFO] org.apache.maven.enforcer.enforcer-rules.1.4.2-SNAPSHOT: checking for updates from
central
[INFO] ..SUCCESS (5.4 s)
[INFO] Building: require-property/pom.xml
[INFO] ..SUCCESS (2.6 s)
[INFO] Building: require-same-versions_failure/pom.xml
[INFO] ..SUCCESS (2.9 s)
[INFO] Building: ban-distribution-management-multi-module-except-site/pom.xml
[INFO] snapshot org.apache.maven.its.enforcer:module1:1.0-SNAPSHOT: checking for updates from
Nexus
[INFO] artifact org.apache.maven.its.enforcer.module1:1.0-SNAPSHOT: checking for updates from
central
[INFO] run script verify.groovy
[INFO] ..SUCCESS (3.7 s)
[INFO] Building: require-plugin-versions-plugin-with-extensions/pom.xml
[INFO] artifact org.apache.maven.plugins:maven-install-plugin: checking for updates from central
[INFO] artifact org.apache.maven.plugins:maven-deploy-plugin: checking for updates from central
[INFO] ..SUCCESS (3.9 s)
[INFO] Building: dependencies_converge/pom.xml
[INFO] ..SUCCESS (3.0 s)
[INFO] Building: require-upper-bound-dependencies-unique_success/pom.xml
[INFO] snapshot org.apache.maven.plugins.enforcer.its:menforcer134_project:1.0-SNAPSHOT: checking
for updates from Nexus
[INFO] artifact org.apache.maven.plugins.enforcer.its.menforcer134_project:1.0-SNAPSHOT: checking
for updates from central
[INFO] snapshot org.apache.maven.plugins.enforcer.its:menforcer134_modelbuilder:1.0-SNAPSHOT:
checking for updates from Nexus
[INFO] artifact org.apache.maven.plugins.enforcer.its.menforcer134_modelbuilder:1.0-SNAPSHOT:
checking for updates from central
Downloading: http://repo.maven.apache.org/maven2/org/apache/maven/plugins/enforcer/its/menforcer134_model/1.0-20130423.044324-5,638/menforcer134_model-1.0-20130423.044324-5,638.pom
Downloading: http://repo.maven.apache.org/maven2/org/apache/maven/plugins/enforcer/its/menforcer134_model/1.0-20130423.044324-5,638/menforcer134_model-1.0-20130423.044324-5,638.pom
[INFO] snapshot org.apache.maven.plugins.enforcer.its:menforcer134_model:1.0-SNAPSHOT: checking
for updates from Nexus
[INFO] artifact org.apache.maven.plugins.enforcer.its.menforcer134_model:1.0-SNAPSHOT: checking
for updates from central
Downloading: http://repo.maven.apache.org/maven2/org/apache/maven/plugins/enforcer/its/menforcer134_model/1.0-20130423.042904-7,222/menforcer134_model-1.0-20130423.042904-7,222.pom
Downloading: http://repo.maven.apache.org/maven2/org/apache/maven/plugins/enforcer/its/menforcer134_model/1.0-20130423.042904-7,222/menforcer134_model-1.0-20130423.042904-7,222.pom
[INFO] ..SUCCESS (3.8 s)
[INFO] Building: require-plugin-versions-custom-packaging/pom.xml
[INFO] artifact org.apache.maven.plugins:maven-resources-plugin: checking for updates from
central
[INFO] artifact org.apache.maven.plugins:maven-surefire-plugin: checking for updates from
central
[INFO] artifact org.apache.maven.plugins:maven-compiler-plugin: checking for updates from
central
[INFO] ..SUCCESS (3.7 s)
[INFO] Building: require-release-dependencies/pom.xml
[INFO] ..SUCCESS (2.7 s)
[INFO] Building: require-files-size/pom.xml
[INFO] ..SUCCESS (2.6 s)
[INFO] Building: require-upper-bound-deps_failure/pom.xml
[INFO] run script verify.groovy
[INFO] ..SUCCESS (2.8 s)
[INFO] Building: ban-transitive-dependencies/pom.xml
[INFO] ..SUCCESS (2.7 s)
[INFO] Building: require-upper-bound-dependencies-unique_failure/pom.xml
Downloading: http://repo.maven.apache.org/maven2/org/apache/maven/plugins/enforcer/its/menforcer134_model/1.0-20130423.044324-5,638/menforcer134_model-1.0-20130423.044324-5,638.pom
Downloading: http://repo.maven.apache.org/maven2/org/apache/maven/plugins/enforcer/its/menforcer134_model/1.0-20130423.044324-5,638/menforcer134_model-1.0-20130423.044324-5,638.pom
Downloading: http://repo.maven.apache.org/maven2/org/apache/maven/plugins/enforcer/its/menforcer134_model/1.0-20130423.042904-7,222/menforcer134_model-1.0-20130423.042904-7,222.pom
Downloading: http://repo.maven.apache.org/maven2/org/apache/maven/plugins/enforcer/its/menforcer134_model/1.0-20130423.042904-7,222/menforcer134_model-1.0-20130423.042904-7,222.pom
[INFO] run script verify.groovy
[INFO] ..SUCCESS (2.9 s)
[INFO] Building: require-java-version/pom.xml
[INFO] ..SUCCESS (2.6 s)
[INFO] Building: always-fail-warn/pom.xml
[INFO] run script verify.groovy
[INFO] ..SUCCESS (2.6 s)
[INFO] Building: builds_a_pom_noop/pom.xml
[INFO] ..SUCCESS (2.6 s)
[INFO] Building: require-files-dont-exist/pom.xml
[INFO] ..SUCCESS (2.6 s)
[INFO] Building: require-same-versions_success/pom.xml
[INFO] ..SUCCESS (2.9 s)
[INFO] Building: multimodule/pom.xml
[INFO] ..SUCCESS (2.6 s)
[INFO] Building: evaluate-beanshell/pom.xml
[INFO] ..SUCCESS (2.6 s)
[INFO] Building: require-maven-version/pom.xml
[INFO] ..SUCCESS (3.0 s)
[INFO] Building: ban-distribution-management/pom.xml
[INFO] run script verify.groovy
[INFO] ..SUCCESS (2.6 s)
[INFO] Building: banned-dependencies-wildcards/pom.xml
[INFO] ..SUCCESS (2.7 s)
[INFO] Building: require-upper-bound-deps_success/pom.xml
[INFO] ..SUCCESS (2.7 s)
[INFO] Building: require-files-exist/pom.xml
[INFO] ..SUCCESS (2.6 s)
[INFO] Building: require-active-profile-from-settings/pom.xml
[INFO] ..SUCCESS (2.6 s)
[INFO] Building: banned-plugins/pom.xml
[INFO] ..SUCCESS (2.6 s)
[INFO] Building: dependencies_not_converging/pom.xml
[INFO] ..SUCCESS (2.6 s)
[INFO] Building: require-plugin-versions/pom.xml
[INFO] ..SUCCESS (2.6 s)
[INFO] Building: banned-dependencies/pom.xml
[INFO] ..SUCCESS (2.7 s)
[INFO] Building: always-pass/pom.xml
[INFO] ..SUCCESS (2.7 s)
[INFO] Building: require-upper-bound-dependencies-managed_success/pom.xml
[INFO] ..SUCCESS (2.6 s)
[INFO] Building: resolve_collect_dependencies/pom.xml
[INFO] run script verify.groovy
[INFO] ..SUCCESS (4.5 s)
[INFO] Building: require-active-profile/pom.xml
[INFO] ..SUCCESS (2.6 s)
[INFO] Building: banned-dependencies-versionrange-fail/pom.xml
[INFO] run script verify.groovy
[INFO] ..SUCCESS (3.1 s)
[INFO] Building: require-release-version/pom.xml
[INFO] ..SUCCESS (2.6 s)
[INFO] Building: require-plugin-versions-projectGAVexpressions/pom.xml
[INFO] ..SUCCESS (2.6 s)
[INFO] Building: dependencies_not_converging_test_scope/pom.xml
[INFO] ..SUCCESS (2.6 s)
[INFO] Building: require-plugin-versions-expressions/pom.xml
[INFO] ..SUCCESS (2.7 s)
[INFO] Building: require-no-repositories_failure/pom.xml
[INFO] run script verify.groovy
[INFO] ..SUCCESS (2.6 s)
[INFO] Building: require-active-profile-all/pom.xml
[INFO] ..SUCCESS (2.6 s)
[INFO] Building: ban-transitive-dependencies-fail/pom.xml
[INFO] run script verify.groovy
[INFO] ..SUCCESS (2.7 s)
[INFO] Building: always-fail/pom.xml
[INFO] ..SUCCESS (2.6 s)
[INFO] Building: require-plugin-versions-plugin-with-integration-test-lifecycle/pom.xml
[INFO] ..SUCCESS (7.3 s)
[INFO] Building: require-no-repositories/pom.xml
[INFO] ..SUCCESS (2.9 s)
[INFO] Building: require-release-dependencies-excludes_failure/pom.xml
[INFO] snapshot org.apache.maven.plugins.enforcer.its:menforcer85_api:1.0-SNAPSHOT: checking
for updates from Nexus
[INFO] artifact org.apache.maven.plugins.enforcer.its.menforcer85_api:1.0-SNAPSHOT: checking
for updates from central
[INFO] ..SUCCESS (3.0 s)
[INFO] Building: require-upper-bound-dependencies-managed_failure/pom.xml
[INFO] run script verify.groovy
[INFO] ..SUCCESS (2.6 s)
[INFO] Building: ban-distribution-management-multi-module-build/pom.xml
[INFO] run script verify.groovy
[INFO] ..SUCCESS (2.6 s)
[INFO] Building: ban-pom-dependency-version/pom.xml
[INFO] run script verify.groovy
[INFO] ..SUCCESS (2.7 s)
[INFO] Building: require-release-dependencies-excludes/pom.xml
[INFO] ..SUCCESS (2.7 s)
[INFO] -------------------------------------------------
[INFO] Build Summary:
[INFO]   Passed: 50, Failed: 0, Errors: 0, Skipped: 0
[INFO] -------------------------------------------------
[INFO] 
[INFO] --- mrm-maven-plugin:1.0-beta-2:stop (default) @ maven-enforcer-plugin ---
[INFO] Stopping Mock Repository Manager on http://localhost:42673
[INFO] Mock Repository Manager http://localhost:42673 is stopped.
[INFO] 
[INFO] --- maven-checkstyle-plugin:2.13:check (checkstyle-check) @ maven-enforcer-plugin ---
[INFO] 
[INFO] There are 1 checkstyle errors.
[ERROR] EnforceMojo.java[55] (sizes) LineLength: Line is longer than 120 characters (found
137).
[INFO] ------------------------------------------------------------------------
[INFO] Reactor Summary:
[INFO] 
[INFO] Apache Maven Enforcer ............................. SUCCESS [6.833s]
[INFO] Apache Maven Enforcer API ......................... SUCCESS [3.028s]
[INFO] Apache Maven Enforcer Rules ....................... SUCCESS [16.707s]
[INFO] Apache Maven Enforcer Plugin ...................... FAILURE [2:41.511s]
[INFO] ------------------------------------------------------------------------
[INFO] BUILD FAILURE
[INFO] ------------------------------------------------------------------------
[INFO] Total time: 3:09.993s
[INFO] Finished at: Sat Nov 14 12:53:57 UTC 2015
[INFO] Final Memory: 34M/283M
[INFO] ------------------------------------------------------------------------
Waiting for Jenkins to finish collecting data
[ERROR] Failed to execute goal org.apache.maven.plugins:maven-checkstyle-plugin:2.13:check
(checkstyle-check) on project maven-enforcer-plugin: You have 1 Checkstyle violation. ->
[Help 1]
org.apache.maven.lifecycle.LifecycleExecutionException: Failed to execute goal org.apache.maven.plugins:maven-checkstyle-plugin:2.13:check
(checkstyle-check) on project maven-enforcer-plugin: You have 1 Checkstyle violation.
	at org.apache.maven.lifecycle.internal.MojoExecutor.execute(MojoExecutor.java:213)
	at org.apache.maven.lifecycle.internal.MojoExecutor.execute(MojoExecutor.java:153)
	at org.apache.maven.lifecycle.internal.MojoExecutor.execute(MojoExecutor.java:145)
	at org.apache.maven.lifecycle.internal.LifecycleModuleBuilder.buildProject(LifecycleModuleBuilder.java:84)
	at org.apache.maven.lifecycle.internal.LifecycleModuleBuilder.buildProject(LifecycleModuleBuilder.java:59)
	at org.apache.maven.lifecycle.internal.LifecycleStarter.singleThreadedBuild(LifecycleStarter.java:183)
	at org.apache.maven.lifecycle.internal.LifecycleStarter.execute(LifecycleStarter.java:161)
	at org.apache.maven.DefaultMaven.doExecute(DefaultMaven.java:320)
	at org.apache.maven.DefaultMaven.execute(DefaultMaven.java:156)
	at org.jvnet.hudson.maven3.launcher.Maven3Launcher.main(Maven3Launcher.java:117)
	at sun.reflect.NativeMethodAccessorImpl.invoke0(Native Method)
	at sun.reflect.NativeMethodAccessorImpl.invoke(NativeMethodAccessorImpl.java:39)
	at sun.reflect.DelegatingMethodAccessorImpl.invoke(DelegatingMethodAccessorImpl.java:25)
	at java.lang.reflect.Method.invoke(Method.java:597)
	at org.codehaus.plexus.classworlds.launcher.Launcher.launchStandard(Launcher.java:329)
	at org.codehaus.plexus.classworlds.launcher.Launcher.launch(Launcher.java:239)
	at org.jvnet.hudson.maven3.agent.Maven3Main.launch(Maven3Main.java:181)
	at sun.reflect.NativeMethodAccessorImpl.invoke0(Native Method)
	at sun.reflect.NativeMethodAccessorImpl.invoke(NativeMethodAccessorImpl.java:39)
	at sun.reflect.DelegatingMethodAccessorImpl.invoke(DelegatingMethodAccessorImpl.java:25)
	at java.lang.reflect.Method.invoke(Method.java:597)
	at hudson.maven.Maven3Builder.call(Maven3Builder.java:136)
	at hudson.maven.Maven3Builder.call(Maven3Builder.java:71)
	at hudson.remoting.UserRequest.perform(UserRequest.java:121)
	at hudson.remoting.UserRequest.perform(UserRequest.java:49)
	at hudson.remoting.Request$2.run(Request.java:326)
	at hudson.remoting.InterceptingExecutorService$1.call(InterceptingExecutorService.java:68)
	at java.util.concurrent.FutureTask$Sync.innerRun(FutureTask.java:303)
	at java.util.concurrent.FutureTask.run(FutureTask.java:138)
	at java.util.concurrent.ThreadPoolExecutor$Worker.runTask(ThreadPoolExecutor.java:895)
	at java.util.concurrent.ThreadPoolExecutor$Worker.run(ThreadPoolExecutor.java:918)
	at java.lang.Thread.run(Thread.java:662)
Caused by: org.apache.maven.plugin.MojoFailureException: You have 1 Checkstyle violation.
	at org.apache.maven.plugin.checkstyle.CheckstyleViolationCheckMojo.execute(CheckstyleViolationCheckMojo.java:582)
	at org.apache.maven.plugin.DefaultBuildPluginManager.executeMojo(DefaultBuildPluginManager.java:101)
	at org.apache.maven.lifecycle.internal.MojoExecutor.execute(MojoExecutor.java:209)
	... 31 more
[ERROR] 
[ERROR] Re-run Maven using the -X switch to enable full debug logging.
[ERROR] 
[ERROR] For more information about the errors and possible solutions, please read the following
articles:
[ERROR] [Help 1] http://cwiki.apache.org/confluence/display/MAVEN/MojoFailureException
[ERROR] 
[ERROR] After correcting the problems, you can resume the build with the command
[ERROR]   mvn <goals> -rf :maven-enforcer-plugin
[JENKINS] Archiving <https://builds.apache.org/job/maven-enforcer/ws/enforcer-rules/pom.xml>
to org.apache.maven.enforcer/enforcer-rules/1.4.2-SNAPSHOT/enforcer-rules-1.4.2-SNAPSHOT.pom
[JENKINS] Archiving <https://builds.apache.org/job/maven-enforcer/ws/enforcer-rules/target/enforcer-rules-1.4.2-SNAPSHOT.jar>
to org.apache.maven.enforcer/enforcer-rules/1.4.2-SNAPSHOT/enforcer-rules-1.4.2-SNAPSHOT.jar
[JENKINS] Archiving <https://builds.apache.org/job/maven-enforcer/ws/enforcer-rules/target/enforcer-rules-1.4.2-SNAPSHOT-tests.jar>
to org.apache.maven.enforcer/enforcer-rules/1.4.2-SNAPSHOT/enforcer-rules-1.4.2-SNAPSHOT-tests.jar
[JENKINS] Archiving <https://builds.apache.org/job/maven-enforcer/ws/enforcer-api/pom.xml>
to org.apache.maven.enforcer/enforcer-api/1.4.2-SNAPSHOT/enforcer-api-1.4.2-SNAPSHOT.pom
[JENKINS] Archiving <https://builds.apache.org/job/maven-enforcer/ws/enforcer-api/target/enforcer-api-1.4.2-SNAPSHOT.jar>
to org.apache.maven.enforcer/enforcer-api/1.4.2-SNAPSHOT/enforcer-api-1.4.2-SNAPSHOT.jar
[JENKINS] Archiving <https://builds.apache.org/job/maven-enforcer/ws/pom.xml> to org.apache.maven.enforcer/enforcer/1.4.2-SNAPSHOT/enforcer-1.4.2-SNAPSHOT.pom
[JENKINS] Archiving <https://builds.apache.org/job/maven-enforcer/ws/target/enforcer-1.4.2-SNAPSHOT-site.xml>
to org.apache.maven.enforcer/enforcer/1.4.2-SNAPSHOT/enforcer-1.4.2-SNAPSHOT-site.xml
[JENKINS] Archiving <https://builds.apache.org/job/maven-enforcer/ws/maven-enforcer-plugin/pom.xml>
to org.apache.maven.plugins/maven-enforcer-plugin/1.4.2-SNAPSHOT/maven-enforcer-plugin-1.4.2-SNAPSHOT.pom
[JENKINS] Archiving <https://builds.apache.org/job/maven-enforcer/ws/maven-enforcer-plugin/target/maven-enforcer-plugin-1.4.2-SNAPSHOT.jar>
to org.apache.maven.plugins/maven-enforcer-plugin/1.4.2-SNAPSHOT/maven-enforcer-plugin-1.4.2-SNAPSHOT.jar
Sending e-mails to: notifications@maven.apache.org khmarbaise@apache.org
channel stopped

Mime
View raw message