maven-notifications mailing list archives

Site index · List index
Message view « Date » · « Thread »
Top « Date » · « Thread »
From Apache Jenkins Server <jenk...@builds.apache.org>
Subject Build failed in Jenkins: maven-enforcer-m3.1.x » Apache Maven Enforcer Plugin #178
Date Sat, 14 Nov 2015 12:53:14 GMT
See <https://builds.apache.org/job/maven-enforcer-m3.1.x/org.apache.maven.plugins$maven-enforcer-plugin/178/changes>

Changes:

[khmarbaise] Refactoring code.

------------------------------------------
[...truncated 53 lines...]
[INFO] Applying mojo extractor for language: bsh
[INFO] Mojo extractor for language: bsh found 0 mojo descriptors.
[INFO] 
[INFO] --- maven-resources-plugin:2.6:testResources (default-testResources) @ maven-enforcer-plugin
---
[INFO] Using 'UTF-8' encoding to copy filtered resources.
[INFO] skip non existing resourceDirectory <https://builds.apache.org/job/maven-enforcer-m3.1.x/org.apache.maven.plugins$maven-enforcer-plugin/ws/src/test/resources>
[INFO] Copying 3 resources
[INFO] 
[INFO] --- maven-compiler-plugin:3.1:testCompile (default-testCompile) @ maven-enforcer-plugin
---
[INFO] Changes detected - recompiling the module!
[INFO] Compiling 3 source files to <https://builds.apache.org/job/maven-enforcer-m3.1.x/org.apache.maven.plugins$maven-enforcer-plugin/ws/target/test-classes>
[INFO] 
[INFO] --- maven-surefire-plugin:2.17:test (default-test) @ maven-enforcer-plugin ---
[INFO] Surefire report directory: <https://builds.apache.org/job/maven-enforcer-m3.1.x/org.apache.maven.plugins$maven-enforcer-plugin/ws/target/surefire-reports>

-------------------------------------------------------
 T E S T S
-------------------------------------------------------
Running org.apache.maven.plugins.enforcer.TestEnforceMojo
Caught Expected Exception:No rules are configured. Use the skip flag if you want to disable
execution.
[debug] Executing rule: org.apache.maven.plugins.enforcer.MockEnforcerRule
[debug] Adding failure due to exception

org.apache.maven.enforcer.rule.api.EnforcerRuleException:  this condition is not allowed.
	at org.apache.maven.plugins.enforcer.MockEnforcerRule.execute(MockEnforcerRule.java:62)
	at org.apache.maven.plugins.enforcer.EnforceMojo.execute(EnforceMojo.java:200)
	at org.apache.maven.plugins.enforcer.TestEnforceMojo.testEnforceMojo(TestEnforceMojo.java:68)
	at sun.reflect.NativeMethodAccessorImpl.invoke0(Native Method)
	at sun.reflect.NativeMethodAccessorImpl.invoke(NativeMethodAccessorImpl.java:39)
	at sun.reflect.DelegatingMethodAccessorImpl.invoke(DelegatingMethodAccessorImpl.java:25)
	at java.lang.reflect.Method.invoke(Method.java:597)
	at org.junit.runners.model.FrameworkMethod$1.runReflectiveCall(FrameworkMethod.java:47)
	at org.junit.internal.runners.model.ReflectiveCallable.run(ReflectiveCallable.java:12)
	at org.junit.runners.model.FrameworkMethod.invokeExplosively(FrameworkMethod.java:44)
	at org.junit.internal.runners.statements.InvokeMethod.evaluate(InvokeMethod.java:17)
	at org.junit.runners.ParentRunner.runLeaf(ParentRunner.java:271)
	at org.junit.runners.BlockJUnit4ClassRunner.runChild(BlockJUnit4ClassRunner.java:70)
	at org.junit.runners.BlockJUnit4ClassRunner.runChild(BlockJUnit4ClassRunner.java:50)
	at org.junit.runners.ParentRunner$3.run(ParentRunner.java:238)
	at org.junit.runners.ParentRunner$1.schedule(ParentRunner.java:63)
	at org.junit.runners.ParentRunner.runChildren(ParentRunner.java:236)
	at org.junit.runners.ParentRunner.access$000(ParentRunner.java:53)
	at org.junit.runners.ParentRunner$2.evaluate(ParentRunner.java:229)
	at org.junit.runners.ParentRunner.run(ParentRunner.java:309)
	at org.mockito.internal.runners.JUnit45AndHigherRunnerImpl.run(JUnit45AndHigherRunnerImpl.java:37)
	at org.mockito.runners.MockitoJUnitRunner.run(MockitoJUnitRunner.java:62)
	at org.apache.maven.surefire.junit4.JUnit4Provider.execute(JUnit4Provider.java:264)
	at org.apache.maven.surefire.junit4.JUnit4Provider.executeTestSet(JUnit4Provider.java:153)
	at org.apache.maven.surefire.junit4.JUnit4Provider.invoke(JUnit4Provider.java:124)
	at org.apache.maven.surefire.booter.ForkedBooter.invokeProviderInSameClassLoader(ForkedBooter.java:200)
	at org.apache.maven.surefire.booter.ForkedBooter.runSuitesInProcess(ForkedBooter.java:153)
	at org.apache.maven.surefire.booter.ForkedBooter.main(ForkedBooter.java:103)

[debug] Executing rule: org.apache.maven.plugins.enforcer.MockEnforcerRule
[debug] Adding failure due to exception

org.apache.maven.enforcer.rule.api.EnforcerRuleException:  this condition is not allowed.
	at org.apache.maven.plugins.enforcer.MockEnforcerRule.execute(MockEnforcerRule.java:62)
	at org.apache.maven.plugins.enforcer.EnforceMojo.execute(EnforceMojo.java:200)
	at org.apache.maven.plugins.enforcer.TestEnforceMojo.testEnforceMojo(TestEnforceMojo.java:68)
	at sun.reflect.NativeMethodAccessorImpl.invoke0(Native Method)
	at sun.reflect.NativeMethodAccessorImpl.invoke(NativeMethodAccessorImpl.java:39)
	at sun.reflect.DelegatingMethodAccessorImpl.invoke(DelegatingMethodAccessorImpl.java:25)
	at java.lang.reflect.Method.invoke(Method.java:597)
	at org.junit.runners.model.FrameworkMethod$1.runReflectiveCall(FrameworkMethod.java:47)
	at org.junit.internal.runners.model.ReflectiveCallable.run(ReflectiveCallable.java:12)
	at org.junit.runners.model.FrameworkMethod.invokeExplosively(FrameworkMethod.java:44)
	at org.junit.internal.runners.statements.InvokeMethod.evaluate(InvokeMethod.java:17)
	at org.junit.runners.ParentRunner.runLeaf(ParentRunner.java:271)
	at org.junit.runners.BlockJUnit4ClassRunner.runChild(BlockJUnit4ClassRunner.java:70)
	at org.junit.runners.BlockJUnit4ClassRunner.runChild(BlockJUnit4ClassRunner.java:50)
	at org.junit.runners.ParentRunner$3.run(ParentRunner.java:238)
	at org.junit.runners.ParentRunner$1.schedule(ParentRunner.java:63)
	at org.junit.runners.ParentRunner.runChildren(ParentRunner.java:236)
	at org.junit.runners.ParentRunner.access$000(ParentRunner.java:53)
	at org.junit.runners.ParentRunner$2.evaluate(ParentRunner.java:229)
	at org.junit.runners.ParentRunner.run(ParentRunner.java:309)
	at org.mockito.internal.runners.JUnit45AndHigherRunnerImpl.run(JUnit45AndHigherRunnerImpl.java:37)
	at org.mockito.runners.MockitoJUnitRunner.run(MockitoJUnitRunner.java:62)
	at org.apache.maven.surefire.junit4.JUnit4Provider.execute(JUnit4Provider.java:264)
	at org.apache.maven.surefire.junit4.JUnit4Provider.executeTestSet(JUnit4Provider.java:153)
	at org.apache.maven.surefire.junit4.JUnit4Provider.invoke(JUnit4Provider.java:124)
	at org.apache.maven.surefire.booter.ForkedBooter.invokeProviderInSameClassLoader(ForkedBooter.java:200)
	at org.apache.maven.surefire.booter.ForkedBooter.runSuitesInProcess(ForkedBooter.java:153)
	at org.apache.maven.surefire.booter.ForkedBooter.main(ForkedBooter.java:103)

[warn] Rule 0: org.apache.maven.plugins.enforcer.MockEnforcerRule failed with message:
 this condition is not allowed.
[warn] Rule 1: org.apache.maven.plugins.enforcer.MockEnforcerRule failed with message:
 this condition is not allowed.
[debug] Executing rule: org.apache.maven.plugins.enforcer.MockEnforcerRule
[debug] Adding failure due to exception

org.apache.maven.enforcer.rule.api.EnforcerRuleException:  this condition is not allowed.
	at org.apache.maven.plugins.enforcer.MockEnforcerRule.execute(MockEnforcerRule.java:62)
	at org.apache.maven.plugins.enforcer.EnforceMojo.execute(EnforceMojo.java:200)
	at org.apache.maven.plugins.enforcer.TestEnforceMojo.testEnforceMojo(TestEnforceMojo.java:74)
	at sun.reflect.NativeMethodAccessorImpl.invoke0(Native Method)
	at sun.reflect.NativeMethodAccessorImpl.invoke(NativeMethodAccessorImpl.java:39)
	at sun.reflect.DelegatingMethodAccessorImpl.invoke(DelegatingMethodAccessorImpl.java:25)
	at java.lang.reflect.Method.invoke(Method.java:597)
	at org.junit.runners.model.FrameworkMethod$1.runReflectiveCall(FrameworkMethod.java:47)
	at org.junit.internal.runners.model.ReflectiveCallable.run(ReflectiveCallable.java:12)
	at org.junit.runners.model.FrameworkMethod.invokeExplosively(FrameworkMethod.java:44)
	at org.junit.internal.runners.statements.InvokeMethod.evaluate(InvokeMethod.java:17)
	at org.junit.runners.ParentRunner.runLeaf(ParentRunner.java:271)
	at org.junit.runners.BlockJUnit4ClassRunner.runChild(BlockJUnit4ClassRunner.java:70)
	at org.junit.runners.BlockJUnit4ClassRunner.runChild(BlockJUnit4ClassRunner.java:50)
	at org.junit.runners.ParentRunner$3.run(ParentRunner.java:238)
	at org.junit.runners.ParentRunner$1.schedule(ParentRunner.java:63)
	at org.junit.runners.ParentRunner.runChildren(ParentRunner.java:236)
	at org.junit.runners.ParentRunner.access$000(ParentRunner.java:53)
	at org.junit.runners.ParentRunner$2.evaluate(ParentRunner.java:229)
	at org.junit.runners.ParentRunner.run(ParentRunner.java:309)
	at org.mockito.internal.runners.JUnit45AndHigherRunnerImpl.run(JUnit45AndHigherRunnerImpl.java:37)
	at org.mockito.runners.MockitoJUnitRunner.run(MockitoJUnitRunner.java:62)
	at org.apache.maven.surefire.junit4.JUnit4Provider.execute(JUnit4Provider.java:264)
	at org.apache.maven.surefire.junit4.JUnit4Provider.executeTestSet(JUnit4Provider.java:153)
	at org.apache.maven.surefire.junit4.JUnit4Provider.invoke(JUnit4Provider.java:124)
	at org.apache.maven.surefire.booter.ForkedBooter.invokeProviderInSameClassLoader(ForkedBooter.java:200)
	at org.apache.maven.surefire.booter.ForkedBooter.runSuitesInProcess(ForkedBooter.java:153)
	at org.apache.maven.surefire.booter.ForkedBooter.main(ForkedBooter.java:103)

[debug] Executing rule: org.apache.maven.plugins.enforcer.MockEnforcerRule
[debug] Adding failure due to exception

org.apache.maven.enforcer.rule.api.EnforcerRuleException:  this condition is not allowed.
	at org.apache.maven.plugins.enforcer.MockEnforcerRule.execute(MockEnforcerRule.java:62)
	at org.apache.maven.plugins.enforcer.EnforceMojo.execute(EnforceMojo.java:200)
	at org.apache.maven.plugins.enforcer.TestEnforceMojo.testEnforceMojo(TestEnforceMojo.java:74)
	at sun.reflect.NativeMethodAccessorImpl.invoke0(Native Method)
	at sun.reflect.NativeMethodAccessorImpl.invoke(NativeMethodAccessorImpl.java:39)
	at sun.reflect.DelegatingMethodAccessorImpl.invoke(DelegatingMethodAccessorImpl.java:25)
	at java.lang.reflect.Method.invoke(Method.java:597)
	at org.junit.runners.model.FrameworkMethod$1.runReflectiveCall(FrameworkMethod.java:47)
	at org.junit.internal.runners.model.ReflectiveCallable.run(ReflectiveCallable.java:12)
	at org.junit.runners.model.FrameworkMethod.invokeExplosively(FrameworkMethod.java:44)
	at org.junit.internal.runners.statements.InvokeMethod.evaluate(InvokeMethod.java:17)
	at org.junit.runners.ParentRunner.runLeaf(ParentRunner.java:271)
	at org.junit.runners.BlockJUnit4ClassRunner.runChild(BlockJUnit4ClassRunner.java:70)
	at org.junit.runners.BlockJUnit4ClassRunner.runChild(BlockJUnit4ClassRunner.java:50)
	at org.junit.runners.ParentRunner$3.run(ParentRunner.java:238)
	at org.junit.runners.ParentRunner$1.schedule(ParentRunner.java:63)
	at org.junit.runners.ParentRunner.runChildren(ParentRunner.java:236)
	at org.junit.runners.ParentRunner.access$000(ParentRunner.java:53)
	at org.junit.runners.ParentRunner$2.evaluate(ParentRunner.java:229)
	at org.junit.runners.ParentRunner.run(ParentRunner.java:309)
	at org.mockito.internal.runners.JUnit45AndHigherRunnerImpl.run(JUnit45AndHigherRunnerImpl.java:37)
	at org.mockito.runners.MockitoJUnitRunner.run(MockitoJUnitRunner.java:62)
	at org.apache.maven.surefire.junit4.JUnit4Provider.execute(JUnit4Provider.java:264)
	at org.apache.maven.surefire.junit4.JUnit4Provider.executeTestSet(JUnit4Provider.java:153)
	at org.apache.maven.surefire.junit4.JUnit4Provider.invoke(JUnit4Provider.java:124)
	at org.apache.maven.surefire.booter.ForkedBooter.invokeProviderInSameClassLoader(ForkedBooter.java:200)
	at org.apache.maven.surefire.booter.ForkedBooter.runSuitesInProcess(ForkedBooter.java:153)
	at org.apache.maven.surefire.booter.ForkedBooter.main(ForkedBooter.java:103)

[warn] Rule 0: org.apache.maven.plugins.enforcer.MockEnforcerRule failed with message:
 this condition is not allowed.
[warn] Rule 1: org.apache.maven.plugins.enforcer.MockEnforcerRule failed with message:
 this condition is not allowed.
Caught Expected Exception:Some Enforcer rules have failed. Look above for specific messages
explaining why the rule failed.
[debug] Executing rule: org.apache.maven.plugins.enforcer.MockEnforcerRule
Caught Expected Exception:org.apache.maven.plugins.enforcer.MockEnforcerRule failed with message:
 this condition is not allowed.
[debug] Executing rule: org.apache.maven.plugins.enforcer.MockEnforcerRule
[debug] Executing rule: org.apache.maven.plugins.enforcer.MockEnforcerRule
[debug] Executing rule: org.apache.maven.plugins.enforcer.MockEnforcerRule
[debug] Rule org.apache.maven.plugins.enforcer.MockEnforcerRule is cacheable.
[debug] Executing rule: org.apache.maven.plugins.enforcer.MockEnforcerRule
[debug] Rule org.apache.maven.plugins.enforcer.MockEnforcerRule is cacheable.
[debug] Key org.apache.maven.plugins.enforcer.MockEnforcerRule  was found in the cache
[debug] The cached results are still valid. Skipping the rule: org.apache.maven.plugins.enforcer.MockEnforcerRule
[debug] Executing rule: org.apache.maven.plugins.enforcer.MockEnforcerRule
[debug] Executing rule: org.apache.maven.plugins.enforcer.MockEnforcerRule
[debug] Executing rule: org.apache.maven.plugins.enforcer.MockEnforcerRule
[debug] Rule org.apache.maven.plugins.enforcer.MockEnforcerRule is cacheable.
[debug] Executing rule: org.apache.maven.plugins.enforcer.MockEnforcerRule
[debug] Rule org.apache.maven.plugins.enforcer.MockEnforcerRule is cacheable.
[debug] Executing rule: org.apache.maven.plugins.enforcer.MockEnforcerRule
[debug] Rule org.apache.maven.plugins.enforcer.MockEnforcerRule is cacheable.
[debug] Key org.apache.maven.plugins.enforcer.MockEnforcerRule 2 was found in the cache
[debug] The cached results are still valid. Skipping the rule: org.apache.maven.plugins.enforcer.MockEnforcerRule
[debug] Executing rule: org.apache.maven.plugins.enforcer.MockEnforcerRule
[debug] Rule org.apache.maven.plugins.enforcer.MockEnforcerRule is cacheable.
[debug] Executing rule: org.apache.maven.plugins.enforcer.MockEnforcerRule
[debug] Executing rule: org.apache.maven.plugins.enforcer.MockEnforcerRule
[debug] Rule org.apache.maven.plugins.enforcer.MockEnforcerRule is cacheable.
[debug] Executing rule: org.apache.maven.plugins.enforcer.MockEnforcerRule
[debug] Rule org.apache.maven.plugins.enforcer.MockEnforcerRule is cacheable.
[debug] Key org.apache.maven.plugins.enforcer.MockEnforcerRule 1 was found in the cache
[debug] Executing rule: org.apache.maven.plugins.enforcer.MockEnforcerRule
[debug] Rule org.apache.maven.plugins.enforcer.MockEnforcerRule is cacheable.
[debug] Executing rule: org.apache.maven.plugins.enforcer.MockEnforcerRule
[debug] Rule org.apache.maven.plugins.enforcer.MockEnforcerRule is cacheable.
[debug] Key org.apache.maven.plugins.enforcer.MockEnforcerRule  was found in the cache
[debug] The cached results are still valid. Skipping the rule: org.apache.maven.plugins.enforcer.MockEnforcerRule
[debug] Executing rule: org.apache.maven.plugins.enforcer.MockEnforcerRule
[debug] Rule org.apache.maven.plugins.enforcer.MockEnforcerRule is cacheable.
[debug] Key org.apache.maven.plugins.enforcer.MockEnforcerRule  was found in the cache
[debug] The cached results are still valid. Skipping the rule: org.apache.maven.plugins.enforcer.MockEnforcerRule
[debug] Executing rule: org.apache.maven.plugins.enforcer.MockEnforcerRule
[debug] Rule org.apache.maven.plugins.enforcer.MockEnforcerRule is cacheable.
[debug] Key org.apache.maven.plugins.enforcer.MockEnforcerRule  was found in the cache
[debug] The cached results are still valid. Skipping the rule: org.apache.maven.plugins.enforcer.MockEnforcerRule
[debug] Executing rule: org.apache.maven.plugins.enforcer.MockEnforcerRule
[debug] Rule org.apache.maven.plugins.enforcer.MockEnforcerRule is cacheable.
[debug] Key org.apache.maven.plugins.enforcer.MockEnforcerRule  was found in the cache
[debug] The cached results are still valid. Skipping the rule: org.apache.maven.plugins.enforcer.MockEnforcerRule
[debug] Executing rule: org.apache.maven.plugins.enforcer.MockEnforcerRule
[debug] Rule org.apache.maven.plugins.enforcer.MockEnforcerRule is cacheable.
[debug] Key org.apache.maven.plugins.enforcer.MockEnforcerRule  was found in the cache
[debug] The cached results are still valid. Skipping the rule: org.apache.maven.plugins.enforcer.MockEnforcerRule
Tests run: 5, Failures: 0, Errors: 0, Skipped: 0, Time elapsed: 1.148 sec - in org.apache.maven.plugins.enforcer.TestEnforceMojo
Running org.apache.maven.plugins.enforcer.TestDefaultEnforcementRuleHelper
Tests run: 1, Failures: 0, Errors: 0, Skipped: 0, Time elapsed: 0.021 sec - in org.apache.maven.plugins.enforcer.TestDefaultEnforcementRuleHelper

Results :

Tests run: 6, Failures: 0, Errors: 0, Skipped: 0

[JENKINS] Recording test results
[INFO] 
[INFO] --- maven-jar-plugin:2.5:jar (default-jar) @ maven-enforcer-plugin ---
[INFO] Building jar: <https://builds.apache.org/job/maven-enforcer-m3.1.x/org.apache.maven.plugins$maven-enforcer-plugin/ws/target/maven-enforcer-plugin-1.4.2-SNAPSHOT.jar>
[INFO] 
[INFO] --- maven-plugin-plugin:3.3:addPluginArtifactMetadata (default-addPluginArtifactMetadata)
@ maven-enforcer-plugin ---
[INFO] 
[INFO] --- maven-site-plugin:3.4:attach-descriptor (attach-descriptor) @ maven-enforcer-plugin
---
[INFO] 
[INFO] --- maven-invoker-plugin:2.0.0:install (integration-test) @ maven-enforcer-plugin ---
[INFO] Installing /home/jenkins/jenkins-slave/workspace/maven-enforcer-m3.1.x/pom.xml to <https://builds.apache.org/job/maven-enforcer-m3.1.x/org.apache.maven.plugins$maven-enforcer-plugin/ws/target/local-repo/org/apache/maven/enforcer/enforcer/1.4.2-SNAPSHOT/enforcer-1.4.2-SNAPSHOT.pom>
[INFO] Installing /home/jenkins/jenkins-slave/workspace/maven-enforcer-m3.1.x/target/enforcer-1.4.2-SNAPSHOT-site.xml
to <https://builds.apache.org/job/maven-enforcer-m3.1.x/org.apache.maven.plugins$maven-enforcer-plugin/ws/target/local-repo/org/apache/maven/enforcer/enforcer/1.4.2-SNAPSHOT/enforcer-1.4.2-SNAPSHOT-site.xml>
[INFO] Installing /home/jenkins/jenkins-slave/workspace/maven-enforcer-m3.1.x/enforcer-api/pom.xml
to <https://builds.apache.org/job/maven-enforcer-m3.1.x/org.apache.maven.plugins$maven-enforcer-plugin/ws/target/local-repo/org/apache/maven/enforcer/enforcer-api/1.4.2-SNAPSHOT/enforcer-api-1.4.2-SNAPSHOT.pom>
[INFO] Installing /home/jenkins/jenkins-slave/workspace/maven-enforcer-m3.1.x/enforcer-api/target/enforcer-api-1.4.2-SNAPSHOT.jar
to <https://builds.apache.org/job/maven-enforcer-m3.1.x/org.apache.maven.plugins$maven-enforcer-plugin/ws/target/local-repo/org/apache/maven/enforcer/enforcer-api/1.4.2-SNAPSHOT/enforcer-api-1.4.2-SNAPSHOT.jar>
[INFO] Installing /home/jenkins/jenkins-slave/workspace/maven-enforcer-m3.1.x/enforcer-api/pom.xml
to <https://builds.apache.org/job/maven-enforcer-m3.1.x/org.apache.maven.plugins$maven-enforcer-plugin/ws/target/local-repo/org/apache/maven/enforcer/enforcer-api/1.4.2-SNAPSHOT/enforcer-api-1.4.2-SNAPSHOT.pom>
[INFO] Installing /home/jenkins/jenkins-slave/workspace/maven-enforcer-m3.1.x/enforcer-rules/pom.xml
to <https://builds.apache.org/job/maven-enforcer-m3.1.x/org.apache.maven.plugins$maven-enforcer-plugin/ws/target/local-repo/org/apache/maven/enforcer/enforcer-rules/1.4.2-SNAPSHOT/enforcer-rules-1.4.2-SNAPSHOT.pom>
[INFO] Installing /home/jenkins/jenkins-slave/workspace/maven-enforcer-m3.1.x/enforcer-rules/target/enforcer-rules-1.4.2-SNAPSHOT.jar
to <https://builds.apache.org/job/maven-enforcer-m3.1.x/org.apache.maven.plugins$maven-enforcer-plugin/ws/target/local-repo/org/apache/maven/enforcer/enforcer-rules/1.4.2-SNAPSHOT/enforcer-rules-1.4.2-SNAPSHOT.jar>
[INFO] Installing /home/jenkins/jenkins-slave/workspace/maven-enforcer-m3.1.x/enforcer-rules/pom.xml
to <https://builds.apache.org/job/maven-enforcer-m3.1.x/org.apache.maven.plugins$maven-enforcer-plugin/ws/target/local-repo/org/apache/maven/enforcer/enforcer-rules/1.4.2-SNAPSHOT/enforcer-rules-1.4.2-SNAPSHOT.pom>
[INFO] Installing /home/jenkins/jenkins-slave/workspace/maven-enforcer-m3.1.x/enforcer-rules/target/enforcer-rules-1.4.2-SNAPSHOT-tests.jar
to <https://builds.apache.org/job/maven-enforcer-m3.1.x/org.apache.maven.plugins$maven-enforcer-plugin/ws/target/local-repo/org/apache/maven/enforcer/enforcer-rules/1.4.2-SNAPSHOT/enforcer-rules-1.4.2-SNAPSHOT-tests.jar>
[INFO] Installing <https://builds.apache.org/job/maven-enforcer-m3.1.x/org.apache.maven.plugins$maven-enforcer-plugin/ws/pom.xml>
to <https://builds.apache.org/job/maven-enforcer-m3.1.x/org.apache.maven.plugins$maven-enforcer-plugin/ws/target/local-repo/org/apache/maven/plugins/maven-enforcer-plugin/1.4.2-SNAPSHOT/maven-enforcer-plugin-1.4.2-SNAPSHOT.pom>
[INFO] Installing <https://builds.apache.org/job/maven-enforcer-m3.1.x/org.apache.maven.plugins$maven-enforcer-plugin/ws/target/maven-enforcer-plugin-1.4.2-SNAPSHOT.jar>
to <https://builds.apache.org/job/maven-enforcer-m3.1.x/org.apache.maven.plugins$maven-enforcer-plugin/ws/target/local-repo/org/apache/maven/plugins/maven-enforcer-plugin/1.4.2-SNAPSHOT/maven-enforcer-plugin-1.4.2-SNAPSHOT.jar>
[INFO] 
[INFO] --- mrm-maven-plugin:1.0-beta-2:start (default) @ maven-enforcer-plugin ---
[WARNING] The POM for org.mortbay.jetty:jetty-util:jar:6.1.5 is invalid, transitive dependencies
(if any) will not be available, enable debug logging for more details
[WARNING] The POM for org.mortbay.jetty:servlet-api-2.5:jar:6.1.5 is invalid, transitive dependencies
(if any) will not be available, enable debug logging for more details
[INFO] Configuring Mock Repository Manager...
[INFO]   Mock content (source: <https://builds.apache.org/job/maven-enforcer-m3.1.x/org.apache.maven.plugins$maven-enforcer-plugin/ws/src/it/mrm/repository)>
[INFO]   Proxy (source: this Maven session)
[INFO] Starting Mock Repository Manager

Mime
View raw message