maven-notifications mailing list archives

Site index · List index
Message view « Date » · « Thread »
Top « Date » · « Thread »
From Apache Jenkins Server <jenk...@builds.apache.org>
Subject Build failed in Jenkins: dist-tool-plugin #1063
Date Mon, 23 Nov 2015 10:30:44 GMT
See <https://builds.apache.org/job/dist-tool-plugin/1063/>

------------------------------------------
[...truncated 4899 lines...]
Downloading: http://repo.maven.apache.org/maven2/org/sonatype/plexus/plexus-build-api/0.0.7/plexus-build-api-0.0.7.jar
Downloaded: http://repo.maven.apache.org/maven2/jgoodies/plastic/1.2.0/plastic-1.2.0.jar (228
KB at 16220.4 KB/sec)
Downloaded: http://repo.maven.apache.org/maven2/org/sonatype/plexus/plexus-build-api/0.0.7/plexus-build-api-0.0.7.jar
(9 KB at 1380.5 KB/sec)
Downloaded: http://repo.maven.apache.org/maven2/org/codehaus/plexus/plexus-utils/1.5.6/plexus-utils-1.5.6.jar
(245 KB at 13593.0 KB/sec)
Downloaded: http://repo.maven.apache.org/maven2/com/google/code/findbugs/findbugs/2.0.3/findbugs-2.0.3.jar
(3413 KB at 39682.5 KB/sec)
Downloaded: http://repo.maven.apache.org/maven2/org/codehaus/groovy/groovy-all/1.7.4/groovy-all-1.7.4.jar
(5245 KB at 37733.8 KB/sec)
[INFO] configuring report plugin org.codehaus.sonar-plugins:maven-report:0.1
Downloading: http://repo.maven.apache.org/maven2/org/codehaus/sonar-plugins/maven-report/0.1/maven-report-0.1.pom
Downloaded: http://repo.maven.apache.org/maven2/org/codehaus/sonar-plugins/maven-report/0.1/maven-report-0.1.pom
(3 KB at 287.2 KB/sec)
Downloading: http://repo.maven.apache.org/maven2/org/codehaus/sonar-plugins/parent/1/parent-1.pom
Downloaded: http://repo.maven.apache.org/maven2/org/codehaus/sonar-plugins/parent/1/parent-1.pom
(5 KB at 534.9 KB/sec)
Downloading: http://repo.maven.apache.org/maven2/org/codehaus/sonar-plugins/maven-report/0.1/maven-report-0.1.jar
Downloaded: http://repo.maven.apache.org/maven2/org/codehaus/sonar-plugins/maven-report/0.1/maven-report-0.1.jar
(6 KB at 628.8 KB/sec)
Downloading: http://repo.maven.apache.org/maven2/org/apache/maven/maven-plugin-api/2.0.4/maven-plugin-api-2.0.4.pom
Downloaded: http://repo.maven.apache.org/maven2/org/apache/maven/maven-plugin-api/2.0.4/maven-plugin-api-2.0.4.pom
(643 B at 69.8 KB/sec)
Downloading: http://repo.maven.apache.org/maven2/org/apache/maven/reporting/maven-reporting-impl/2.0.4.1/maven-reporting-impl-2.0.4.1.jar
Downloading: http://repo.maven.apache.org/maven2/org/codehaus/plexus/plexus-utils/1.4.5/plexus-utils-1.4.5.jar
Downloaded: http://repo.maven.apache.org/maven2/org/apache/maven/reporting/maven-reporting-impl/2.0.4.1/maven-reporting-impl-2.0.4.1.jar
(19 KB at 2020.1 KB/sec)
Downloaded: http://repo.maven.apache.org/maven2/org/codehaus/plexus/plexus-utils/1.4.5/plexus-utils-1.4.5.jar
(201 KB at 10538.8 KB/sec)
[INFO] configuring report plugin org.apache.maven.dist.tools:dist-tool-plugin:1.0-SNAPSHOT
[INFO] configuring report plugin org.apache.maven.plugins:maven-plugin-plugin:3.2
Downloading: http://repo.maven.apache.org/maven2/org/apache/maven/plugins/maven-plugin-plugin/3.2/maven-plugin-plugin-3.2.pom
Downloaded: http://repo.maven.apache.org/maven2/org/apache/maven/plugins/maven-plugin-plugin/3.2/maven-plugin-plugin-3.2.pom
(12 KB at 1323.9 KB/sec)
Downloading: http://repo.maven.apache.org/maven2/org/apache/maven/plugins/maven-plugin-plugin/3.2/maven-plugin-plugin-3.2.jar
Downloaded: http://repo.maven.apache.org/maven2/org/apache/maven/plugins/maven-plugin-plugin/3.2/maven-plugin-plugin-3.2.jar
(47 KB at 4671.0 KB/sec)
Downloading: http://repo.maven.apache.org/maven2/org/apache/maven/plugin-tools/maven-plugin-tools-annotations/3.2/maven-plugin-tools-annotations-3.2.pom
Downloaded: http://repo.maven.apache.org/maven2/org/apache/maven/plugin-tools/maven-plugin-tools-annotations/3.2/maven-plugin-tools-annotations-3.2.pom
(5 KB at 465.4 KB/sec)
Downloading: http://repo.maven.apache.org/maven2/org/apache/maven/plugin-tools/maven-plugin-tools-api/3.2/maven-plugin-tools-api-3.2.pom
Downloaded: http://repo.maven.apache.org/maven2/org/apache/maven/plugin-tools/maven-plugin-tools-api/3.2/maven-plugin-tools-api-3.2.pom
(3 KB at 329.3 KB/sec)
Downloading: http://repo.maven.apache.org/maven2/asm/asm-commons/3.3.1/asm-commons-3.3.1.pom
Downloaded: http://repo.maven.apache.org/maven2/asm/asm-commons/3.3.1/asm-commons-3.3.1.pom
(417 B at 58.2 KB/sec)
Downloading: http://repo.maven.apache.org/maven2/asm/asm-tree/3.3.1/asm-tree-3.3.1.pom
Downloaded: http://repo.maven.apache.org/maven2/asm/asm-tree/3.3.1/asm-tree-3.3.1.pom (406
B at 49.6 KB/sec)
Downloading: http://repo.maven.apache.org/maven2/org/apache/maven/plugin-tools/maven-plugin-tools-generators/3.2/maven-plugin-tools-generators-3.2.pom
Downloaded: http://repo.maven.apache.org/maven2/org/apache/maven/plugin-tools/maven-plugin-tools-generators/3.2/maven-plugin-tools-generators-3.2.pom
(5 KB at 467.2 KB/sec)
Downloading: http://repo.maven.apache.org/maven2/org/apache/maven/plugin-tools/maven-plugin-tools-java/3.2/maven-plugin-tools-java-3.2.pom
Downloaded: http://repo.maven.apache.org/maven2/org/apache/maven/plugin-tools/maven-plugin-tools-java/3.2/maven-plugin-tools-java-3.2.pom
(4 KB at 443.8 KB/sec)
Downloading: http://repo.maven.apache.org/maven2/org/apache/maven/plugin-tools/maven-plugin-tools-beanshell/3.2/maven-plugin-tools-beanshell-3.2.pom
Downloaded: http://repo.maven.apache.org/maven2/org/apache/maven/plugin-tools/maven-plugin-tools-beanshell/3.2/maven-plugin-tools-beanshell-3.2.pom
(3 KB at 263.6 KB/sec)
Downloading: http://repo.maven.apache.org/maven2/bsh/bsh/1.3.0/bsh-1.3.0.pom
Downloaded: http://repo.maven.apache.org/maven2/bsh/bsh/1.3.0/bsh-1.3.0.pom (210 B at 25.6
KB/sec)
Downloading: http://repo.maven.apache.org/maven2/org/apache/maven/plugin-tools/maven-plugin-tools-model/3.2/maven-plugin-tools-model-3.2.pom
Downloaded: http://repo.maven.apache.org/maven2/org/apache/maven/plugin-tools/maven-plugin-tools-model/3.2/maven-plugin-tools-model-3.2.pom
(4 KB at 335.3 KB/sec)
Downloading: http://repo.maven.apache.org/maven2/org/apache/maven/plugin-tools/maven-plugin-tools-annotations/3.2/maven-plugin-tools-annotations-3.2.jar
Downloading: http://repo.maven.apache.org/maven2/asm/asm-commons/3.3.1/asm-commons-3.3.1.jar
Downloading: http://repo.maven.apache.org/maven2/org/apache/maven/plugin-tools/maven-plugin-tools-api/3.2/maven-plugin-tools-api-3.2.jar
Downloading: http://repo.maven.apache.org/maven2/asm/asm-tree/3.3.1/asm-tree-3.3.1.jar
Downloaded: http://repo.maven.apache.org/maven2/org/apache/maven/plugin-tools/maven-plugin-tools-annotations/3.2/maven-plugin-tools-annotations-3.2.jar
(39 KB at 3888.2 KB/sec)
Downloading: http://repo.maven.apache.org/maven2/org/apache/maven/plugin-tools/maven-plugin-tools-java/3.2/maven-plugin-tools-java-3.2.jar
Downloading: http://repo.maven.apache.org/maven2/org/apache/maven/plugin-tools/maven-plugin-tools-generators/3.2/maven-plugin-tools-generators-3.2.jar
Downloaded: http://repo.maven.apache.org/maven2/org/apache/maven/plugin-tools/maven-plugin-tools-java/3.2/maven-plugin-tools-java-3.2.jar
(18 KB at 2482.3 KB/sec)
Downloading: http://repo.maven.apache.org/maven2/org/apache/maven/plugin-tools/maven-plugin-tools-beanshell/3.2/maven-plugin-tools-beanshell-3.2.jar
Downloaded: http://repo.maven.apache.org/maven2/asm/asm-commons/3.3.1/asm-commons-3.3.1.jar
(38 KB at 2078.7 KB/sec)
Downloading: http://repo.maven.apache.org/maven2/bsh/bsh/1.3.0/bsh-1.3.0.jar
Downloaded: http://repo.maven.apache.org/maven2/org/apache/maven/plugin-tools/maven-plugin-tools-api/3.2/maven-plugin-tools-api-3.2.jar
(23 KB at 1260.7 KB/sec)
Downloading: http://repo.maven.apache.org/maven2/org/apache/maven/plugin-tools/maven-plugin-tools-model/3.2/maven-plugin-tools-model-3.2.jar
Downloaded: http://repo.maven.apache.org/maven2/asm/asm-tree/3.3.1/asm-tree-3.3.1.jar (22
KB at 1166.8 KB/sec)
Downloaded: http://repo.maven.apache.org/maven2/org/apache/maven/plugin-tools/maven-plugin-tools-beanshell/3.2/maven-plugin-tools-beanshell-3.2.jar
(13 KB at 1607.3 KB/sec)
Downloaded: http://repo.maven.apache.org/maven2/org/apache/maven/plugin-tools/maven-plugin-tools-generators/3.2/maven-plugin-tools-generators-3.2.jar
(46 KB at 2648.4 KB/sec)
Downloaded: http://repo.maven.apache.org/maven2/org/apache/maven/plugin-tools/maven-plugin-tools-model/3.2/maven-plugin-tools-model-3.2.jar
(32 KB at 2594.7 KB/sec)
Downloaded: http://repo.maven.apache.org/maven2/bsh/bsh/1.3.0/bsh-1.3.0.jar (237 KB at 15765.2
KB/sec)
[INFO] preparing 'report' report requires 'process-classes' forked phase execution
[INFO] 
[INFO] --- maven-enforcer-plugin:1.3.1:enforce (enforce-bytecode-version) @ dist-tool-plugin
---
[INFO] 
[INFO] --- maven-enforcer-plugin:1.3.1:enforce (ban-known-bad-maven-versions) @ dist-tool-plugin
---
[INFO] 
[INFO] --- apache-rat-plugin:0.11:check (rat-check) @ dist-tool-plugin ---
[INFO] 51 implicit excludes (use -debug for more details).
[INFO] Exclude: .repository/**
[INFO] 32 resources included (use -debug for more details)
Warning:  org.apache.xerces.jaxp.SAXParserImpl$JAXPSAXParser: Property 'http://www.oracle.com/xml/jaxp/properties/entityExpansionLimit'
is not recognized.
Compiler warnings:
  WARNING:  'org.apache.xerces.jaxp.SAXParserImpl: Property 'http://javax.xml.XMLConstants/property/accessExternalDTD'
is not recognized.'
Warning:  org.apache.xerces.parsers.SAXParser: Feature 'http://javax.xml.XMLConstants/feature/secure-processing'
is not recognized.
Warning:  org.apache.xerces.parsers.SAXParser: Property 'http://javax.xml.XMLConstants/property/accessExternalDTD'
is not recognized.
Warning:  org.apache.xerces.parsers.SAXParser: Property 'http://www.oracle.com/xml/jaxp/properties/entityExpansionLimit'
is not recognized.
[INFO] Rat check: Summary of files. Unapproved: 0 unknown: 0 generated: 0 approved: 31 licence.
[INFO] 
[INFO] --- maven-plugin-plugin:3.3:helpmojo (generated-helpmojo) @ dist-tool-plugin ---
[INFO] Using 'UTF-8' encoding to read mojo metadata.
[INFO] Applying mojo extractor for language: java-annotations
[INFO] Mojo extractor for language: java-annotations found 6 mojo descriptors.
[INFO] Applying mojo extractor for language: java
[INFO] Mojo extractor for language: java found 0 mojo descriptors.
[INFO] Applying mojo extractor for language: bsh
[INFO] Mojo extractor for language: bsh found 0 mojo descriptors.
[INFO] 
[INFO] --- maven-remote-resources-plugin:1.5:process (default) @ dist-tool-plugin ---
[INFO] 
[INFO] --- maven-resources-plugin:2.6:resources (default-resources) @ dist-tool-plugin ---
[INFO] Using 'UTF-8' encoding to copy filtered resources.
[INFO] Copying 1 resource
[INFO] Copying 3 resources
[INFO] Copying 3 resources
[INFO] 
[INFO] --- maven-compiler-plugin:3.1:compile (default-compile) @ dist-tool-plugin ---
[INFO] Changes detected - recompiling the module!
[INFO] Compiling 16 source files to <https://builds.apache.org/job/dist-tool-plugin/ws/target/classes>
[WARNING] <https://builds.apache.org/job/dist-tool-plugin/ws/src/main/java/org/apache/maven/dist/tools/DistCheckSiteMojo.java>:
<https://builds.apache.org/job/dist-tool-plugin/ws/src/main/java/org/apache/maven/dist/tools/DistCheckSiteMojo.java>
uses or overrides a deprecated API.
[WARNING] <https://builds.apache.org/job/dist-tool-plugin/ws/src/main/java/org/apache/maven/dist/tools/DistCheckSiteMojo.java>:
Recompile with -Xlint:deprecation for details.
[WARNING] <https://builds.apache.org/job/dist-tool-plugin/ws/src/main/java/org/apache/maven/dist/tools/ListPluginsPrerequisitesMojo.java>:
<https://builds.apache.org/job/dist-tool-plugin/ws/src/main/java/org/apache/maven/dist/tools/ListPluginsPrerequisitesMojo.java>
uses unchecked or unsafe operations.
[WARNING] <https://builds.apache.org/job/dist-tool-plugin/ws/src/main/java/org/apache/maven/dist/tools/ListPluginsPrerequisitesMojo.java>:
Recompile with -Xlint:unchecked for details.
[INFO] 
[INFO] --- maven-plugin-plugin:3.3:descriptor (default-descriptor) @ dist-tool-plugin ---
[INFO] Using 'UTF-8' encoding to read mojo metadata.
[INFO] Applying mojo extractor for language: java-annotations
[INFO] Mojo extractor for language: java-annotations found 6 mojo descriptors.
[INFO] Applying mojo extractor for language: java
[INFO] Mojo extractor for language: java found 0 mojo descriptors.
[INFO] Applying mojo extractor for language: bsh
[INFO] Mojo extractor for language: bsh found 0 mojo descriptors.
[INFO] Parent project loaded from repository: org.apache.maven:maven-parent:pom:25
[INFO] Parent project loaded from repository: org.apache:apache:pom:15
Downloading: http://repo.maven.apache.org/maven2/org/apache/maven/maven-parent/25/maven-parent-25-site_en.xml
Downloading: http://repo.maven.apache.org/maven2/org/apache/maven/maven-parent/25/maven-parent-25-site.xml
Downloaded: http://repo.maven.apache.org/maven2/org/apache/maven/maven-parent/25/maven-parent-25-site.xml
(4 KB at 427.4 KB/sec)
Downloading: http://repo.maven.apache.org/maven2/org/apache/apache/15/apache-15-site_en.xml
Downloading: http://repo.maven.apache.org/maven2/org/apache/apache/15/apache-15-site.xml
[INFO] Relativizing decoration links with respect to project URL: https://builds.apache.org/view/M-R/view/Maven/job/dist-tool-plugin/site/
[INFO] Rendering site with org.apache.maven.skins:maven-fluido-skin:jar:1.3.0 skin.
[INFO] Skipped "About" report (maven-project-info-reports-plugin:2.7:index), file "index.html"
already exists for the English version.
[INFO] Skipped "Surefire Report" report (maven-surefire-report-plugin:2.16:report), file "surefire-report.html"
already exists for the English version.
[INFO] Rendering 3 Doxia documents: 1 apt, 2 markdown
[INFO] Generating "Project Summary" report      --- maven-project-info-reports-plugin:2.7:summary
[INFO] Generating "Dependency Information" report --- maven-project-info-reports-plugin:2.7:dependency-info
[INFO] Generating "Project Team" report         --- maven-project-info-reports-plugin:2.7:project-team
[INFO] Generating "Source Repository" report    --- maven-project-info-reports-plugin:2.7:scm
[INFO] Generating "Issue Tracking" report       --- maven-project-info-reports-plugin:2.7:issue-tracking
[INFO] Generating "Mailing Lists" report        --- maven-project-info-reports-plugin:2.7:mailing-list
[INFO] Generating "Dependency Management" report --- maven-project-info-reports-plugin:2.7:dependency-management
[INFO] Generating "Dependencies" report         --- maven-project-info-reports-plugin:2.7:dependencies
[INFO] Generating "Continuous Integration" report --- maven-project-info-reports-plugin:2.7:cim
[INFO] Generating "Plugin Management" report    --- maven-project-info-reports-plugin:2.7:plugin-management
Downloading: http://repo.maven.apache.org/maven2/org/apache/maven/doxia/doxia-maven-plugin/1.4/doxia-maven-plugin-1.4.pom
Downloading: http://repo.maven.apache.org/maven2/org/apache/maven/plugins/maven-antrun-plugin/1.7/maven-antrun-plugin-1.7.pom
Downloaded: http://repo.maven.apache.org/maven2/org/apache/maven/plugins/maven-antrun-plugin/1.7/maven-antrun-plugin-1.7.pom
(5 KB at 154.9 KB/sec)
Downloading: http://repo.maven.apache.org/maven2/org/apache/maven/plugins/maven-assembly-plugin/2.4.1/maven-assembly-plugin-2.4.1.pom
Downloaded: http://repo.maven.apache.org/maven2/org/apache/maven/plugins/maven-assembly-plugin/2.4.1/maven-assembly-plugin-2.4.1.pom
(17 KB at 629.5 KB/sec)
Downloading: http://repo.maven.apache.org/maven2/org/apache/maven/plugins/maven-deploy-plugin/2.8.2/maven-deploy-plugin-2.8.2.pom
Downloaded: http://repo.maven.apache.org/maven2/org/apache/maven/plugins/maven-deploy-plugin/2.8.2/maven-deploy-plugin-2.8.2.pom
(7 KB at 410.1 KB/sec)
Downloading: http://repo.maven.apache.org/maven2/org/apache/maven/plugins/maven-docck-plugin/1.0/maven-docck-plugin-1.0.pom
Downloaded: http://repo.maven.apache.org/maven2/org/apache/maven/plugins/maven-docck-plugin/1.0/maven-docck-plugin-1.0.pom
(6 KB at 301.0 KB/sec)
Downloading: http://repo.maven.apache.org/maven2/org/apache/maven/plugins/maven-plugins/12/maven-plugins-12.pom
Downloaded: http://repo.maven.apache.org/maven2/org/apache/maven/plugins/maven-plugins/12/maven-plugins-12.pom
(12 KB at 717.0 KB/sec)
Downloading: http://repo.maven.apache.org/maven2/org/apache/maven/plugins/maven-failsafe-plugin/2.17/maven-failsafe-plugin-2.17.pom
Downloaded: http://repo.maven.apache.org/maven2/org/apache/maven/plugins/maven-failsafe-plugin/2.17/maven-failsafe-plugin-2.17.pom
(9 KB at 483.4 KB/sec)
Downloading: http://repo.maven.apache.org/maven2/org/apache/maven/plugins/maven-gpg-plugin/1.5/maven-gpg-plugin-1.5.pom
Downloaded: http://repo.maven.apache.org/maven2/org/apache/maven/plugins/maven-gpg-plugin/1.5/maven-gpg-plugin-1.5.pom
(7 KB at 117.2 KB/sec)
Downloading: http://repo.maven.apache.org/maven2/org/apache/maven/plugins/maven-invoker-plugin/1.9/maven-invoker-plugin-1.9.pom
Downloaded: http://repo.maven.apache.org/maven2/org/apache/maven/plugins/maven-invoker-plugin/1.9/maven-invoker-plugin-1.9.pom
(11 KB at 591.3 KB/sec)
Downloading: http://repo.maven.apache.org/maven2/org/apache/maven/plugins/maven-release-plugin/2.5.1/maven-release-plugin-2.5.1.pom
Downloaded: http://repo.maven.apache.org/maven2/org/apache/maven/plugins/maven-release-plugin/2.5.1/maven-release-plugin-2.5.1.pom
(11 KB at 595.4 KB/sec)
Downloading: http://repo.maven.apache.org/maven2/org/apache/maven/release/maven-release/2.5.1/maven-release-2.5.1.pom
Downloaded: http://repo.maven.apache.org/maven2/org/apache/maven/release/maven-release/2.5.1/maven-release-2.5.1.pom
(5 KB at 221.9 KB/sec)
Downloading: http://repo.maven.apache.org/maven2/org/apache/maven/plugins/maven-scm-plugin/1.9.2/maven-scm-plugin-1.9.2.pom
Downloaded: http://repo.maven.apache.org/maven2/org/apache/maven/plugins/maven-scm-plugin/1.9.2/maven-scm-plugin-1.9.2.pom
(7 KB at 372.9 KB/sec)
Downloading: http://repo.maven.apache.org/maven2/org/apache/maven/scm/maven-scm/1.9.2/maven-scm-1.9.2.pom
Downloaded: http://repo.maven.apache.org/maven2/org/apache/maven/scm/maven-scm/1.9.2/maven-scm-1.9.2.pom
(23 KB at 1226.0 KB/sec)
Downloading: http://repo.maven.apache.org/maven2/org/apache/maven/plugins/maven-scm-publish-plugin/1.1/maven-scm-publish-plugin-1.1.pom
Downloaded: http://repo.maven.apache.org/maven2/org/apache/maven/plugins/maven-scm-publish-plugin/1.1/maven-scm-publish-plugin-1.1.pom
(7 KB at 374.6 KB/sec)
Downloading: http://repo.maven.apache.org/maven2/org/apache/maven/plugins/maven-source-plugin/2.3/maven-source-plugin-2.3.pom
Downloaded: http://repo.maven.apache.org/maven2/org/apache/maven/plugins/maven-source-plugin/2.3/maven-source-plugin-2.3.pom
(7 KB at 381.7 KB/sec)
Downloading: http://repo.maven.apache.org/maven2/org/codehaus/modello/modello-maven-plugin/1.8.1/modello-maven-plugin-1.8.1.pom
Downloaded: http://repo.maven.apache.org/maven2/org/codehaus/modello/modello-maven-plugin/1.8.1/modello-maven-plugin-1.8.1.pom
(8 KB at 428.5 KB/sec)
Downloading: http://repo.maven.apache.org/maven2/org/codehaus/modello/modello/1.8.1/modello-1.8.1.pom
Downloaded: http://repo.maven.apache.org/maven2/org/codehaus/modello/modello/1.8.1/modello-1.8.1.pom
(25 KB at 1349.4 KB/sec)
Downloading: http://repo.maven.apache.org/maven2/org/codehaus/mojo/clirr-maven-plugin/2.6.1/clirr-maven-plugin-2.6.1.pom
Downloaded: http://repo.maven.apache.org/maven2/org/codehaus/mojo/clirr-maven-plugin/2.6.1/clirr-maven-plugin-2.6.1.pom
(9 KB at 492.1 KB/sec)
Downloading: http://repo.maven.apache.org/maven2/org/codehaus/plexus/plexus-component-metadata/1.5.5/plexus-component-metadata-1.5.5.pom
Downloaded: http://repo.maven.apache.org/maven2/org/codehaus/plexus/plexus-component-metadata/1.5.5/plexus-component-metadata-1.5.5.pom
(4 KB at 197.9 KB/sec)
Downloading: http://repo.maven.apache.org/maven2/org/codehaus/plexus/plexus-maven-plugin/1.3.8/plexus-maven-plugin-1.3.8.pom
Downloaded: http://repo.maven.apache.org/maven2/org/codehaus/plexus/plexus-maven-plugin/1.3.8/plexus-maven-plugin-1.3.8.pom
(5 KB at 231.9 KB/sec)
[INFO] Generating "Project Plugins" report      --- maven-project-info-reports-plugin:2.7:plugins
Downloading: http://repo.maven.apache.org/maven2/org/codehaus/mojo/animal-sniffer-maven-plugin/1.9/animal-sniffer-maven-plugin-1.9.pom
Downloaded: http://repo.maven.apache.org/maven2/org/codehaus/mojo/animal-sniffer-maven-plugin/1.9/animal-sniffer-maven-plugin-1.9.pom
(5 KB at 250.3 KB/sec)
Downloading: http://repo.maven.apache.org/maven2/org/codehaus/mojo/animal-sniffer-parent/1.9/animal-sniffer-parent-1.9.pom
Downloaded: http://repo.maven.apache.org/maven2/org/codehaus/mojo/animal-sniffer-parent/1.9/animal-sniffer-parent-1.9.pom
(5 KB at 234.2 KB/sec)
Downloading: http://repo.maven.apache.org/maven2/org/codehaus/mojo/mojo-parent/28/mojo-parent-28.pom
Downloaded: http://repo.maven.apache.org/maven2/org/codehaus/mojo/mojo-parent/28/mojo-parent-28.pom
(26 KB at 1612.7 KB/sec)
Downloading: http://repo.maven.apache.org/maven2/org/codehaus/codehaus-parent/3/codehaus-parent-3.pom
Downloaded: http://repo.maven.apache.org/maven2/org/codehaus/codehaus-parent/3/codehaus-parent-3.pom
(5 KB at 250.7 KB/sec)
[INFO] Generating "Distribution Management" report --- maven-project-info-reports-plugin:2.7:distribution-management
[INFO] Generating "Surefire Report" report      --- maven-surefire-report-plugin:2.16:report-only
[INFO] Generating "Checkstyle" report           --- maven-checkstyle-plugin:2.13:checkstyle
[INFO] 
[INFO] Generating "Source Xref" report          --- maven-jxr-plugin:2.4:jxr
[INFO] Generating "Test Source Xref" report     --- maven-jxr-plugin:2.4:test-jxr
[INFO] Generating "Tag List" report             --- taglist-maven-plugin:2.4:taglist
[WARNING] Using legacy tag format.  This is not recommended.
[INFO] Generating "JavaDocs" report             --- maven-javadoc-plugin:2.9.1:javadoc
[ERROR] Error fetching link: http://www.eclipse.org/aether/aether-api/apidocs/package-list.
Ignored it.
[ERROR] Error fetching link: http://www.eclipse.org/aether/aether-util/apidocs/package-list.
Ignored it.
[ERROR] Error fetching link: http://xml.apache.org/commons/components/external/apidocs/package-list.
Ignored it.
[ERROR] Error fetching link: http://selenium.googlecode.com/selenium-firefox-driver/apidocs/package-list.
Ignored it.
[ERROR] Error fetching link: http://hc.apache.org/httpcomponents-client/apidocs/package-list.
Ignored it.
Downloading: http://repo.maven.apache.org/maven2/org/apache/maven/plugin-tools/maven-plugin-tools-javadoc/3.3/maven-plugin-tools-javadoc-3.3.pom
Downloaded: http://repo.maven.apache.org/maven2/org/apache/maven/plugin-tools/maven-plugin-tools-javadoc/3.3/maven-plugin-tools-javadoc-3.3.pom
(5 KB at 442.0 KB/sec)
Downloading: http://repo.maven.apache.org/maven2/org/apache/maven/plugin-tools/maven-plugin-tools-javadoc/3.3/maven-plugin-tools-javadoc-3.3.jar
Downloaded: http://repo.maven.apache.org/maven2/org/apache/maven/plugin-tools/maven-plugin-tools-javadoc/3.3/maven-plugin-tools-javadoc-3.3.jar
(32 KB at 74.5 KB/sec)
Downloading: http://repo.maven.apache.org/maven2/org/codehaus/plexus/plexus-javadoc/1.0/plexus-javadoc-1.0.pom
Downloaded: http://repo.maven.apache.org/maven2/org/codehaus/plexus/plexus-javadoc/1.0/plexus-javadoc-1.0.pom
(5 KB at 445.3 KB/sec)
Downloading: http://repo.maven.apache.org/maven2/org/codehaus/plexus/plexus-tools/1.0.11/plexus-tools-1.0.11.pom
Downloaded: http://repo.maven.apache.org/maven2/org/codehaus/plexus/plexus-tools/1.0.11/plexus-tools-1.0.11.pom
(2 KB at 187.9 KB/sec)
Downloading: http://repo.maven.apache.org/maven2/org/codehaus/plexus/plexus-javadoc/1.0/plexus-javadoc-1.0.jar
Downloaded: http://repo.maven.apache.org/maven2/org/codehaus/plexus/plexus-javadoc/1.0/plexus-javadoc-1.0.jar
(8 KB at 911.9 KB/sec)
Downloading: http://repo.maven.apache.org/maven2/org/easytesting/fest-assert/1.4/fest-assert-1.4.pom
Downloaded: http://repo.maven.apache.org/maven2/org/easytesting/fest-assert/1.4/fest-assert-1.4.pom
(3 KB at 290.0 KB/sec)
Downloading: http://repo.maven.apache.org/maven2/org/easytesting/fest/1.0.8/fest-1.0.8.pom
Downloaded: http://repo.maven.apache.org/maven2/org/easytesting/fest/1.0.8/fest-1.0.8.pom
(12 KB at 1312.9 KB/sec)
Downloading: http://repo.maven.apache.org/maven2/org/easytesting/fest-util/1.1.6/fest-util-1.1.6.pom
Downloaded: http://repo.maven.apache.org/maven2/org/easytesting/fest-util/1.1.6/fest-util-1.1.6.pom
(2 KB at 190.3 KB/sec)
Downloading: http://repo.maven.apache.org/maven2/org/easytesting/fest-assert/1.4/fest-assert-1.4.jar
Downloading: http://repo.maven.apache.org/maven2/org/easytesting/fest-util/1.1.6/fest-util-1.1.6.jar
Downloading: http://repo.maven.apache.org/maven2/org/apache/maven/maven-plugin-descriptor/2.2.1/maven-plugin-descriptor-2.2.1.jar
Downloaded: http://repo.maven.apache.org/maven2/org/easytesting/fest-assert/1.4/fest-assert-1.4.jar
(77 KB at 7661.2 KB/sec)
Downloaded: http://repo.maven.apache.org/maven2/org/easytesting/fest-util/1.1.6/fest-util-1.1.6.jar
(31 KB at 3367.4 KB/sec)
[JENKINS] Archiving site from <https://builds.apache.org/job/dist-tool-plugin/ws/target/site>
to /x1/jenkins/jenkins-home/jobs/dist-tool-plugin/site
[INFO] ------------------------------------------------------------------------
[INFO] BUILD FAILURE
[INFO] ------------------------------------------------------------------------
[INFO] Total time: 4:45.935s
[INFO] Finished at: Mon Nov 23 10:29:46 UTC 2015
[INFO] Final Memory: 73M/808M
[INFO] ------------------------------------------------------------------------
[WARNING] The requested profile "apache.snapshots" could not be activated because it does
not exist.
Waiting for Jenkins to finish collecting data
[ERROR] Failed to execute goal org.apache.maven.plugins:maven-site-plugin:3.4:site (default-site)
on project dist-tool-plugin: Error generating maven-javadoc-plugin:2.9.1:javadoc: Unable to
resolve artifact:groupId = 'org.apache.maven.plugin-tools'
[ERROR] artifactId = 'maven-plugin-tools-javadoc'
[ERROR] version = '3.3': Could not transfer artifact org.apache.maven:maven-plugin-descriptor:jar:2.2.1
from/to central (http://repo.maven.apache.org/maven2): Connection to http://repo.maven.apache.org
refused
[ERROR] org.apache.maven:maven-plugin-descriptor:jar:2.2.1
[ERROR] 
[ERROR] from the specified remote repositories:
[ERROR] Nexus (http://repository.apache.org/snapshots, releases=false, snapshots=true),
[ERROR] central (http://repo.maven.apache.org/maven2, releases=true, snapshots=false)
[ERROR] Path to dependency:
[ERROR] 1) org.apache.maven.plugin-tools:maven-plugin-tools-javadoc:jar:3.3
[ERROR] 2) org.apache.maven.plugin-tools:maven-plugin-tools-java:jar:3.3
[ERROR] 3) org.apache.maven:maven-plugin-descriptor:jar:2.2.1: Connection timed out
[ERROR] -> [Help 1]
[ERROR] 
[ERROR] To see the full stack trace of the errors, re-run Maven with the -e switch.
[ERROR] Re-run Maven using the -X switch to enable full debug logging.
[ERROR] 
[ERROR] For more information about the errors and possible solutions, please read the following
articles:
[ERROR] [Help 1] http://cwiki.apache.org/confluence/display/MAVEN/MojoExecutionException
[JENKINS] Archiving <https://builds.apache.org/job/dist-tool-plugin/ws/pom.xml> to org.apache.maven.dist.tools/dist-tool-plugin/1.0-SNAPSHOT/dist-tool-plugin-1.0-SNAPSHOT.pom
[JENKINS] Archiving <https://builds.apache.org/job/dist-tool-plugin/ws/target/dist-tool-plugin-1.0-SNAPSHOT.jar>
to org.apache.maven.dist.tools/dist-tool-plugin/1.0-SNAPSHOT/dist-tool-plugin-1.0-SNAPSHOT.jar
channel stopped

Mime
View raw message