maven-notifications mailing list archives

Site index · List index
Message view « Date » · « Thread »
Top « Date » · « Thread »
From Apache Jenkins Server <jenk...@builds.apache.org>
Subject Build failed in Jenkins: maven-indexer-5.x #2
Date Tue, 03 Nov 2015 11:46:17 GMT
See <https://builds.apache.org/job/maven-indexer-5.x/2/changes>

Changes:

[tamas] Added index writer, that writes single chunk for now

------------------------------------------
[...truncated 766 lines...]

[JENKINS] Recording test results
[INFO] 
[INFO] --- maven-failsafe-plugin:2.12:verify (default) @ indexer-core ---
[INFO] Failsafe report directory: <https://builds.apache.org/job/maven-indexer-5.x/ws/indexer-core/target/failsafe-reports>
[JENKINS] Recording test results[INFO] 
[INFO] --- maven-install-plugin:2.5.1:install (default-install) @ indexer-core ---
[INFO] Installing <https://builds.apache.org/job/maven-indexer-5.x/ws/indexer-core/target/indexer-core-5.1.2-SNAPSHOT.jar>
to /home/jenkins/jenkins-slave/maven-repositories/1/org/apache/maven/indexer/indexer-core/5.1.2-SNAPSHOT/indexer-core-5.1.2-SNAPSHOT.jar
[INFO] Installing <https://builds.apache.org/job/maven-indexer-5.x/ws/indexer-core/pom.xml>
to /home/jenkins/jenkins-slave/maven-repositories/1/org/apache/maven/indexer/indexer-core/5.1.2-SNAPSHOT/indexer-core-5.1.2-SNAPSHOT.pom

[INFO]                                                                         
[INFO] ------------------------------------------------------------------------
[INFO] Building Maven :: Indexer CLI 5.1.2-SNAPSHOT
[INFO] ------------------------------------------------------------------------
[INFO] 
[INFO] --- maven-clean-plugin:2.5:clean (default-clean) @ indexer-cli ---
[INFO] 
[INFO] --- maven-enforcer-plugin:1.3.1:enforce (enforce-bytecode-version) @ indexer-cli ---
[INFO] 
[INFO] --- maven-enforcer-plugin:1.3.1:enforce (ban-known-bad-maven-versions) @ indexer-cli
---
[INFO] 
[INFO] --- maven-remote-resources-plugin:1.5:process (default) @ indexer-cli ---
[INFO] 
[INFO] --- maven-resources-plugin:2.6:resources (default-resources) @ indexer-cli ---
[INFO] Using 'UTF-8' encoding to copy filtered resources.
[INFO] skip non existing resourceDirectory <https://builds.apache.org/job/maven-indexer-5.x/ws/indexer-cli/src/main/resources>
[INFO] Copying 3 resources
[INFO] 
[INFO] --- maven-compiler-plugin:2.5.1:compile (default-compile) @ indexer-cli ---
[INFO] Compiling 2 source files to <https://builds.apache.org/job/maven-indexer-5.x/ws/indexer-cli/target/classes>
[INFO] 
[INFO] --- plexus-component-metadata:1.5.5:generate-metadata (process-classes) @ indexer-cli
---
[INFO] 
[INFO] --- animal-sniffer-maven-plugin:1.6:check (check-java-1.5-compat) @ indexer-cli ---
[INFO] Checking unresolved references to org.codehaus.mojo.signature:java15:1.0
[INFO] 
[INFO] --- maven-resources-plugin:2.6:testResources (default-testResources) @ indexer-cli
---
[INFO] Using 'UTF-8' encoding to copy filtered resources.
[INFO] skip non existing resourceDirectory <https://builds.apache.org/job/maven-indexer-5.x/ws/indexer-cli/src/test/resources>
[INFO] Copying 3 resources
[INFO] 
[INFO] --- maven-compiler-plugin:2.5.1:testCompile (default-testCompile) @ indexer-cli ---
[INFO] Compiling 3 source files to <https://builds.apache.org/job/maven-indexer-5.x/ws/indexer-cli/target/test-classes>
[INFO] 
[INFO] --- plexus-component-metadata:1.5.5:generate-test-metadata (process-test-classes) @
indexer-cli ---
[INFO] 
[INFO] --- maven-surefire-plugin:2.12:test (default-test) @ indexer-cli ---
[INFO] Surefire report directory: <https://builds.apache.org/job/maven-indexer-5.x/ws/indexer-cli/target/surefire-reports>

-------------------------------------------------------
 T E S T S
-------------------------------------------------------
Running org.apache.maven.index.cli.NexusIndexerCliTest
Tests run: 7, Failures: 0, Errors: 0, Skipped: 0, Time elapsed: 22.814 sec

Results :

Tests run: 7, Failures: 0, Errors: 0, Skipped: 0

[JENKINS] Recording test results
[INFO] 
[INFO] --- apache-rat-plugin:0.10:check (rat-verify) @ indexer-cli ---
[INFO] 51 implicit excludes (use -debug for more details).
[INFO] Exclude: README.md
[INFO] Exclude: .gitignore
[INFO] Exclude: NOTICE
[INFO] Exclude: .git/**
[INFO] Exclude: .idea/**
[INFO] Exclude: **/*.iml
[INFO] Exclude: src/test/**/*.sha1
[INFO] Exclude: src/test/**/*.md5
[INFO] Exclude: src/test/**/*.xml
[INFO] Exclude: src/test/**/*.pom
[INFO] Exclude: src/test/**/*.asc
[INFO] Exclude: src/test/**/*.properties
[INFO] Exclude: src/test/**/*.swc
[INFO] Exclude: src/test/**/*.txt
[INFO] Exclude: src/test/**/*.filename
[INFO] Exclude: src/test/**/.placeholder
[INFO] 57 resources included (use -debug for more details)
[INFO] Rat check: Summary of files. Unapproved: 0 unknown: 0 generated: 0 approved: 8 licence.
[INFO] 
[INFO] --- maven-jar-plugin:2.4:jar (default-jar) @ indexer-cli ---
[INFO] Building jar: <https://builds.apache.org/job/maven-indexer-5.x/ws/indexer-cli/target/indexer-cli-5.1.2-SNAPSHOT.jar>
[INFO] 
[INFO] --- maven-site-plugin:3.3:attach-descriptor (attach-descriptor) @ indexer-cli ---
[INFO] 
[INFO] --- maven-shade-plugin:1.7.1:shade (jdk15) @ indexer-cli ---
[INFO] Including org.apache.maven.indexer:indexer-artifact:jar:5.1.2-SNAPSHOT in the shaded
jar.
[INFO] Including org.codehaus.plexus:plexus-component-annotations:jar:1.5.5 in the shaded
jar.
[INFO] Including org.codehaus.plexus:plexus-utils:jar:3.0.8 in the shaded jar.
[INFO] Including org.apache.maven.indexer:indexer-core:jar:5.1.2-SNAPSHOT in the shaded jar.
[INFO] Including org.apache.lucene:lucene-core:jar:3.6.2 in the shaded jar.
[INFO] Including org.apache.lucene:lucene-highlighter:jar:3.6.2 in the shaded jar.
[INFO] Including org.apache.lucene:lucene-memory:jar:3.6.2 in the shaded jar.
[INFO] Including org.apache.lucene:lucene-queries:jar:3.6.2 in the shaded jar.
[INFO] Including jakarta-regexp:jakarta-regexp:jar:1.4 in the shaded jar.
[INFO] Including org.sonatype.aether:aether-api:jar:1.13.1 in the shaded jar.
[INFO] Including org.sonatype.aether:aether-util:jar:1.13.1 in the shaded jar.
[INFO] Including org.apache.maven:maven-model:jar:3.0.4 in the shaded jar.
[INFO] Including org.sonatype.sisu:sisu-inject-plexus:jar:2.2.3 in the shaded jar.
[INFO] Including org.codehaus.plexus:plexus-classworlds:jar:2.4 in the shaded jar.
[INFO] Including org.sonatype.sisu:sisu-inject-bean:jar:2.2.3 in the shaded jar.
[INFO] Including org.sonatype.sisu:sisu-guice:jar:no_aop:3.0.3 in the shaded jar.
[INFO] Including org.codehaus.plexus:plexus-cli:jar:1.2 in the shaded jar.
[INFO] Including commons-cli:commons-cli:jar:1.0 in the shaded jar.
[INFO] Including commons-logging:commons-logging:jar:1.0 in the shaded jar.
[INFO] Including commons-lang:commons-lang:jar:1.0 in the shaded jar.
[INFO] Including de.schlichtherle.truezip:truezip-file:jar:7.6.6 in the shaded jar.
[INFO] Including de.schlichtherle.truezip:truezip-driver-file:jar:7.6.6 in the shaded jar.
[INFO] Including de.schlichtherle.truezip:truezip-kernel:jar:7.6.6 in the shaded jar.
[INFO] Including de.schlichtherle.truezip:truezip-driver-zip:jar:7.6.6 in the shaded jar.
[INFO] Including org.apache.commons:commons-compress:jar:1.4.1 in the shaded jar.
[INFO] Including org.bouncycastle:bcprov-jdk16:jar:1.46 in the shaded jar.
[INFO] Replacing original artifact with shaded artifact.
[INFO] Replacing <https://builds.apache.org/job/maven-indexer-5.x/ws/indexer-cli/target/indexer-cli-5.1.2-SNAPSHOT.jar>
with <https://builds.apache.org/job/maven-indexer-5.x/ws/indexer-cli/target/indexer-cli-5.1.2-SNAPSHOT-shaded.jar>
[INFO] 
[INFO] --- maven-failsafe-plugin:2.12:integration-test (default) @ indexer-cli ---
[INFO] Failsafe report directory: <https://builds.apache.org/job/maven-indexer-5.x/ws/indexer-cli/target/failsafe-reports>

-------------------------------------------------------
 T E S T S
-------------------------------------------------------
Running org.apache.maven.index.cli.NexusIndexerCliIT
Tests run: 7, Failures: 0, Errors: 0, Skipped: 0, Time elapsed: 35.32 sec

Results :

Tests run: 7, Failures: 0, Errors: 0, Skipped: 0

[JENKINS] Recording test results
[INFO] 
[INFO] --- maven-failsafe-plugin:2.12:verify (default) @ indexer-cli ---
[INFO] Failsafe report directory: <https://builds.apache.org/job/maven-indexer-5.x/ws/indexer-cli/target/failsafe-reports>
[JENKINS] Recording test results[INFO] 
[INFO] --- maven-install-plugin:2.5.1:install (default-install) @ indexer-cli ---
[INFO] Installing <https://builds.apache.org/job/maven-indexer-5.x/ws/indexer-cli/target/indexer-cli-5.1.2-SNAPSHOT.jar>
to /home/jenkins/jenkins-slave/maven-repositories/1/org/apache/maven/indexer/indexer-cli/5.1.2-SNAPSHOT/indexer-cli-5.1.2-SNAPSHOT.jar

[INFO] Installing <https://builds.apache.org/job/maven-indexer-5.x/ws/indexer-cli/pom.xml>
to /home/jenkins/jenkins-slave/maven-repositories/1/org/apache/maven/indexer/indexer-cli/5.1.2-SNAPSHOT/indexer-cli-5.1.2-SNAPSHOT.pom
[INFO]                                                                         
[INFO] ------------------------------------------------------------------------
[INFO] Building Maven :: Indexer Reader 5.1.2-SNAPSHOT
[INFO] ------------------------------------------------------------------------
[INFO] 
[INFO] --- maven-clean-plugin:2.5:clean (default-clean) @ indexer-reader ---
[INFO] 
[INFO] --- maven-enforcer-plugin:1.3.1:enforce (enforce-bytecode-version) @ indexer-reader
---
[INFO] 
[INFO] --- maven-enforcer-plugin:1.3.1:enforce (ban-known-bad-maven-versions) @ indexer-reader
---
[INFO] 
[INFO] --- maven-remote-resources-plugin:1.5:process (default) @ indexer-reader ---
[INFO] 
[INFO] --- maven-resources-plugin:2.6:resources (default-resources) @ indexer-reader ---
[INFO] Using 'UTF-8' encoding to copy filtered resources.
[INFO] skip non existing resourceDirectory <https://builds.apache.org/job/maven-indexer-5.x/ws/indexer-reader/src/main/resources>
[INFO] Copying 3 resources
[INFO] 
[INFO] --- maven-compiler-plugin:2.5.1:compile (default-compile) @ indexer-reader ---
[INFO] Compiling 11 source files to <https://builds.apache.org/job/maven-indexer-5.x/ws/indexer-reader/target/classes>
[INFO] -------------------------------------------------------------
[ERROR] COMPILATION ERROR : 
[INFO] -------------------------------------------------------------
[ERROR] <https://builds.apache.org/job/maven-indexer-5.x/ws/indexer-reader/src/main/java/org/apache/maven/index/reader/Iterables.java>:[137,23]
error: TransformIterator is not abstract and does not override abstract method remove() in
Iterator
[ERROR] <https://builds.apache.org/job/maven-indexer-5.x/ws/indexer-reader/src/main/java/org/apache/maven/index/reader/Iterables.java>:[158,23]
error: ConcatIterator is not abstract and does not override abstract method remove() in Iterator
[ERROR] <https://builds.apache.org/job/maven-indexer-5.x/ws/indexer-reader/src/main/java/org/apache/maven/index/reader/IndexReader.java>:[230,17]
error: ChunkReaderIterator is not abstract and does not override abstract method remove()
in Iterator
[ERROR] <https://builds.apache.org/job/maven-indexer-5.x/ws/indexer-reader/src/main/java/org/apache/maven/index/reader/ChunkReader.java>:[103,17]
error: IndexIterator is not abstract and does not override abstract method remove() in Iterator
[INFO] 4 errors 
[INFO] -------------------------------------------------------------
[INFO] ------------------------------------------------------------------------
[INFO] Reactor Summary:
[INFO] 
[INFO] Maven :: Indexer .................................. SUCCESS [6.717s]
[INFO] Maven :: Indexer Artifact Utils ................... SUCCESS [11.686s]
[INFO] Maven :: Indexer Core ............................. SUCCESS [10:26.042s]
[INFO] Maven :: Indexer CLI .............................. SUCCESS [1:04.590s]
[INFO] Maven :: Indexer Reader ........................... FAILURE [0.705s]
[INFO] ------------------------------------------------------------------------
[INFO] BUILD FAILURE
[INFO] ------------------------------------------------------------------------
[INFO] Total time: 11:52.709s
[INFO] Finished at: Tue Nov 03 11:46:18 UTC 2015
[INFO] Final Memory: 59M/802M
[INFO] ------------------------------------------------------------------------
Waiting for Jenkins to finish collecting data
[ERROR] Failed to execute goal org.apache.maven.plugins:maven-compiler-plugin:2.5.1:compile
(default-compile) on project indexer-reader: Compilation failure: Compilation failure:
[ERROR] <https://builds.apache.org/job/maven-indexer-5.x/ws/indexer-reader/src/main/java/org/apache/maven/index/reader/Iterables.java>:[137,23]
error: TransformIterator is not abstract and does not override abstract method remove() in
Iterator
[ERROR] <https://builds.apache.org/job/maven-indexer-5.x/ws/indexer-reader/src/main/java/org/apache/maven/index/reader/Iterables.java>:[158,23]
error: ConcatIterator is not abstract and does not override abstract method remove() in Iterator
[ERROR] <https://builds.apache.org/job/maven-indexer-5.x/ws/indexer-reader/src/main/java/org/apache/maven/index/reader/IndexReader.java>:[230,17]
error: ChunkReaderIterator is not abstract and does not override abstract method remove()
in Iterator
[ERROR] <https://builds.apache.org/job/maven-indexer-5.x/ws/indexer-reader/src/main/java/org/apache/maven/index/reader/ChunkReader.java>:[103,17]
error: IndexIterator is not abstract and does not override abstract method remove() in Iterator
[ERROR] -> [Help 1]
org.apache.maven.lifecycle.LifecycleExecutionException: Failed to execute goal org.apache.maven.plugins:maven-compiler-plugin:2.5.1:compile
(default-compile) on project indexer-reader: Compilation failure
	at org.apache.maven.lifecycle.internal.MojoExecutor.execute(MojoExecutor.java:213)
	at org.apache.maven.lifecycle.internal.MojoExecutor.execute(MojoExecutor.java:153)
	at org.apache.maven.lifecycle.internal.MojoExecutor.execute(MojoExecutor.java:145)
	at org.apache.maven.lifecycle.internal.LifecycleModuleBuilder.buildProject(LifecycleModuleBuilder.java:84)
	at org.apache.maven.lifecycle.internal.LifecycleModuleBuilder.buildProject(LifecycleModuleBuilder.java:59)
	at org.apache.maven.lifecycle.internal.LifecycleStarter.singleThreadedBuild(LifecycleStarter.java:183)
	at org.apache.maven.lifecycle.internal.LifecycleStarter.execute(LifecycleStarter.java:161)
	at org.apache.maven.DefaultMaven.doExecute(DefaultMaven.java:320)
	at org.apache.maven.DefaultMaven.execute(DefaultMaven.java:156)
	at org.jvnet.hudson.maven3.launcher.Maven3Launcher.main(Maven3Launcher.java:117)
	at sun.reflect.NativeMethodAccessorImpl.invoke0(Native Method)
	at sun.reflect.NativeMethodAccessorImpl.invoke(NativeMethodAccessorImpl.java:57)
	at sun.reflect.DelegatingMethodAccessorImpl.invoke(DelegatingMethodAccessorImpl.java:43)
	at java.lang.reflect.Method.invoke(Method.java:606)
	at org.codehaus.plexus.classworlds.launcher.Launcher.launchStandard(Launcher.java:329)
	at org.codehaus.plexus.classworlds.launcher.Launcher.launch(Launcher.java:239)
	at org.jvnet.hudson.maven3.agent.Maven3Main.launch(Maven3Main.java:181)
	at sun.reflect.NativeMethodAccessorImpl.invoke0(Native Method)
	at sun.reflect.NativeMethodAccessorImpl.invoke(NativeMethodAccessorImpl.java:57)
	at sun.reflect.DelegatingMethodAccessorImpl.invoke(DelegatingMethodAccessorImpl.java:43)
	at java.lang.reflect.Method.invoke(Method.java:606)
	at hudson.maven.Maven3Builder.call(Maven3Builder.java:136)
	at hudson.maven.Maven3Builder.call(Maven3Builder.java:71)
	at hudson.remoting.UserRequest.perform(UserRequest.java:121)
	at hudson.remoting.UserRequest.perform(UserRequest.java:49)
	at hudson.remoting.Request$2.run(Request.java:326)
	at hudson.remoting.InterceptingExecutorService$1.call(InterceptingExecutorService.java:68)
	at java.util.concurrent.FutureTask$Sync.innerRun(FutureTask.java:334)
	at java.util.concurrent.FutureTask.run(FutureTask.java:166)
	at java.util.concurrent.ThreadPoolExecutor.runWorker(ThreadPoolExecutor.java:1145)
	at java.util.concurrent.ThreadPoolExecutor$Worker.run(ThreadPoolExecutor.java:615)
	at java.lang.Thread.run(Thread.java:724)
Caused by: org.apache.maven.plugin.CompilationFailureException: Compilation failure
	at org.apache.maven.plugin.AbstractCompilerMojo.execute(AbstractCompilerMojo.java:729)
	at org.apache.maven.plugin.CompilerMojo.execute(CompilerMojo.java:128)
	at org.apache.maven.plugin.DefaultBuildPluginManager.executeMojo(DefaultBuildPluginManager.java:101)
	at org.apache.maven.lifecycle.internal.MojoExecutor.execute(MojoExecutor.java:209)
	... 31 more
[ERROR] 
[ERROR] Re-run Maven using the -X switch to enable full debug logging.
[ERROR] 
[ERROR] For more information about the errors and possible solutions, please read the following
articles:
[ERROR] [Help 1] http://cwiki.apache.org/confluence/display/MAVEN/MojoFailureException
[ERROR] 
[ERROR] After correcting the problems, you can resume the build with the command
[ERROR]   mvn <goals> -rf :indexer-reader
[JENKINS] Archiving <https://builds.apache.org/job/maven-indexer-5.x/ws/indexer-artifact/pom.xml>
to org.apache.maven.indexer/indexer-artifact/5.1.2-SNAPSHOT/indexer-artifact-5.1.2-SNAPSHOT.pom
[JENKINS] Archiving <https://builds.apache.org/job/maven-indexer-5.x/ws/indexer-artifact/target/indexer-artifact-5.1.2-SNAPSHOT.jar>
to org.apache.maven.indexer/indexer-artifact/5.1.2-SNAPSHOT/indexer-artifact-5.1.2-SNAPSHOT.jar
[JENKINS] Archiving <https://builds.apache.org/job/maven-indexer-5.x/ws/indexer-reader/pom.xml>
to org.apache.maven.indexer/indexer-reader/5.1.2-SNAPSHOT/indexer-reader-5.1.2-SNAPSHOT.pom
No prior successful build to compare, so performing full copy of artifacts
[JENKINS] Archiving <https://builds.apache.org/job/maven-indexer-5.x/ws/pom.xml> to
org.apache.maven.indexer/maven-indexer/5.1.2-SNAPSHOT/maven-indexer-5.1.2-SNAPSHOT.pom
[JENKINS] Archiving <https://builds.apache.org/job/maven-indexer-5.x/ws/target/maven-indexer-5.1.2-SNAPSHOT-site.xml>
to org.apache.maven.indexer/maven-indexer/5.1.2-SNAPSHOT/maven-indexer-5.1.2-SNAPSHOT-site.xml
[JENKINS] Archiving <https://builds.apache.org/job/maven-indexer-5.x/ws/indexer-core/pom.xml>
to org.apache.maven.indexer/indexer-core/5.1.2-SNAPSHOT/indexer-core-5.1.2-SNAPSHOT.pom
[JENKINS] Archiving <https://builds.apache.org/job/maven-indexer-5.x/ws/indexer-core/target/indexer-core-5.1.2-SNAPSHOT.jar>
to org.apache.maven.indexer/indexer-core/5.1.2-SNAPSHOT/indexer-core-5.1.2-SNAPSHOT.jar
[JENKINS] Archiving <https://builds.apache.org/job/maven-indexer-5.x/ws/indexer-cli/pom.xml>
to org.apache.maven.indexer/indexer-cli/5.1.2-SNAPSHOT/indexer-cli-5.1.2-SNAPSHOT.pom
[JENKINS] Archiving <https://builds.apache.org/job/maven-indexer-5.x/ws/indexer-cli/target/indexer-cli-5.1.2-SNAPSHOT.jar>
to org.apache.maven.indexer/indexer-cli/5.1.2-SNAPSHOT/indexer-cli-5.1.2-SNAPSHOT.jar
Sending e-mails to: notifications@maven.apache.org
channel stopped

Mime
View raw message