maven-notifications mailing list archives

Site index · List index
Message view « Date » · « Thread »
Top « Date » · « Thread »
From Apache Jenkins Server <jenk...@builds.apache.org>
Subject Build failed in Jenkins: doxia-sitetools » JDK 1.6 (latest),Windows #224
Date Sat, 23 Jan 2016 17:06:39 GMT
See <https://builds.apache.org/job/doxia-sitetools/jdk=JDK%201.6%20(latest),label=Windows/224/changes>

Changes:

[hboutemy] [DOXIA-506] fixed test after change

------------------------------------------
[...truncated 820 lines...]
  </body>
</project>

interpolated : <?xml version="1.0"?>
<project xsi:schemaLocation="http://maven.apache.org/DECORATION/1.7.0 http://maven.apache.org/xsd/decoration-1.7.0.xsd"
name="dummy" xmlns="http://maven.apache.org/DECORATION/1.7.0"
    xmlns:xsi="http://www.w3.org/2001/XMLSchema-instance">
  <bannerLeft>
    <name>dummy</name>
  </bannerLeft>
  <publishDate />
  <version />
  <body>
    <links>
      <item name="dummy" href="${project.url}" />
    </links>
    <menu ref="parent" />
    <menu ref="modules" />
    <menu ref="reports" />
  </body>
</project>

inherited : <?xml version="1.0" encoding="ISO-8859-1"?>
<project xsi:schemaLocation="http://maven.apache.org/DECORATION/1.7.0 http://maven.apache.org/xsd/decoration-1.7.0.xsd"
name="${project.name}" xmlns="http://maven.apache.org/DECORATION/1.7.0"
    xmlns:xsi="http://www.w3.org/2001/XMLSchema-instance">
  <bannerLeft>
    <name>project.artifactId = ${project.artifactId}</name>
  </bannerLeft>
  <publishDate />
  <version />
  <body>
    <breadcrumbs>
      <item name="Maven" href="http://maven.apache.org/index.html" />
      <item name="${project.name}" href="" />
    </breadcrumbs>
  </body>
</project>

interpolated : <?xml version="1.0" encoding="ISO-8859-1"?>
<project xsi:schemaLocation="http://maven.apache.org/DECORATION/1.7.0 http://maven.apache.org/xsd/decoration-1.7.0.xsd"
name="MSHARED-217 Child" xmlns="http://maven.apache.org/DECORATION/1.7.0"
    xmlns:xsi="http://www.w3.org/2001/XMLSchema-instance">
  <bannerLeft>
    <name>project.artifactId = mshared-217-child</name>
  </bannerLeft>
  <publishDate />
  <version />
  <body>
    <breadcrumbs>
      <item name="Maven" href="http://maven.apache.org/index.html" />
      <item name="MSHARED-217 Child" href="" />
    </breadcrumbs>
  </body>
</project>

Tests run: 10, Failures: 0, Errors: 0, Skipped: 0, Time elapsed: 1.93 sec - in org.apache.maven.doxia.tools.SiteToolTest

Results :

Tests run: 11, Failures: 0, Errors: 0, Skipped: 0

[INFO] 
[INFO] --- maven-jar-plugin:2.5:jar (default-jar) @ doxia-integration-tools ---
[INFO] Building jar: F:\hudson\hudson-slave\workspace\doxia-sitetools\jdk\JDK 1.6 (latest)\label\Windows\doxia-integration-tools\target\doxia-integration-tools-1.7-SNAPSHOT.jar
[INFO] 
[INFO] --- maven-site-plugin:3.4:attach-descriptor (attach-descriptor) @ doxia-integration-tools
---
[INFO] 
[INFO] --- maven-checkstyle-plugin:2.15:check (checkstyle-check) @ doxia-integration-tools
---
[INFO] 
[INFO] >>> clirr-maven-plugin:2.6.1:check (default) @ doxia-integration-tools >>>
[INFO] 
[INFO] --- maven-enforcer-plugin:1.3.1:enforce (enforce-bytecode-version) @ doxia-integration-tools
---
[INFO] 
[INFO] --- maven-enforcer-plugin:1.3.1:enforce (ban-known-bad-maven-versions) @ doxia-integration-tools
---
[INFO] 
[INFO] --- apache-rat-plugin:0.11:check (rat-check) @ doxia-integration-tools ---
[INFO] 51 implicit excludes (use -debug for more details).
[INFO] Exclude: src/test/resources/site/confluence/confluence/*.confluence
[INFO] Exclude: src/test/resources/org/apache/maven/doxia/siterenderer/velocity-toolmanager.vm
[INFO] Exclude: src/test/resources/org/apache/maven/doxia/siterenderer/velocity-toolmanager.expected.txt
[INFO] Exclude: src/test/resources/dtd/xhtml-*.ent
[INFO] Exclude: src/test/resources/dtd/xhtml1-transitional.dtd
[INFO] Exclude: src/test/resources/xhtml-lat1.ent
[INFO] Exclude: DEPENDENCIES
[INFO] 50 resources included (use -debug for more details)
[INFO] Rat check: Summary of files. Unapproved: 0 unknown: 0 generated: 0 approved: 50 licence.
[INFO] 
[INFO] --- apache-rat-plugin:0.11:check (check) @ doxia-integration-tools ---
[INFO] 51 implicit excludes (use -debug for more details).
[INFO] Exclude: src/test/resources/site/confluence/confluence/*.confluence
[INFO] Exclude: src/test/resources/org/apache/maven/doxia/siterenderer/velocity-toolmanager.vm
[INFO] Exclude: src/test/resources/org/apache/maven/doxia/siterenderer/velocity-toolmanager.expected.txt
[INFO] Exclude: src/test/resources/dtd/xhtml-*.ent
[INFO] Exclude: src/test/resources/dtd/xhtml1-transitional.dtd
[INFO] Exclude: src/test/resources/xhtml-lat1.ent
[INFO] 50 resources included (use -debug for more details)
[INFO] Rat check: Summary of files. Unapproved: 0 unknown: 0 generated: 0 approved: 50 licence.
[INFO] 
[INFO] --- maven-remote-resources-plugin:1.5:process (default) @ doxia-integration-tools ---
[INFO] 
[INFO] --- maven-resources-plugin:2.7:resources (default-resources) @ doxia-integration-tools
---
[INFO] Using 'UTF-8' encoding to copy filtered resources.
[INFO] Copying 26 resources
[INFO] skip non existing resourceDirectory F:\hudson\hudson-slave\workspace\doxia-sitetools\jdk\JDK
1.6 (latest)\label\Windows\doxia-integration-tools\target\generated-site\xsd
[INFO] Copying 3 resources
[INFO] Copying 3 resources
[INFO] 
[INFO] --- maven-compiler-plugin:3.2:compile (default-compile) @ doxia-integration-tools ---
[INFO] Nothing to compile - all classes are up to date
[INFO] 
[INFO] <<< clirr-maven-plugin:2.6.1:check (default) @ doxia-integration-tools <<<
[INFO] 
[INFO] --- clirr-maven-plugin:2.6.1:check (default) @ doxia-integration-tools ---
[INFO] Comparing to version: 1.1
Downloading: http://repo.maven.apache.org/maven2/org/apache/maven/doxia/doxia-integration-tools/1.1/doxia-integration-tools-1.1.jar
[WARNING] Impossible to find previous version
[INFO] Succeeded with 0 errors; 0 warnings; and 0 other changes.
[INFO] 
[INFO] --- maven-install-plugin:2.5.2:install (default-install) @ doxia-integration-tools
---
[INFO] Installing F:\hudson\hudson-slave\workspace\doxia-sitetools\jdk\JDK 1.6 (latest)\label\Windows\doxia-integration-tools\target\doxia-integration-tools-1.7-SNAPSHOT.jar
to C:\.m2\repository\org\apache\maven\doxia\doxia-integration-tools\1.7-SNAPSHOT\doxia-integration-tools-1.7-SNAPSHOT.jar
[INFO] Installing F:\hudson\hudson-slave\workspace\doxia-sitetools\jdk\JDK 1.6 (latest)\label\Windows\doxia-integration-tools\pom.xml
to C:\.m2\repository\org\apache\maven\doxia\doxia-integration-tools\1.7-SNAPSHOT\doxia-integration-tools-1.7-SNAPSHOT.pom
[INFO]                                                                         
[INFO] ------------------------------------------------------------------------
[INFO] Building Doxia :: Site Renderer 1.7-SNAPSHOT
[INFO] ------------------------------------------------------------------------
Downloading: http://repository.apache.org/snapshots/org/apache/maven/doxia/doxia-module-confluence/1.7-SNAPSHOT/maven-metadata.xml
Downloaded: http://repository.apache.org/snapshots/org/apache/maven/doxia/doxia-module-confluence/1.7-SNAPSHOT/maven-metadata.xml
(792 B at 1.2 KB/sec)
Downloading: http://repository.apache.org/snapshots/org/apache/maven/doxia/doxia-module-docbook-simple/1.7-SNAPSHOT/maven-metadata.xml
Downloaded: http://repository.apache.org/snapshots/org/apache/maven/doxia/doxia-module-docbook-simple/1.7-SNAPSHOT/maven-metadata.xml
(796 B at 2.8 KB/sec)
[INFO] 
[INFO] --- maven-clean-plugin:2.5:clean (default-clean) @ doxia-site-renderer ---
[INFO] Deleting F:\hudson\hudson-slave\workspace\doxia-sitetools\jdk\JDK 1.6 (latest)\label\Windows\doxia-site-renderer\target
[INFO] 
[INFO] --- maven-enforcer-plugin:1.3.1:enforce (enforce-bytecode-version) @ doxia-site-renderer
---
[INFO] 
[INFO] --- maven-enforcer-plugin:1.3.1:enforce (ban-known-bad-maven-versions) @ doxia-site-renderer
---
[INFO] 
[INFO] --- apache-rat-plugin:0.11:check (rat-check) @ doxia-site-renderer ---
[INFO] 51 implicit excludes (use -debug for more details).
[INFO] Exclude: src/test/resources/site/confluence/confluence/*.confluence
[INFO] Exclude: src/test/resources/org/apache/maven/doxia/siterenderer/velocity-toolmanager.vm
[INFO] Exclude: src/test/resources/org/apache/maven/doxia/siterenderer/velocity-toolmanager.expected.txt
[INFO] Exclude: src/test/resources/dtd/xhtml-*.ent
[INFO] Exclude: src/test/resources/dtd/xhtml1-transitional.dtd
[INFO] Exclude: src/test/resources/xhtml-lat1.ent
[INFO] Exclude: DEPENDENCIES
[INFO] 72 resources included (use -debug for more details)
[INFO] Rat check: Summary of files. Unapproved: 0 unknown: 0 generated: 0 approved: 64 licence.
[INFO] 
[INFO] --- apache-rat-plugin:0.11:check (check) @ doxia-site-renderer ---
[INFO] 51 implicit excludes (use -debug for more details).
[INFO] Exclude: src/test/resources/site/confluence/confluence/*.confluence
[INFO] Exclude: src/test/resources/org/apache/maven/doxia/siterenderer/velocity-toolmanager.vm
[INFO] Exclude: src/test/resources/org/apache/maven/doxia/siterenderer/velocity-toolmanager.expected.txt
[INFO] Exclude: src/test/resources/dtd/xhtml-*.ent
[INFO] Exclude: src/test/resources/dtd/xhtml1-transitional.dtd
[INFO] Exclude: src/test/resources/xhtml-lat1.ent
[INFO] 72 resources included (use -debug for more details)
[INFO] Rat check: Summary of files. Unapproved: 0 unknown: 0 generated: 0 approved: 64 licence.
[INFO] 
[INFO] --- maven-remote-resources-plugin:1.5:process (default) @ doxia-site-renderer ---
[INFO] 
[INFO] --- maven-resources-plugin:2.7:resources (default-resources) @ doxia-site-renderer
---
[INFO] Using 'UTF-8' encoding to copy filtered resources.
[INFO] Copying 22 resources
[INFO] skip non existing resourceDirectory F:\hudson\hudson-slave\workspace\doxia-sitetools\jdk\JDK
1.6 (latest)\label\Windows\doxia-site-renderer\target\generated-site\xsd
[INFO] Copying 3 resources
[INFO] 
[INFO] --- maven-compiler-plugin:3.2:compile (default-compile) @ doxia-site-renderer ---
[INFO] Changes detected - recompiling the module!
[INFO] Compiling 10 source files to F:\hudson\hudson-slave\workspace\doxia-sitetools\jdk\JDK
1.6 (latest)\label\Windows\doxia-site-renderer\target\classes
[INFO] Some input files use or override a deprecated API.
[INFO] Recompile with -Xlint:deprecation for details.
[INFO] 
[INFO] --- plexus-component-metadata:1.5.5:generate-metadata (default) @ doxia-site-renderer
---
[INFO] Discovered 1 component descriptors(s)
[INFO] 
[INFO] --- maven-resources-plugin:2.7:testResources (default-testResources) @ doxia-site-renderer
---
[INFO] Using 'UTF-8' encoding to copy filtered resources.
[INFO] Copying 47 resources
[INFO] Copying 3 resources
[INFO] 
[INFO] --- maven-compiler-plugin:3.2:testCompile (default-testCompile) @ doxia-site-renderer
---
[INFO] Changes detected - recompiling the module!
[INFO] Compiling 15 source files to F:\hudson\hudson-slave\workspace\doxia-sitetools\jdk\JDK
1.6 (latest)\label\Windows\doxia-site-renderer\target\test-classes
[INFO] -------------------------------------------------------------
[ERROR] COMPILATION ERROR : 
[INFO] -------------------------------------------------------------
[ERROR] /F:/hudson/hudson-slave/workspace/doxia-sitetools/jdk/JDK 1.6 (latest)/label/Windows/doxia-site-renderer/src/test/java/org/apache/maven/doxia/siterenderer/SkinResourceLoaderTest.java:[28,40]
F:\hudson\hudson-slave\workspace\doxia-sitetools\jdk\JDK 1.6 (latest)\label\Windows\doxia-site-renderer\src\test\java\org\apache\maven\doxia\siterenderer\SkinResourceLoaderTest.java:28:
package org.apache.maven.doxia.sink.impl does not exist
[ERROR] /F:/hudson/hudson-slave/workspace/doxia-sitetools/jdk/JDK 1.6 (latest)/label/Windows/doxia-site-renderer/src/test/java/org/apache/maven/doxia/siterenderer/SkinResourceLoaderTest.java:[38,22]
F:\hudson\hudson-slave\workspace\doxia-sitetools\jdk\JDK 1.6 (latest)\label\Windows\doxia-site-renderer\src\test\java\org\apache\maven\doxia\siterenderer\SkinResourceLoaderTest.java:38:
cannot find symbol
symbol  : variable AbstractSink
location: class org.apache.maven.doxia.siterenderer.SkinResourceLoaderTest
[INFO] 2 errors 
[INFO] -------------------------------------------------------------
[INFO] ------------------------------------------------------------------------
[INFO] Reactor Summary:
[INFO] 
[INFO] Doxia :: Sitetools ................................ SUCCESS [7.247s]
[INFO] Doxia :: Decoration Model ......................... SUCCESS [9.341s]
[INFO] Doxia :: Document Renderer ........................ SUCCESS [41.553s]
[INFO] Doxia :: Integration Tools ........................ SUCCESS [6.786s]
[INFO] Doxia :: Site Renderer ............................ FAILURE [3.898s]
[INFO] ------------------------------------------------------------------------
[INFO] BUILD FAILURE
[INFO] ------------------------------------------------------------------------
[INFO] Total time: 1:09.601s
[INFO] Finished at: Sat Jan 23 17:06:55 GMT 2016
[INFO] Final Memory: 34M/322M
[INFO] ------------------------------------------------------------------------
[ERROR] Failed to execute goal org.apache.maven.plugins:maven-compiler-plugin:3.2:testCompile
(default-testCompile) on project doxia-site-renderer: Compilation failure: Compilation failure:
[ERROR] /F:/hudson/hudson-slave/workspace/doxia-sitetools/jdk/JDK 1.6 (latest)/label/Windows/doxia-site-renderer/src/test/java/org/apache/maven/doxia/siterenderer/SkinResourceLoaderTest.java:[28,40]
F:\hudson\hudson-slave\workspace\doxia-sitetools\jdk\JDK 1.6 (latest)\label\Windows\doxia-site-renderer\src\test\java\org\apache\maven\doxia\siterenderer\SkinResourceLoaderTest.java:28:
package org.apache.maven.doxia.sink.impl does not exist
[ERROR] /F:/hudson/hudson-slave/workspace/doxia-sitetools/jdk/JDK 1.6 (latest)/label/Windows/doxia-site-renderer/src/test/java/org/apache/maven/doxia/siterenderer/SkinResourceLoaderTest.java:[38,22]
F:\hudson\hudson-slave\workspace\doxia-sitetools\jdk\JDK 1.6 (latest)\label\Windows\doxia-site-renderer\src\test\java\org\apache\maven\doxia\siterenderer\SkinResourceLoaderTest.java:38:
cannot find symbol
[ERROR] symbol  : variable AbstractSink
[ERROR] location: class org.apache.maven.doxia.siterenderer.SkinResourceLoaderTest
[ERROR] -> [Help 1]
org.apache.maven.lifecycle.LifecycleExecutionException: Failed to execute goal org.apache.maven.plugins:maven-compiler-plugin:3.2:testCompile
(default-testCompile) on project doxia-site-renderer: Compilation failure
	at org.apache.maven.lifecycle.internal.MojoExecutor.execute(MojoExecutor.java:213)
	at org.apache.maven.lifecycle.internal.MojoExecutor.execute(MojoExecutor.java:153)
	at org.apache.maven.lifecycle.internal.MojoExecutor.execute(MojoExecutor.java:145)
	at org.apache.maven.lifecycle.internal.LifecycleModuleBuilder.buildProject(LifecycleModuleBuilder.java:84)
	at org.apache.maven.lifecycle.internal.LifecycleModuleBuilder.buildProject(LifecycleModuleBuilder.java:59)
	at org.apache.maven.lifecycle.internal.LifecycleStarter.singleThreadedBuild(LifecycleStarter.java:183)
	at org.apache.maven.lifecycle.internal.LifecycleStarter.execute(LifecycleStarter.java:161)
	at org.apache.maven.DefaultMaven.doExecute(DefaultMaven.java:320)
	at org.apache.maven.DefaultMaven.execute(DefaultMaven.java:156)
	at org.apache.maven.cli.MavenCli.execute(MavenCli.java:537)
	at org.apache.maven.cli.MavenCli.doMain(MavenCli.java:196)
	at org.apache.maven.cli.MavenCli.main(MavenCli.java:141)
	at sun.reflect.NativeMethodAccessorImpl.invoke0(Native Method)
	at sun.reflect.NativeMethodAccessorImpl.invoke(NativeMethodAccessorImpl.java:39)
	at sun.reflect.DelegatingMethodAccessorImpl.invoke(DelegatingMethodAccessorImpl.java:25)
	at java.lang.reflect.Method.invoke(Method.java:597)
	at org.codehaus.plexus.classworlds.launcher.Launcher.launchEnhanced(Launcher.java:290)
	at org.codehaus.plexus.classworlds.launcher.Launcher.launch(Launcher.java:230)
	at org.codehaus.plexus.classworlds.launcher.Launcher.mainWithExitCode(Launcher.java:409)
	at org.codehaus.plexus.classworlds.launcher.Launcher.main(Launcher.java:352)
Caused by: org.apache.maven.plugin.compiler.CompilationFailureException: Compilation failure
	at org.apache.maven.plugin.compiler.AbstractCompilerMojo.execute(AbstractCompilerMojo.java:909)
	at org.apache.maven.plugin.compiler.TestCompilerMojo.execute(TestCompilerMojo.java:153)
	at org.apache.maven.plugin.DefaultBuildPluginManager.executeMojo(DefaultBuildPluginManager.java:101)
	at org.apache.maven.lifecycle.internal.MojoExecutor.execute(MojoExecutor.java:209)
	... 19 more
[ERROR] 
[ERROR] Re-run Maven using the -X switch to enable full debug logging.
[ERROR] 
[ERROR] For more information about the errors and possible solutions, please read the following
articles:
[ERROR] [Help 1] http://cwiki.apache.org/confluence/display/MAVEN/MojoFailureException
[ERROR] 
[ERROR] After correcting the problems, you can resume the build with the command
[ERROR]   mvn <goals> -rf :doxia-site-renderer
Build step 'Invoke top-level Maven targets' marked build as failure

Mime
View raw message