maven-notifications mailing list archives

Site index · List index
Message view « Date » · « Thread »
Top « Date » · « Thread »
From Apache Jenkins Server <jenk...@builds.apache.org>
Subject Build failed in Jenkins: core-it-maven-3-win #1081
Date Mon, 18 Jan 2016 04:21:38 GMT
See <https://builds.apache.org/job/core-it-maven-3-win/1081/changes>

Changes:

[schulte] [MNG-5359] Declared execution in PluginMgmt gets bound to lifecycle

------------------------------------------
[...truncated 10412 lines...]
org.apache.maven.it.VerificationException: Exit code was non-zero: 1; command line and log
= 
<https://builds.apache.org/job/core-it-maven-3-win/ws/apache-maven-3-SNAPSHOT\bin\mvn>
--global-settings F:\ws\m3-its\core-integration-testing-trunk\core-it-suite\target\test-classes\settings-remote.xml
-e --batch-mode -Dmaven.repo.local=<https://builds.apache.org/job/core-it-maven-3-win/ws/it-local-repo>
install
[INFO] Error stacktraces are turned on.
[INFO] Scanning for projects...
[INFO]                                                                         
[INFO] ------------------------------------------------------------------------
[INFO] Building Maven Integration Test :: MNG-5359 0.1-SNAPSHOT
[INFO] ------------------------------------------------------------------------
[INFO] Downloading: http://repo1.maven.org/maven2/org/apache/maven/plugins/maven-compiler-plugin/2.5.1/maven-compiler-plugin-2.5.1.pom
[INFO] Downloaded: http://repo1.maven.org/maven2/org/apache/maven/plugins/maven-compiler-plugin/2.5.1/maven-compiler-plugin-2.5.1.pom
(8 KB at 31.5 KB/sec)
[INFO] Downloading: http://repo1.maven.org/maven2/org/apache/maven/plugins/maven-compiler-plugin/2.5.1/maven-compiler-plugin-2.5.1.jar
[INFO] Downloaded: http://repo1.maven.org/maven2/org/apache/maven/plugins/maven-compiler-plugin/2.5.1/maven-compiler-plugin-2.5.1.jar
(32 KB at 320.7 KB/sec)
[INFO] Downloading: http://repo1.maven.org/maven2/org/apache/maven/plugins/maven-jar-plugin/2.4/maven-jar-plugin-2.4.pom
[INFO] Downloaded: http://repo1.maven.org/maven2/org/apache/maven/plugins/maven-jar-plugin/2.4/maven-jar-plugin-2.4.pom
(6 KB at 82.6 KB/sec)
[INFO] Downloading: http://repo1.maven.org/maven2/org/apache/maven/plugins/maven-jar-plugin/2.4/maven-jar-plugin-2.4.jar
[INFO] Downloaded: http://repo1.maven.org/maven2/org/apache/maven/plugins/maven-jar-plugin/2.4/maven-jar-plugin-2.4.jar
(34 KB at 349.7 KB/sec)
[INFO] 
[INFO] --- maven-resources-plugin:2.6:resources (default-resources) @ test ---
[INFO] Using 'UTF-8' encoding to copy filtered resources.
[INFO] skip non existing resourceDirectory F:\ws\m3-its\core-integration-testing-trunk\core-it-suite\target\test-classes\mng-5359\src\main\resources
[INFO] 
[INFO] --- maven-compiler-plugin:2.5.1:compile (default-compile) @ test ---
[INFO] Downloading: http://repo1.maven.org/maven2/org/codehaus/plexus/plexus-compiler-api/1.9.1/plexus-compiler-api-1.9.1.pom
[INFO] Downloaded: http://repo1.maven.org/maven2/org/codehaus/plexus/plexus-compiler-api/1.9.1/plexus-compiler-api-1.9.1.pom
(867 B at 12.1 KB/sec)
[INFO] Downloading: http://repo1.maven.org/maven2/org/codehaus/plexus/plexus-compiler/1.9.1/plexus-compiler-1.9.1.pom
[INFO] Downloaded: http://repo1.maven.org/maven2/org/codehaus/plexus/plexus-compiler/1.9.1/plexus-compiler-1.9.1.pom
(4 KB at 48.7 KB/sec)
[INFO] Downloading: http://repo1.maven.org/maven2/org/codehaus/plexus/plexus-components/1.1.20/plexus-components-1.1.20.pom
[INFO] Downloaded: http://repo1.maven.org/maven2/org/codehaus/plexus/plexus-components/1.1.20/plexus-components-1.1.20.pom
(3 KB at 44.6 KB/sec)
[INFO] Downloading: http://repo1.maven.org/maven2/org/codehaus/plexus/plexus-compiler-manager/1.9.1/plexus-compiler-manager-1.9.1.pom
[INFO] Downloaded: http://repo1.maven.org/maven2/org/codehaus/plexus/plexus-compiler-manager/1.9.1/plexus-compiler-manager-1.9.1.pom
(692 B at 9.9 KB/sec)
[INFO] Downloading: http://repo1.maven.org/maven2/org/codehaus/plexus/plexus-compiler-javac/1.9.1/plexus-compiler-javac-1.9.1.pom
[INFO] Downloaded: http://repo1.maven.org/maven2/org/codehaus/plexus/plexus-compiler-javac/1.9.1/plexus-compiler-javac-1.9.1.pom
(688 B at 9.9 KB/sec)
[INFO] Downloading: http://repo1.maven.org/maven2/org/codehaus/plexus/plexus-compilers/1.9.1/plexus-compilers-1.9.1.pom
[INFO] Downloaded: http://repo1.maven.org/maven2/org/codehaus/plexus/plexus-compilers/1.9.1/plexus-compilers-1.9.1.pom
(2 KB at 17.3 KB/sec)
[INFO] Downloading: http://repo1.maven.org/maven2/org/codehaus/plexus/plexus-compiler-api/1.9.1/plexus-compiler-api-1.9.1.jar
[INFO] Downloading: http://repo1.maven.org/maven2/org/codehaus/plexus/plexus-compiler-javac/1.9.1/plexus-compiler-javac-1.9.1.jar
[INFO] Downloading: http://repo1.maven.org/maven2/org/codehaus/plexus/plexus-compiler-manager/1.9.1/plexus-compiler-manager-1.9.1.jar
[INFO] Downloaded: http://repo1.maven.org/maven2/org/codehaus/plexus/plexus-compiler-api/1.9.1/plexus-compiler-api-1.9.1.jar
(21 KB at 282.3 KB/sec)
[INFO] Downloaded: http://repo1.maven.org/maven2/org/codehaus/plexus/plexus-compiler-manager/1.9.1/plexus-compiler-manager-1.9.1.jar
(5 KB at 43.2 KB/sec)
[INFO] Downloaded: http://repo1.maven.org/maven2/org/codehaus/plexus/plexus-compiler-javac/1.9.1/plexus-compiler-javac-1.9.1.jar
(14 KB at 110.9 KB/sec)
[INFO] Compiling 1 source file to F:\ws\m3-its\core-integration-testing-trunk\core-it-suite\target\test-classes\mng-5359\target\classes
[INFO] 
[INFO] --- maven-resources-plugin:2.6:testResources (default-testResources) @ test ---
[INFO] Using 'UTF-8' encoding to copy filtered resources.
[INFO] skip non existing resourceDirectory F:\ws\m3-its\core-integration-testing-trunk\core-it-suite\target\test-classes\mng-5359\src\test\resources
[INFO] 
[INFO] --- maven-compiler-plugin:2.5.1:testCompile (default-testCompile) @ test ---
[INFO] No sources to compile
[INFO] 
[INFO] --- maven-surefire-plugin:2.12.4:test (default-test) @ test ---
[INFO] No tests to run.
[INFO] 
[INFO] --- maven-jar-plugin:2.4:jar (default-jar) @ test ---
[INFO] Downloading: http://repo1.maven.org/maven2/org/codehaus/plexus/plexus-archiver/2.1/plexus-archiver-2.1.jar
[INFO] Downloading: http://repo1.maven.org/maven2/org/codehaus/plexus/plexus-io/2.0.2/plexus-io-2.0.2.jar
[INFO] Downloaded: http://repo1.maven.org/maven2/org/codehaus/plexus/plexus-io/2.0.2/plexus-io-2.0.2.jar
(57 KB at 403.5 KB/sec)
[INFO] Downloaded: http://repo1.maven.org/maven2/org/codehaus/plexus/plexus-archiver/2.1/plexus-archiver-2.1.jar
(181 KB at 1085.0 KB/sec)
[INFO] Building jar: F:\ws\m3-its\core-integration-testing-trunk\core-it-suite\target\test-classes\mng-5359\target\test-0.1-SNAPSHOT.jar
[INFO] 
[INFO] --- maven-clean-plugin:2.5:clean (auto-clean) @ test ---
[INFO] Deleting F:\ws\m3-its\core-integration-testing-trunk\core-it-suite\target\test-classes\mng-5359\target
[INFO] 
[INFO] --- maven-install-plugin:2.4:install (default-install) @ test ---
[INFO] ------------------------------------------------------------------------
[INFO] BUILD FAILURE
[INFO] ------------------------------------------------------------------------
[INFO] Total time: 5.316 s
[INFO] Finished at: 2016-01-17T19:33:19-08:00
[INFO] Final Memory: 15M/742M
[INFO] ------------------------------------------------------------------------
[ERROR] Failed to execute goal org.apache.maven.plugins:maven-install-plugin:2.4:install (default-install)
on project test: The packaging for this project did not assign a file to the build artifact
-> [Help 1]
org.apache.maven.lifecycle.LifecycleExecutionException: Failed to execute goal org.apache.maven.plugins:maven-install-plugin:2.4:install
(default-install) on project test: The packaging for this project did not assign a file to
the build artifact
	at org.apache.maven.lifecycle.internal.MojoExecutor.execute(MojoExecutor.java:214)
	at org.apache.maven.lifecycle.internal.MojoExecutor.execute(MojoExecutor.java:155)
	at org.apache.maven.lifecycle.internal.MojoExecutor.execute(MojoExecutor.java:147)
	at org.apache.maven.lifecycle.internal.LifecycleModuleBuilder.buildProject(LifecycleModuleBuilder.java:116)
	at org.apache.maven.lifecycle.internal.LifecycleModuleBuilder.buildProject(LifecycleModuleBuilder.java:80)
	at org.apache.maven.lifecycle.internal.builder.singlethreaded.SingleThreadedBuilder.build(SingleThreadedBuilder.java:51)
	at org.apache.maven.lifecycle.internal.LifecycleStarter.execute(LifecycleStarter.java:128)
	at org.apache.maven.DefaultMaven.doExecute(DefaultMaven.java:307)
	at org.apache.maven.DefaultMaven.doExecute(DefaultMaven.java:193)
	at org.apache.maven.DefaultMaven.execute(DefaultMaven.java:106)
	at org.apache.maven.cli.MavenCli.execute(MavenCli.java:865)
	at org.apache.maven.cli.MavenCli.doMain(MavenCli.java:288)
	at org.apache.maven.cli.MavenCli.main(MavenCli.java:199)
	at sun.reflect.NativeMethodAccessorImpl.invoke0(Native Method)
	at sun.reflect.NativeMethodAccessorImpl.invoke(NativeMethodAccessorImpl.java:57)
	at sun.reflect.DelegatingMethodAccessorImpl.invoke(DelegatingMethodAccessorImpl.java:43)
	at java.lang.reflect.Method.invoke(Method.java:601)
	at org.codehaus.plexus.classworlds.launcher.Launcher.launchEnhanced(Launcher.java:289)
	at org.codehaus.plexus.classworlds.launcher.Launcher.launch(Launcher.java:229)
	at org.codehaus.plexus.classworlds.launcher.Launcher.mainWithExitCode(Launcher.java:415)
	at org.codehaus.plexus.classworlds.launcher.Launcher.main(Launcher.java:356)
Caused by: org.apache.maven.plugin.MojoExecutionException: The packaging for this project
did not assign a file to the build artifact
	at org.apache.maven.plugin.install.InstallMojo.execute(InstallMojo.java:136)
	at org.apache.maven.plugin.DefaultBuildPluginManager.executeMojo(DefaultBuildPluginManager.java:134)
	at org.apache.maven.lifecycle.internal.MojoExecutor.execute(MojoExecutor.java:209)
	... 20 more
[ERROR] 
[ERROR] Re-run Maven using the -X switch to enable full debug logging.
[ERROR] 
[ERROR] For more information about the errors and possible solutions, please read the following
articles:
[ERROR] [Help 1] http://cwiki.apache.org/confluence/display/MAVEN/MojoExecutionException

	at org.apache.maven.it.Verifier.executeGoals(Verifier.java:1369)
	at org.apache.maven.it.Verifier.executeGoal(Verifier.java:1254)
	at org.apache.maven.it.Verifier.executeGoal(Verifier.java:1248)
	at org.apache.maven.it.MavenITmng5359CleanPluginExecutionDeclarationInPluginMgmtTest.testit(MavenITmng5359CleanPluginExecutionDeclarationInPluginMgmtTest.java:52)


Results :

Tests in error: 
  MavenITmng5359CleanPluginExecutionDeclarationInPluginMgmtTest>AbstractMavenIntegrationTestCase.runTest:219->testit:52
ยป Verification

Tests run: 772, Failures: 0, Errors: 1, Skipped: 0

[INFO] ------------------------------------------------------------------------
[INFO] Reactor Summary:
[INFO] 
[INFO] Maven Core ITs ..................................... SUCCESS [ 53.444 s]
[INFO] Maven IT Support ................................... SUCCESS [  0.990 s]
[INFO] Maven IT :: Plugins ................................ SUCCESS [  0.731 s]
[INFO] Maven IT Plugin :: Active Collection ............... SUCCESS [ 10.969 s]
[INFO] Maven IT Plugin :: Ant-Based ....................... SUCCESS [  6.072 s]
[INFO] Maven IT Plugin :: Artifact ........................ SUCCESS [  3.002 s]
[INFO] Maven IT Plugin :: Class Loader :: Dependency A .... SUCCESS [  0.567 s]
[INFO] Maven IT Plugin :: Class Loader :: Dependency B .... SUCCESS [  0.950 s]
[INFO] Maven IT Plugin :: Class Loader :: Dependency C .... SUCCESS [  0.738 s]
[INFO] Maven IT Plugin :: Class Loader .................... SUCCESS [  2.989 s]
[INFO] Maven IT Plugin :: Class Loader :: Aggregator ...... SUCCESS [  0.439 s]
[INFO] Maven IT Plugin :: Configuration ................... SUCCESS [  1.669 s]
[INFO] Maven IT Plugin :: Context Passing ................. SUCCESS [  0.529 s]
[INFO] Maven ITs :: Core Plugin Stubs ..................... SUCCESS [  0.425 s]
[INFO] Maven IT Clean Plugin Stub ......................... SUCCESS [  1.207 s]
[INFO] Maven IT Compiler Plugin Stub ...................... SUCCESS [  0.936 s]
[INFO] Maven IT Deploy Plugin Stub ........................ SUCCESS [  0.943 s]
[INFO] Maven IT EAR Plugin Stub ........................... SUCCESS [  1.131 s]
[INFO] Maven IT EJB Plugin Stub ........................... SUCCESS [  1.258 s]
[INFO] Maven IT Install Plugin Stub ....................... SUCCESS [  0.753 s]
[INFO] Maven IT JAR Plugin Stub ........................... SUCCESS [  0.629 s]
[INFO] Maven IT Javadoc Plugin Stub ....................... SUCCESS [  0.745 s]
[INFO] Maven IT Plugin Plugin Stub ........................ SUCCESS [  0.699 s]
[INFO] Maven IT RAR Plugin Stub ........................... SUCCESS [  1.361 s]
[INFO] Maven IT Resources Plugin Stub ..................... SUCCESS [  0.955 s]
[INFO] Maven IT Site Plugin Stub .......................... SUCCESS [  0.831 s]
[INFO] Maven IT Source Plugin Stub ........................ SUCCESS [  0.744 s]
[INFO] Maven IT Surefire Plugin Stub ...................... SUCCESS [  0.752 s]
[INFO] Maven IT WAR Plugin Stub ........................... SUCCESS [  0.653 s]
[INFO] Maven IT Plugin :: Dependency Collection ........... SUCCESS [  0.830 s]
[INFO] Maven IT Plugin :: Dependency Resolution ........... SUCCESS [ 10.060 s]
[INFO] Maven IT Plugin :: Expression ...................... SUCCESS [  1.455 s]
[INFO] Maven IT Plugin :: Error Mojos ..................... SUCCESS [  3.123 s]
[INFO] Maven IT Component ................................. SUCCESS [  0.446 s]
[INFO] Maven IT Plugin :: Extension Consumer .............. SUCCESS [  0.627 s]
[INFO] Maven IT Plugin :: Extension Provider .............. SUCCESS [  1.089 s]
[INFO] Maven IT Plugin :: Fork ............................ SUCCESS [  1.440 s]
[INFO] Maven IT Plugin :: Invalid Descriptor .............. SUCCESS [  0.524 s]
[INFO] Maven IT Plugin :: Log File ........................ SUCCESS [  0.511 s]
[INFO] Maven IT Helper Library ............................ SUCCESS [  1.854 s]
[INFO] Maven IT Plugin :: Model Interpolation ............. SUCCESS [  1.408 s]
[INFO] Maven IT Plugin :: No Default Component ............ SUCCESS [  0.628 s]
[INFO] Maven IT Plugin :: No Project ...................... SUCCESS [  0.498 s]
[INFO] Maven IT Plugin :: Online .......................... SUCCESS [  0.505 s]
[INFO] Maven IT Plugin :: Optional Mojos .................. SUCCESS [  1.375 s]
[INFO] Maven IT Plugin :: Packaging ....................... SUCCESS [  0.487 s]
[INFO] Maven IT Plugin :: Parameter Implementation ........ SUCCESS [  0.499 s]
[INFO] Maven IT Plugin :: Plugin Dependency ............... SUCCESS [  0.591 s]
[INFO] Maven IT Plugin :: Project ......................... SUCCESS [  0.949 s]
[INFO] Maven IT Plugin :: Project Interpolation ........... SUCCESS [  1.075 s]
[INFO] Maven IT Plugin :: Setter .......................... SUCCESS [  0.556 s]
[INFO] Maven IT Plugin :: Singleton Component ............. SUCCESS [  0.792 s]
[INFO] Maven IT Plugin :: Site ............................ SUCCESS [  4.445 s]
[INFO] Maven IT Plugin :: Toolchain ....................... SUCCESS [  7.683 s]
[INFO] Maven IT Plugin :: Touch ........................... SUCCESS [  2.012 s]
[INFO] Maven IT Plugin :: Uses Properties Plugin .......... SUCCESS [  0.574 s]
[INFO] Maven IT Plugin :: Uses Wagon Plugin ............... SUCCESS [  3.570 s]
[INFO] Maven IT Plugin :: This plugin should contain the mojos needed by all tests. SUCCESS
[  0.442 s]
[INFO] Maven IT Plugin :: Plexus Utils 1.1 ................ SUCCESS [  0.905 s]
[INFO] Maven IT Plugin :: Plexus Utils New ................ SUCCESS [  1.065 s]
[INFO] Maven IT Plugin :: Plexus Component API ............ SUCCESS [  1.956 s]
[INFO] Maven IT Plugin :: Log4J Client .................... SUCCESS [  1.033 s]
[INFO] Maven IT Plugin :: Extension 1 ..................... SUCCESS [  0.438 s]
[INFO] Maven IT Plugin :: Extension 2 ..................... SUCCESS [  0.451 s]
[INFO] Maven IT Plugin :: Plexus Lifecycle ................ SUCCESS [  2.205 s]
[INFO] Maven IT Plugin :: Settings ........................ SUCCESS [  0.690 s]
[INFO] Maven IT Plugin :: mng-5805 extension .............. SUCCESS [  0.382 s]
[INFO] Maven IT Plugin :: mng-5805 plugin ................. SUCCESS [  0.671 s]
[INFO] Maven IT Plugin :: mng-5805 plugin-dep ............. SUCCESS [  0.402 s]
[INFO] Maven IT Toolchain ................................. SUCCESS [  1.078 s]
[INFO] Maven IT Wagon ..................................... SUCCESS [  0.735 s]
[INFO] Maven IT Support Artifacts ......................... SUCCESS [  2.761 s]
[INFO] Maven IT Extension ................................. SUCCESS [  0.386 s]
[INFO] Maven ITs .......................................... FAILURE [48:44 min]
[INFO] ------------------------------------------------------------------------
[INFO] BUILD FAILURE
[INFO] ------------------------------------------------------------------------
[INFO] Total time: 51:32 min
[INFO] Finished at: 2016-01-17T20:21:00-08:00
[INFO] Final Memory: 60M/742M
[INFO] ------------------------------------------------------------------------
[ERROR] Failed to execute goal org.apache.maven.plugins:maven-surefire-plugin:2.18.1:test
(default-test) on project core-it-suite: There are test failures.
[ERROR] 
[ERROR] Please refer to F:\ws\m3-its\core-integration-testing-trunk\core-it-suite\target\surefire-reports
for the individual test results.
[ERROR] -> [Help 1]
org.apache.maven.lifecycle.LifecycleExecutionException: Failed to execute goal org.apache.maven.plugins:maven-surefire-plugin:2.18.1:test
(default-test) on project core-it-suite: There are test failures.

Please refer to F:\ws\m3-its\core-integration-testing-trunk\core-it-suite\target\surefire-reports
for the individual test results.
	at org.apache.maven.lifecycle.internal.MojoExecutor.execute(MojoExecutor.java:212)
	at org.apache.maven.lifecycle.internal.MojoExecutor.execute(MojoExecutor.java:153)
	at org.apache.maven.lifecycle.internal.MojoExecutor.execute(MojoExecutor.java:145)
	at org.apache.maven.lifecycle.internal.LifecycleModuleBuilder.buildProject(LifecycleModuleBuilder.java:116)
	at org.apache.maven.lifecycle.internal.LifecycleModuleBuilder.buildProject(LifecycleModuleBuilder.java:80)
	at org.apache.maven.lifecycle.internal.builder.singlethreaded.SingleThreadedBuilder.build(SingleThreadedBuilder.java:51)
	at org.apache.maven.lifecycle.internal.LifecycleStarter.execute(LifecycleStarter.java:128)
	at org.apache.maven.DefaultMaven.doExecute(DefaultMaven.java:307)
	at org.apache.maven.DefaultMaven.doExecute(DefaultMaven.java:193)
	at org.apache.maven.DefaultMaven.execute(DefaultMaven.java:106)
	at org.apache.maven.cli.MavenCli.execute(MavenCli.java:862)
	at org.apache.maven.cli.MavenCli.doMain(MavenCli.java:286)
	at org.apache.maven.cli.MavenCli.main(MavenCli.java:197)
	at sun.reflect.NativeMethodAccessorImpl.invoke0(Native Method)
	at sun.reflect.NativeMethodAccessorImpl.invoke(NativeMethodAccessorImpl.java:57)
	at sun.reflect.DelegatingMethodAccessorImpl.invoke(DelegatingMethodAccessorImpl.java:43)
	at java.lang.reflect.Method.invoke(Method.java:601)
	at org.codehaus.plexus.classworlds.launcher.Launcher.launchEnhanced(Launcher.java:289)
	at org.codehaus.plexus.classworlds.launcher.Launcher.launch(Launcher.java:229)
	at org.codehaus.plexus.classworlds.launcher.Launcher.mainWithExitCode(Launcher.java:415)
	at org.codehaus.plexus.classworlds.launcher.Launcher.main(Launcher.java:356)
Caused by: org.apache.maven.plugin.MojoFailureException: There are test failures.

Please refer to F:\ws\m3-its\core-integration-testing-trunk\core-it-suite\target\surefire-reports
for the individual test results.
	at org.apache.maven.plugin.surefire.SurefireHelper.reportExecution(SurefireHelper.java:82)
	at org.apache.maven.plugin.surefire.SurefirePlugin.handleSummary(SurefirePlugin.java:254)
	at org.apache.maven.plugin.surefire.AbstractSurefireMojo.executeAfterPreconditionsChecked(AbstractSurefireMojo.java:854)
	at org.apache.maven.plugin.surefire.AbstractSurefireMojo.execute(AbstractSurefireMojo.java:722)
	at org.apache.maven.plugin.DefaultBuildPluginManager.executeMojo(DefaultBuildPluginManager.java:134)
	at org.apache.maven.lifecycle.internal.MojoExecutor.execute(MojoExecutor.java:208)
	... 20 more
[ERROR] 
[ERROR] Re-run Maven using the -X switch to enable full debug logging.
[ERROR] 
[ERROR] For more information about the errors and possible solutions, please read the following
articles:
[ERROR] [Help 1] http://cwiki.apache.org/confluence/display/MAVEN/MojoFailureException
[ERROR] 
[ERROR] After correcting the problems, you can resume the build with the command
[ERROR]   mvn <goals> -rf :core-it-suite
Build step 'Invoke top-level Maven targets' marked build as failure
Recording test results

Mime
View raw message