maven-notifications mailing list archives

Site index · List index
Message view « Date » · « Thread »
Top « Date » · « Thread »
From Apache Jenkins Server <jenk...@builds.apache.org>
Subject Build failed in Jenkins: maven-skins #247
Date Fri, 26 Feb 2016 05:35:57 GMT
See <https://builds.apache.org/job/maven-skins/247/>

------------------------------------------
Started by user hboutemy
[EnvInject] - Loading node environment variables.
Building remotely on H10 (docker Ubuntu ubuntu yahoo-not-h2) in workspace <https://builds.apache.org/job/maven-skins/ws/>
Updating http://svn.apache.org/repos/asf/maven/skins/trunk at revision '2016-02-26T05:35:33.513
+0000'
U         maven-fluido-skin/pom.xml
U         maven-fluido-skin/src/main/resources/META-INF/maven/skin.xml
U         maven-fluido-skin/src/site/site.xml
U         maven-fluido-skin/src/site/apt/poweredby.apt
U         maven-fluido-skin/src/it/mskins-76_topbar/pom.xml
U         maven-fluido-skin/src/it/sidebar/pom.xml
U         maven-fluido-skin/src/it/mskins-21/pom.xml
U         maven-fluido-skin/src/it/mskins-22/pom.xml
U         maven-fluido-skin/src/it/mskins-23/pom.xml
U         maven-fluido-skin/src/it/topbar/pom.xml
U         maven-fluido-skin/src/it/mskins-24/pom.xml
U         maven-fluido-skin/src/it/mskins-25/pom.xml
U         maven-fluido-skin/src/it/mskins-85/pom.xml
U         maven-fluido-skin/src/it/mskins-33_topbar/pom.xml
U         maven-fluido-skin/src/it/topbar-inverse/pom.xml
U         maven-fluido-skin/src/it/mskins-33/pom.xml
U         maven-fluido-skin/src/it/mskins-34/pom.xml
U         maven-fluido-skin/src/it/mskins-22_default/pom.xml
U         maven-fluido-skin/src/it/mskins-72/pom.xml
U         maven-fluido-skin/src/it/mskins-22_topbar/pom.xml
U         maven-fluido-skin/src/it/mskins-75/pom.xml
U         maven-fluido-skin/src/it/mskins-24_topbar/pom.xml
U         maven-fluido-skin/src/it/mskins-76/pom.xml
U         maven-fluido-skin/src/it/mskins-34_topbar/pom.xml
U         maven-default-skin/pom.xml
U         maven-default-skin/src/it/sample/pom.xml
U         maven-default-skin/src/main/resources/META-INF/maven/skin.xml
At revision 1732420
no change for http://svn.apache.org/repos/asf/maven/skins/trunk since the previous build
Parsing POMs
ERROR: Failed to parse POMs
java.io.IOException: remote file operation failed: <https://builds.apache.org/job/maven-skins/ws/>
at hudson.remoting.Channel@58076af9:H10: hudson.remoting.ProxyException: hudson.maven.MavenModuleSetBuild$MavenExecutionException:
org.apache.maven.project.ProjectBuildingException: Some problems were encountered while processing
the POMs:
[FATAL] Non-resolvable parent POM: Could not find artifact org.apache.maven.skins:maven-skins:pom:30-SNAPSHOT
and 'parent.relativePath' points at wrong local POM @ line 25, column 11
[FATAL] Non-resolvable parent POM: Could not find artifact org.apache.maven.skins:maven-skins:pom:30-SNAPSHOT
and 'parent.relativePath' points at wrong local POM @ line 25, column 11

	at hudson.FilePath.act(FilePath.java:986)
	at hudson.FilePath.act(FilePath.java:968)
	at hudson.maven.MavenModuleSetBuild$MavenModuleSetBuildExecution.parsePoms(MavenModuleSetBuild.java:960)
	at hudson.maven.MavenModuleSetBuild$MavenModuleSetBuildExecution.doRun(MavenModuleSetBuild.java:679)
	at hudson.model.AbstractBuild$AbstractBuildExecution.run(AbstractBuild.java:534)
	at hudson.model.Run.execute(Run.java:1738)
	at hudson.maven.MavenModuleSetBuild.run(MavenModuleSetBuild.java:531)
	at hudson.model.ResourceController.execute(ResourceController.java:98)
	at hudson.model.Executor.run(Executor.java:410)
Caused by: hudson.remoting.ProxyException: hudson.maven.MavenModuleSetBuild$MavenExecutionException:
org.apache.maven.project.ProjectBuildingException: Some problems were encountered while processing
the POMs:
[FATAL] Non-resolvable parent POM: Could not find artifact org.apache.maven.skins:maven-skins:pom:30-SNAPSHOT
and 'parent.relativePath' points at wrong local POM @ line 25, column 11
[FATAL] Non-resolvable parent POM: Could not find artifact org.apache.maven.skins:maven-skins:pom:30-SNAPSHOT
and 'parent.relativePath' points at wrong local POM @ line 25, column 11

	at hudson.maven.MavenModuleSetBuild$PomParser.invoke(MavenModuleSetBuild.java:1364)
	at hudson.maven.MavenModuleSetBuild$PomParser.invoke(MavenModuleSetBuild.java:1098)
	at hudson.FilePath$FileCallableWrapper.call(FilePath.java:2719)
	at hudson.remoting.UserRequest.perform(UserRequest.java:120)
	at hudson.remoting.UserRequest.perform(UserRequest.java:48)
	at hudson.remoting.Request$2.run(Request.java:326)
	at hudson.remoting.InterceptingExecutorService$1.call(InterceptingExecutorService.java:68)
	at java.util.concurrent.FutureTask.run(FutureTask.java:262)
	at java.util.concurrent.ThreadPoolExecutor.runWorker(ThreadPoolExecutor.java:1145)
	at java.util.concurrent.ThreadPoolExecutor$Worker.run(ThreadPoolExecutor.java:615)
	at java.lang.Thread.run(Thread.java:745)
	at ......remote call to H10(Native Method)
	at hudson.remoting.Channel.attachCallSiteStackTrace(Channel.java:1416)
	at hudson.remoting.UserResponse.retrieve(UserRequest.java:220)
	at hudson.remoting.Channel.call(Channel.java:781)
	at hudson.FilePath.act(FilePath.java:979)
	... 8 more
Caused by: hudson.remoting.ProxyException: org.apache.maven.project.ProjectBuildingException:
Some problems were encountered while processing the POMs:
[FATAL] Non-resolvable parent POM: Could not find artifact org.apache.maven.skins:maven-skins:pom:30-SNAPSHOT
and 'parent.relativePath' points at wrong local POM @ line 25, column 11
[FATAL] Non-resolvable parent POM: Could not find artifact org.apache.maven.skins:maven-skins:pom:30-SNAPSHOT
and 'parent.relativePath' points at wrong local POM @ line 25, column 11

	at org.apache.maven.project.DefaultProjectBuilder.build(DefaultProjectBuilder.java:364)
	at hudson.maven.MavenEmbedder.buildProjects(MavenEmbedder.java:361)
	at hudson.maven.MavenEmbedder.readProjects(MavenEmbedder.java:331)
	at hudson.maven.MavenModuleSetBuild$PomParser.invoke(MavenModuleSetBuild.java:1301)
	at hudson.maven.MavenModuleSetBuild$PomParser.invoke(MavenModuleSetBuild.java:1098)
	at hudson.FilePath$FileCallableWrapper.call(FilePath.java:2719)
	at hudson.remoting.UserRequest.perform(UserRequest.java:120)
	at hudson.remoting.UserRequest.perform(UserRequest.java:48)
	at hudson.remoting.Request$2.run(Request.java:326)
	at hudson.remoting.InterceptingExecutorService$1.call(InterceptingExecutorService.java:68)
	at java.util.concurrent.FutureTask.run(FutureTask.java:262)
	at java.util.concurrent.ThreadPoolExecutor.runWorker(ThreadPoolExecutor.java:1145)
	at java.util.concurrent.ThreadPoolExecutor$Worker.run(ThreadPoolExecutor.java:615)
	at java.lang.Thread.run(Thread.java:745)

Mime
View raw message