maven-notifications mailing list archives

Site index · List index
Message view « Date » · « Thread »
Top « Date » · « Thread »
From Apache Jenkins Server <jenk...@builds.apache.org>
Subject Build failed in Jenkins: core-it-maven-3-win #1140
Date Fri, 26 Feb 2016 19:16:32 GMT
See <https://builds.apache.org/job/core-it-maven-3-win/1140/changes>

Changes:

[schulte] [MNG-5984] Maven core extension resolution ignores repositories from

------------------------------------------
[...truncated 51792 lines...]
  MavenITmng4498IgnoreBrokenMetadataTest>AbstractMavenIntegrationTestCase.runTest:219->testit:57
» Verification
  MavenITmng4500NoUpdateOfTimestampedSnapshotsTest>AbstractMavenIntegrationTestCase.runTest:219->testit:104
» Verification
  MavenITmng4526MavenProjectArtifactsScopeTest>AbstractMavenIntegrationTestCase.runTest:219->testit:58
» Verification
  MavenITmng4528ExcludeWagonsFromMavenCoreArtifactsTest>AbstractMavenIntegrationTestCase.runTest:219->testit:57
» Verification
  MavenITmng4536RequiresNoProjectForkingMojoTest>AbstractMavenIntegrationTestCase.runTest:219->testit:54
» Verification
  MavenITmng4544ActiveComponentCollectionThreadSafeTest>AbstractMavenIntegrationTestCase.runTest:219->testit:53
» Verification
  MavenITmng4553CoreArtifactFilterConsidersGroupIdTest>AbstractMavenIntegrationTestCase.runTest:219->testit:57
» Verification
  MavenITmng4580ProjectLevelPluginDepUsedForCliInvocInReactorTest>AbstractMavenIntegrationTestCase.runTest:219->testit:56
» Verification
  MavenITmng4590ImportedPomUsesSystemPropertiesTest>AbstractMavenIntegrationTestCase.runTest:219->testit:59
» Verification
  MavenITmng4615ValidateRequiredPluginParameterTest>AbstractMavenIntegrationTestCase.runTest:219->testitAllSet:54
» Verification
  MavenITmng4615ValidateRequiredPluginParameterTest>AbstractMavenIntegrationTestCase.runTest:219->testitExprSet:104
» Verification
  MavenITmng4615ValidateRequiredPluginParameterTest>AbstractMavenIntegrationTestCase.runTest:219->testitPomValSet:154
» Verification
  MavenITmng4618AggregatorBuiltAfterModulesTest>AbstractMavenIntegrationTestCase.runTest:219->testit:54
» Verification
  MavenITmng4625SettingsXmlInterpolationWithXmlMarkupTest>AbstractMavenIntegrationTestCase.runTest:219->testit:70
» Verification
  MavenITmng4654ArtifactHandlerForMainArtifactTest>AbstractMavenIntegrationTestCase.runTest:219->testit:57
» Verification
  MavenITmng4666CoreRealmImportTest>AbstractMavenIntegrationTestCase.runTest:219->testit:77
» Verification
  MavenITmng4677DisabledPluginConfigInheritanceTest>AbstractMavenIntegrationTestCase.runTest:219->testit:56
» Verification
  MavenITmng4679SnapshotUpdateInPluginTest>AbstractMavenIntegrationTestCase.runTest:219->testit:62
» Verification
  MavenITmng4684DistMngtOverridenByProfileTest>AbstractMavenIntegrationTestCase.runTest:219->testit:54
» Verification
  MavenITmng4690InterdependentConflictResolutionTest>AbstractMavenIntegrationTestCase.runTest:219->testitADX:48->testit:98
» Verification
  MavenITmng4690InterdependentConflictResolutionTest>AbstractMavenIntegrationTestCase.runTest:219->testitAXD:54->testit:98
» Verification
  MavenITmng4690InterdependentConflictResolutionTest>AbstractMavenIntegrationTestCase.runTest:219->testitDAX:61->testit:98
» Verification
  MavenITmng4690InterdependentConflictResolutionTest>AbstractMavenIntegrationTestCase.runTest:219->testitDXA:67->testit:98
» Verification
  MavenITmng4690InterdependentConflictResolutionTest>AbstractMavenIntegrationTestCase.runTest:219->testitXAD:73->testit:98
» Verification
  MavenITmng4690InterdependentConflictResolutionTest>AbstractMavenIntegrationTestCase.runTest:219->testitXDA:79->testit:98
» Verification
  MavenITmng4696MavenProjectDependencyArtifactsTest>AbstractMavenIntegrationTestCase.runTest:219->testit:58
» Verification
  MavenITmng4720DependencyManagementExclusionMergeTest>AbstractMavenIntegrationTestCase.runTest:219->testit:57
» Verification
  MavenITmng4721OptionalPluginDependencyTest>AbstractMavenIntegrationTestCase.runTest:219->testit:56
» Verification
  MavenITmng4729MirrorProxyAuthUsedByProjectBuilderTest>AbstractMavenIntegrationTestCase.runTest:219->testit:100
» Verification
  MavenITmng4747JavaAgentUsedByPluginTest>AbstractMavenIntegrationTestCase.runTest:219->testit:57
» Verification
  MavenITmng4750ResolvedMavenProjectDependencyArtifactsTest>AbstractMavenIntegrationTestCase.runTest:219->testit:58
» Verification
  MavenITmng4755FetchRemoteMetadataForVersionRangeTest>AbstractMavenIntegrationTestCase.runTest:219->testit:56
» Verification
  MavenITmng4765LocalPomProjectBuilderTest>AbstractMavenIntegrationTestCase.runTest:219->testit:54
» Verification
  MavenITmng4768NearestMatchConflictResolutionTest>AbstractMavenIntegrationTestCase.runTest:219->testitABD:47->testit:99
» Verification
  MavenITmng4768NearestMatchConflictResolutionTest>AbstractMavenIntegrationTestCase.runTest:219->testitADB:54->testit:99
» Verification
  MavenITmng4768NearestMatchConflictResolutionTest>AbstractMavenIntegrationTestCase.runTest:219->testitBAD:60->testit:99
» Verification
  MavenITmng4768NearestMatchConflictResolutionTest>AbstractMavenIntegrationTestCase.runTest:219->testitBDA:66->testit:99
» Verification
  MavenITmng4768NearestMatchConflictResolutionTest>AbstractMavenIntegrationTestCase.runTest:219->testitDAB:73->testit:99
» Verification
  MavenITmng4768NearestMatchConflictResolutionTest>AbstractMavenIntegrationTestCase.runTest:219->testitDBA:79->testit:99
» Verification
  MavenITmng4776ForkedReactorPluginVersionResolutionTest>AbstractMavenIntegrationTestCase.runTest:219->testitCmdLine:78
» Verification
  MavenITmng4776ForkedReactorPluginVersionResolutionTest>AbstractMavenIntegrationTestCase.runTest:219->testitLifecycle:56
» Verification
  MavenITmng4779MultipleDepsWithVersionRangeFromLocalRepoTest>AbstractMavenIntegrationTestCase.runTest:219->testit:55
» Verification
  MavenITmng4781DeploymentToNexusStagingRepoTest>AbstractMavenIntegrationTestCase.runTest:219->testit:136
» Verification
  MavenITmng4785TransitiveResolutionInForkedThreadTest>AbstractMavenIntegrationTestCase.runTest:219->testit:58
» Verification
  MavenITmng4786AntBased21xMojoSupportTest>AbstractMavenIntegrationTestCase.runTest:219->testit:55
» Verification
  MavenITmng4788InstallationToCustomLocalRepoTest>AbstractMavenIntegrationTestCase.runTest:219->testit:52
» Verification
  MavenITmng4789ScopeInheritanceMeetsConflictTest>AbstractMavenIntegrationTestCase.runTest:219->testit:58
» Verification
  MavenITmng4791ProjectBuilderResolvesRemotePomArtifactTest>AbstractMavenIntegrationTestCase.runTest:219->testit:58
» Verification
  MavenITmng4795DepResolutionInReactorProjectForkedByLifecycleTest>AbstractMavenIntegrationTestCase.runTest:219->testit:55
» Verification
  MavenITmng4800NearestWinsVsScopeWideningTest>AbstractMavenIntegrationTestCase.runTest:219->testitAB:45->testit:71
» Verification
  MavenITmng4800NearestWinsVsScopeWideningTest>AbstractMavenIntegrationTestCase.runTest:219->testitBA:51->testit:71
» Verification
  MavenITmng4811CustomComponentConfiguratorTest>AbstractMavenIntegrationTestCase.runTest:219->testit:51
» Verification
  MavenITmng4814ReResolutionOfDependenciesDuringReactorTest>AbstractMavenIntegrationTestCase.runTest:219->testit:62
» Verification
  MavenITmng4829ChecksumFailureWarningTest>AbstractMavenIntegrationTestCase.runTest:219->testit:57
» Verification
  MavenITmng4834ParentProjectResolvedFromRemoteReposTest>AbstractMavenIntegrationTestCase.runTest:219->testit:58
» Verification
  MavenITmng4842ParentResolutionOfDependencyPomTest>AbstractMavenIntegrationTestCase.runTest:219->testitCore:59
» Verification
  MavenITmng4842ParentResolutionOfDependencyPomTest>AbstractMavenIntegrationTestCase.runTest:219->testitPlugin:86
» Verification
  MavenITmng4872ReactorResolutionAttachedWithExclusionsTest>AbstractMavenIntegrationTestCase.runTest:219->testit:54
» Verification
  MavenITmng4874UpdateLatestPluginVersionTest>AbstractMavenIntegrationTestCase.runTest:219->testit:53
» Verification
  MavenITmng4877DeployUsingPrivateKeyTest>AbstractMavenIntegrationTestCase.runTest:219->testit:55
» Verification
  MavenITmng4890MakeLikeReactorConsidersVersionsTest>AbstractMavenIntegrationTestCase.runTest:219->testitAM:59
» Verification
  MavenITmng4890MakeLikeReactorConsidersVersionsTest>AbstractMavenIntegrationTestCase.runTest:219->testitAMD:86
» Verification
  MavenITmng4891RobustSnapshotResolutionTest>AbstractMavenIntegrationTestCase.runTest:219->testit:55
» Verification
  MavenITmng4895PluginDepWithNonRelocatedMavenApiTest>AbstractMavenIntegrationTestCase.runTest:219->testit:57
» Verification
  MavenITmng4913UserPropertyVsDependencyPomPropertyTest>AbstractMavenIntegrationTestCase.runTest:219->testit:58
» Verification
  MavenITmng4919LifecycleMappingWithSameGoalTwiceTest>AbstractMavenIntegrationTestCase.runTest:219->testit:54
» Verification
  MavenITmng4952MetadataReleaseInfoUpdateTest>AbstractMavenIntegrationTestCase.runTest:219->testit:60
» Verification
  MavenITmng4955LocalVsRemoteSnapshotResolutionTest>AbstractMavenIntegrationTestCase.runTest:219->testit:55
» Verification
  MavenITmng4960MakeLikeReactorResumeTest>AbstractMavenIntegrationTestCase.runTest:219->testitFromDownstream:90
» Verification
  MavenITmng4960MakeLikeReactorResumeTest>AbstractMavenIntegrationTestCase.runTest:219->testitFromUpstream:61
» Verification
  MavenITmng4966AbnormalUrlPreservationTest>AbstractMavenIntegrationTestCase.runTest:219->testit:53
» Verification
  MavenITmng4973ExtensionVisibleToPluginInReactorTest>AbstractMavenIntegrationTestCase.runTest:219->testit:59
» Verification
  MavenITmng4975ProfileInjectedPluginExecutionOrderTest>AbstractMavenIntegrationTestCase.runTest:219->testit:55
» Verification
  MavenITmng4987TimestampBasedSnapshotSelectionTest>AbstractMavenIntegrationTestCase.runTest:219->testit:58
» Verification
  MavenITmng4991NonProxyHostsTest>AbstractMavenIntegrationTestCase.runTest:219->testit:89
» Verification
  MavenITmng4992MapStylePropertiesParamConfigTest>AbstractMavenIntegrationTestCase.runTest:219->testit:51
» Verification
  MavenITmng5000ChildPathAwareUrlInheritanceTest>AbstractMavenIntegrationTestCase.runTest:219->testit:56
» Verification
  MavenITmng5006VersionRangeDependencyParentResolutionTest>AbstractMavenIntegrationTestCase.runTest:219->testit:60
» Verification
  MavenITmng5011ConfigureCollectionArrayFromSystemPropTest>AbstractMavenIntegrationTestCase.runTest:219->testit:53
» Verification
  MavenITmng5012CollectionVsArrayParamCoercionTest>AbstractMavenIntegrationTestCase.runTest:219->testit:51
» Verification
  MavenITmng5013ConfigureParamBeanFromScalarValueTest>AbstractMavenIntegrationTestCase.runTest:219->testit:51
» Verification
  MavenITmng5064SuppressSnapshotUpdatesTest>AbstractMavenIntegrationTestCase.runTest:219->testit:107
» Verification
  MavenITmng5096ExclusionAtDependencyWithImpliedClassifierTest>AbstractMavenIntegrationTestCase.runTest:219->testit:59
» Verification
  MavenITmng5135AggregatorDepResolutionModuleExtensionTest>AbstractMavenIntegrationTestCase.runTest:219->testit:57
» Verification
  MavenITmng5137ReactorResolutionInForkedBuildTest>AbstractMavenIntegrationTestCase.runTest:219->testit:58
» Verification
  MavenITmng5214DontMapWsdlToJar>AbstractMavenIntegrationTestCase.runTest:219->testitTestPhase:52
» Verification
  MavenITmng5224InjectedSettings>AbstractMavenIntegrationTestCase.runTest:219->testmng5224_ReadSettings:60
» Verification
  MavenITmng5227DependencyOptionalFlagManagementTest>AbstractMavenIntegrationTestCase.runTest:219->testitModel:55
» Verification
  MavenITmng5227DependencyOptionalFlagManagementTest>AbstractMavenIntegrationTestCase.runTest:219->testitResolution:80
» Verification
  MavenITmng5230MakeReactorWithExcludesTest>AbstractMavenIntegrationTestCase.runTest:219->testitMakeBothExclude:144
» Verification
  MavenITmng5230MakeReactorWithExcludesTest>AbstractMavenIntegrationTestCase.runTest:219->testitMakeDownstreamExclude:117
» Verification
  MavenITmng5230MakeReactorWithExcludesTest>AbstractMavenIntegrationTestCase.runTest:219->testitMakeUpstreamExclude:91
» Verification
  MavenITmng5230MakeReactorWithExcludesTest>AbstractMavenIntegrationTestCase.runTest:219->testitMakeWithExclude:65
» Verification
  MavenITmng5230MakeReactorWithExcludesTest>AbstractMavenIntegrationTestCase.runTest:219->testitMatchesByArtifactIdExclude:247
» Verification
  MavenITmng5230MakeReactorWithExcludesTest>AbstractMavenIntegrationTestCase.runTest:219->testitMatchesByBasedirExclamationExclude:170
» Verification
  MavenITmng5230MakeReactorWithExcludesTest>AbstractMavenIntegrationTestCase.runTest:219->testitMatchesByBasedirMinusExclude:196
» Verification
  MavenITmng5230MakeReactorWithExcludesTest>AbstractMavenIntegrationTestCase.runTest:219->testitMatchesByIdExclude:222
» Verification
  MavenITmng5230MakeReactorWithExcludesTest>AbstractMavenIntegrationTestCase.runTest:219->testitResumeFromExclude:274
» Verification
  MavenITmng5280SettingsProfilesRepositoriesOrderTest>AbstractMavenIntegrationTestCase.runTest:219->testRepositoriesOrder:102
» Verification
  MavenITmng5387ArtifactReplacementPlugin>AbstractMavenIntegrationTestCase.runTest:219->testArtifactReplacementExecution:66
» FileNotFound
  MavenITmng5445LegacyStringSearchModelInterpolatorTest>AbstractMavenIntegrationTestCase.runTest:219->testit:49
» Verification
  MavenITmng5572ReactorPluginExtensionsTest>AbstractMavenIntegrationTestCase.runTest:219->testit:55
» Verification
  MavenITmng5576CdFriendlyVersions>AbstractMavenIntegrationTestCase.runTest:219->testContinuousDeliveryFriendlyVersionsAreWarningFree:55
» Verification
  MavenITmng5608ProfileActivationWarningTest>AbstractMavenIntegrationTestCase.runTest:219->testitMNG5608:48
» Verification
  MavenITmng5663NestedImportScopePomResolutionTest>AbstractMavenIntegrationTestCase.runTest:219->testitMNG5639:57
» Verification
  MavenITmng5716ToolchainsTypeTest>AbstractMavenIntegrationTestCase.runTest:219->testitMNG5716:64
» Verification
  MavenITmng5768CliExecutionIdTest>AbstractMavenIntegrationTestCase.runTest:219->test:42
» Verification
  MavenITmng5805PkgTypeMojoConfiguration>AbstractMavenIntegrationTestCase.runTest:219->testPkgTypeMojoConfiguration:25
» Verification
  MavenITmng5958LifecyclePhaseBinaryCompat>AbstractMavenIntegrationTestCase.runTest:219->testBad:40
» Verification
  MavenITmng5958LifecyclePhaseBinaryCompat>AbstractMavenIntegrationTestCase.runTest:219->testGood:22
» Verification
  MavenITmng5971HierarchicalImportScopeTest>AbstractMavenIntegrationTestCase.runTest:219->testConflictResolution:110
» Verification
  MavenITmng5971HierarchicalImportScopeTest>AbstractMavenIntegrationTestCase.runTest:219->testInheritanceProcessing:55
» Verification
  MavenITmng5971HierarchicalImportScopeTest>AbstractMavenIntegrationTestCase.runTest:219->testOverrideProcessing:87
» Verification

Tests run: 782, Failures: 31, Errors: 523, Skipped: 0

[INFO] ------------------------------------------------------------------------
[INFO] Reactor Summary:
[INFO] 
[INFO] Maven Core ITs ..................................... SUCCESS [ 48.107 s]
[INFO] Maven IT Support ................................... SUCCESS [  1.045 s]
[INFO] Maven IT :: Plugins ................................ SUCCESS [  0.677 s]
[INFO] Maven IT Plugin :: Active Collection ............... SUCCESS [ 11.769 s]
[INFO] Maven IT Plugin :: Ant-Based ....................... SUCCESS [  5.597 s]
[INFO] Maven IT Plugin :: Artifact ........................ SUCCESS [  3.149 s]
[INFO] Maven IT Plugin :: Class Loader :: Dependency A .... SUCCESS [  0.534 s]
[INFO] Maven IT Plugin :: Class Loader :: Dependency B .... SUCCESS [  0.900 s]
[INFO] Maven IT Plugin :: Class Loader :: Dependency C .... SUCCESS [  0.481 s]
[INFO] Maven IT Plugin :: Class Loader .................... SUCCESS [  2.477 s]
[INFO] Maven IT Plugin :: Class Loader :: Aggregator ...... SUCCESS [  0.440 s]
[INFO] Maven IT Plugin :: Configuration ................... SUCCESS [  1.219 s]
[INFO] Maven IT Plugin :: Context Passing ................. SUCCESS [  0.545 s]
[INFO] Maven ITs :: Core Plugin Stubs ..................... SUCCESS [  0.458 s]
[INFO] Maven IT Clean Plugin Stub ......................... SUCCESS [  1.108 s]
[INFO] Maven IT Compiler Plugin Stub ...................... SUCCESS [  1.090 s]
[INFO] Maven IT Deploy Plugin Stub ........................ SUCCESS [  0.941 s]
[INFO] Maven IT EAR Plugin Stub ........................... SUCCESS [  0.716 s]
[INFO] Maven IT EJB Plugin Stub ........................... SUCCESS [  0.664 s]
[INFO] Maven IT Install Plugin Stub ....................... SUCCESS [  0.688 s]
[INFO] Maven IT JAR Plugin Stub ........................... SUCCESS [  0.819 s]
[INFO] Maven IT Javadoc Plugin Stub ....................... SUCCESS [  0.683 s]
[INFO] Maven IT Plugin Plugin Stub ........................ SUCCESS [  0.736 s]
[INFO] Maven IT RAR Plugin Stub ........................... SUCCESS [  0.822 s]
[INFO] Maven IT Resources Plugin Stub ..................... SUCCESS [  0.662 s]
[INFO] Maven IT Site Plugin Stub .......................... SUCCESS [  0.838 s]
[INFO] Maven IT Source Plugin Stub ........................ SUCCESS [  0.937 s]
[INFO] Maven IT Surefire Plugin Stub ...................... SUCCESS [  0.754 s]
[INFO] Maven IT WAR Plugin Stub ........................... SUCCESS [  0.827 s]
[INFO] Maven IT Plugin :: Dependency Collection ........... SUCCESS [  0.693 s]
[INFO] Maven IT Plugin :: Dependency Resolution ........... SUCCESS [  8.911 s]
[INFO] Maven IT Plugin :: Expression ...................... SUCCESS [  1.696 s]
[INFO] Maven IT Plugin :: Error Mojos ..................... SUCCESS [  3.025 s]
[INFO] Maven IT Component ................................. SUCCESS [  0.448 s]
[INFO] Maven IT Plugin :: Extension Consumer .............. SUCCESS [  0.792 s]
[INFO] Maven IT Plugin :: Extension Provider .............. SUCCESS [  0.595 s]
[INFO] Maven IT Plugin :: Fork ............................ SUCCESS [  1.132 s]
[INFO] Maven IT Plugin :: Invalid Descriptor .............. SUCCESS [  0.740 s]
[INFO] Maven IT Plugin :: Log File ........................ SUCCESS [  0.543 s]
[INFO] Maven IT Helper Library ............................ SUCCESS [  1.547 s]
[INFO] Maven IT Plugin :: Model Interpolation ............. SUCCESS [  1.358 s]
[INFO] Maven IT Plugin :: No Default Component ............ SUCCESS [  0.982 s]
[INFO] Maven IT Plugin :: No Project ...................... SUCCESS [  0.520 s]
[INFO] Maven IT Plugin :: Online .......................... SUCCESS [  0.491 s]
[INFO] Maven IT Plugin :: Optional Mojos .................. SUCCESS [  0.612 s]
[INFO] Maven IT Plugin :: Packaging ....................... SUCCESS [  0.563 s]
[INFO] Maven IT Plugin :: Parameter Implementation ........ SUCCESS [  0.529 s]
[INFO] Maven IT Plugin :: Plugin Dependency ............... SUCCESS [  0.713 s]
[INFO] Maven IT Plugin :: Project ......................... SUCCESS [  1.731 s]
[INFO] Maven IT Plugin :: Project Interpolation ........... SUCCESS [  1.241 s]
[INFO] Maven IT Plugin :: Setter .......................... SUCCESS [  0.482 s]
[INFO] Maven IT Plugin :: Singleton Component ............. SUCCESS [  0.760 s]
[INFO] Maven IT Plugin :: Site ............................ SUCCESS [  2.615 s]
[INFO] Maven IT Plugin :: Toolchain ....................... SUCCESS [  7.260 s]
[INFO] Maven IT Plugin :: Touch ........................... SUCCESS [  1.254 s]
[INFO] Maven IT Plugin :: Uses Properties Plugin .......... SUCCESS [  0.477 s]
[INFO] Maven IT Plugin :: Uses Wagon Plugin ............... SUCCESS [  5.702 s]
[INFO] Maven IT Plugin :: This plugin should contain the mojos needed by all tests. SUCCESS
[  0.798 s]
[INFO] Maven IT Plugin :: Plexus Utils 1.1 ................ SUCCESS [  1.364 s]
[INFO] Maven IT Plugin :: Plexus Utils New ................ SUCCESS [  0.721 s]
[INFO] Maven IT Plugin :: Plexus Component API ............ SUCCESS [  1.397 s]
[INFO] Maven IT Plugin :: Log4J Client .................... SUCCESS [  1.339 s]
[INFO] Maven IT Plugin :: Extension 1 ..................... SUCCESS [  0.437 s]
[INFO] Maven IT Plugin :: Extension 2 ..................... SUCCESS [  0.497 s]
[INFO] Maven IT Plugin :: Plexus Lifecycle ................ SUCCESS [  2.186 s]
[INFO] Maven IT Plugin :: Settings ........................ SUCCESS [  1.132 s]
[INFO] Maven IT Plugin :: mng-5805 extension .............. SUCCESS [  0.515 s]
[INFO] Maven IT Plugin :: mng-5805 plugin ................. SUCCESS [  0.618 s]
[INFO] Maven IT Plugin :: mng-5805 plugin-dep ............. SUCCESS [  0.418 s]
[INFO] Maven IT Plugin :: mng-5958 extension .............. SUCCESS [  6.590 s]
[INFO] Maven IT Toolchain ................................. SUCCESS [  1.921 s]
[INFO] Maven IT Wagon ..................................... SUCCESS [  0.704 s]
[INFO] Maven IT Support Artifacts ......................... SUCCESS [  2.140 s]
[INFO] Maven IT Extension ................................. SUCCESS [  0.411 s]
[INFO] Maven ITs .......................................... FAILURE [43:35 min]
[INFO] ------------------------------------------------------------------------
[INFO] BUILD FAILURE
[INFO] ------------------------------------------------------------------------
[INFO] Total time: 46:20 min
[INFO] Finished at: 2016-02-26T11:16:07-08:00
[INFO] Final Memory: 71M/742M
[INFO] ------------------------------------------------------------------------
[ERROR] Failed to execute goal org.apache.maven.plugins:maven-surefire-plugin:2.18.1:test
(default-test) on project core-it-suite: There are test failures.
[ERROR] 
[ERROR] Please refer to F:\ws\m3-its\core-integration-testing-trunk\core-it-suite\target\surefire-reports
for the individual test results.
[ERROR] -> [Help 1]
org.apache.maven.lifecycle.LifecycleExecutionException: Failed to execute goal org.apache.maven.plugins:maven-surefire-plugin:2.18.1:test
(default-test) on project core-it-suite: There are test failures.

Please refer to F:\ws\m3-its\core-integration-testing-trunk\core-it-suite\target\surefire-reports
for the individual test results.
	at org.apache.maven.lifecycle.internal.MojoExecutor.execute(MojoExecutor.java:212)
	at org.apache.maven.lifecycle.internal.MojoExecutor.execute(MojoExecutor.java:153)
	at org.apache.maven.lifecycle.internal.MojoExecutor.execute(MojoExecutor.java:145)
	at org.apache.maven.lifecycle.internal.LifecycleModuleBuilder.buildProject(LifecycleModuleBuilder.java:116)
	at org.apache.maven.lifecycle.internal.LifecycleModuleBuilder.buildProject(LifecycleModuleBuilder.java:80)
	at org.apache.maven.lifecycle.internal.builder.singlethreaded.SingleThreadedBuilder.build(SingleThreadedBuilder.java:51)
	at org.apache.maven.lifecycle.internal.LifecycleStarter.execute(LifecycleStarter.java:128)
	at org.apache.maven.DefaultMaven.doExecute(DefaultMaven.java:307)
	at org.apache.maven.DefaultMaven.doExecute(DefaultMaven.java:193)
	at org.apache.maven.DefaultMaven.execute(DefaultMaven.java:106)
	at org.apache.maven.cli.MavenCli.execute(MavenCli.java:862)
	at org.apache.maven.cli.MavenCli.doMain(MavenCli.java:286)
	at org.apache.maven.cli.MavenCli.main(MavenCli.java:197)
	at sun.reflect.NativeMethodAccessorImpl.invoke0(Native Method)
	at sun.reflect.NativeMethodAccessorImpl.invoke(NativeMethodAccessorImpl.java:57)
	at sun.reflect.DelegatingMethodAccessorImpl.invoke(DelegatingMethodAccessorImpl.java:43)
	at java.lang.reflect.Method.invoke(Method.java:601)
	at org.codehaus.plexus.classworlds.launcher.Launcher.launchEnhanced(Launcher.java:289)
	at org.codehaus.plexus.classworlds.launcher.Launcher.launch(Launcher.java:229)
	at org.codehaus.plexus.classworlds.launcher.Launcher.mainWithExitCode(Launcher.java:415)
	at org.codehaus.plexus.classworlds.launcher.Launcher.main(Launcher.java:356)
Caused by: org.apache.maven.plugin.MojoFailureException: There are test failures.

Please refer to F:\ws\m3-its\core-integration-testing-trunk\core-it-suite\target\surefire-reports
for the individual test results.
	at org.apache.maven.plugin.surefire.SurefireHelper.reportExecution(SurefireHelper.java:82)
	at org.apache.maven.plugin.surefire.SurefirePlugin.handleSummary(SurefirePlugin.java:254)
	at org.apache.maven.plugin.surefire.AbstractSurefireMojo.executeAfterPreconditionsChecked(AbstractSurefireMojo.java:854)
	at org.apache.maven.plugin.surefire.AbstractSurefireMojo.execute(AbstractSurefireMojo.java:722)
	at org.apache.maven.plugin.DefaultBuildPluginManager.executeMojo(DefaultBuildPluginManager.java:134)
	at org.apache.maven.lifecycle.internal.MojoExecutor.execute(MojoExecutor.java:208)
	... 20 more
[ERROR] 
[ERROR] Re-run Maven using the -X switch to enable full debug logging.
[ERROR] 
[ERROR] For more information about the errors and possible solutions, please read the following
articles:
[ERROR] [Help 1] http://cwiki.apache.org/confluence/display/MAVEN/MojoFailureException
[ERROR] 
[ERROR] After correcting the problems, you can resume the build with the command
[ERROR]   mvn <goals> -rf :core-it-suite
Build step 'Invoke top-level Maven targets' marked build as failure
Recording test results

Mime
View raw message