maven-notifications mailing list archives

Site index · List index
Message view « Date » · « Thread »
Top « Date » · « Thread »
From Apache Jenkins Server <jenk...@builds.apache.org>
Subject Build failed in Jenkins: core-it-maven-3-win #1141
Date Fri, 26 Feb 2016 21:25:47 GMT
See <https://builds.apache.org/job/core-it-maven-3-win/1141/changes>

Changes:

[schulte] [MNG-5984] Maven core extension resolution ignores repositories from

------------------------------------------
[...truncated 10692 lines...]
	at org.apache.maven.lifecycle.internal.MojoExecutor.execute(MojoExecutor.java:214)
	at org.apache.maven.lifecycle.internal.MojoExecutor.execute(MojoExecutor.java:155)
	at org.apache.maven.lifecycle.internal.MojoExecutor.execute(MojoExecutor.java:147)
	at org.apache.maven.lifecycle.internal.LifecycleModuleBuilder.buildProject(LifecycleModuleBuilder.java:116)
	at org.apache.maven.lifecycle.internal.LifecycleModuleBuilder.buildProject(LifecycleModuleBuilder.java:80)
	at org.apache.maven.lifecycle.internal.builder.singlethreaded.SingleThreadedBuilder.build(SingleThreadedBuilder.java:51)
	at org.apache.maven.lifecycle.internal.LifecycleStarter.execute(LifecycleStarter.java:128)
	at org.apache.maven.DefaultMaven.doExecute(DefaultMaven.java:307)
	at org.apache.maven.DefaultMaven.doExecute(DefaultMaven.java:193)
	at org.apache.maven.DefaultMaven.execute(DefaultMaven.java:106)
	at org.apache.maven.cli.MavenCli.execute(MavenCli.java:962)
	at org.apache.maven.cli.MavenCli.doMain(MavenCli.java:299)
	at org.apache.maven.cli.MavenCli.main(MavenCli.java:210)
	at sun.reflect.NativeMethodAccessorImpl.invoke0(Native Method)
	at sun.reflect.NativeMethodAccessorImpl.invoke(NativeMethodAccessorImpl.java:57)
	at sun.reflect.DelegatingMethodAccessorImpl.invoke(DelegatingMethodAccessorImpl.java:43)
	at java.lang.reflect.Method.invoke(Method.java:601)
	at org.codehaus.plexus.classworlds.launcher.Launcher.launchEnhanced(Launcher.java:289)
	at org.codehaus.plexus.classworlds.launcher.Launcher.launch(Launcher.java:229)
	at org.codehaus.plexus.classworlds.launcher.Launcher.mainWithExitCode(Launcher.java:415)
	at org.codehaus.plexus.classworlds.launcher.Launcher.main(Launcher.java:356)
Caused by: org.apache.maven.plugin.MojoExecutionException: Expected core extension component
is not available
	at org.apache.maven.its.it_core_extensions.plugin.ValidateComponentMojo.execute(ValidateComponentMojo.java:25)
	at org.apache.maven.plugin.DefaultBuildPluginManager.executeMojo(DefaultBuildPluginManager.java:134)
	at org.apache.maven.lifecycle.internal.MojoExecutor.execute(MojoExecutor.java:209)
	... 20 more
[ERROR] 
[ERROR] Re-run Maven using the -X switch to enable full debug logging.
[ERROR] 
[ERROR] For more information about the errors and possible solutions, please read the following
articles:
[ERROR] [Help 1] http://cwiki.apache.org/confluence/display/MAVEN/MojoExecutionException

	at org.apache.maven.it.Verifier.executeGoals(Verifier.java:1369)
	at org.apache.maven.it.Verifier.executeGoal(Verifier.java:1254)
	at org.apache.maven.it.Verifier.executeGoal(Verifier.java:1248)
	at org.apache.maven.it.MavenITmng5771CoreExtensionsTest.testCoreExtensionNoDescriptor(MavenITmng5771CoreExtensionsTest.java:47)

testCoreExtension(org.apache.maven.it.MavenITmng5771CoreExtensionsTest)  Time elapsed: 4.125
sec  <<< ERROR!
org.apache.maven.it.VerificationException: Exit code was non-zero: 1; command line and log
= 
<https://builds.apache.org/job/core-it-maven-3-win/ws/apache-maven-3-SNAPSHOT\bin\mvn>
--global-settings F:\ws\m3-its\core-integration-testing-trunk\core-it-suite\target\test-classes\settings.xml
-s F:\ws\m3-its\core-integration-testing-trunk\core-it-suite\target\test-classes\mng-5771-core-extensions\settings.xml
-e --batch-mode -Dmaven.repo.local=<https://builds.apache.org/job/core-it-maven-3-win/ws/it-local-repo>
validate
[INFO] Downloading: https://repo.maven.apache.org/maven2/org/apache/maven/its/it-core-extensions/maven-it-core-extensions/0.1/maven-it-core-extensions-0.1.pom
[WARNING] The POM for org.apache.maven.its.it-core-extensions:maven-it-core-extensions:jar:0.1
is missing, no dependency information available
[INFO] Downloading: https://repo.maven.apache.org/maven2/org/apache/maven/its/it-core-extensions/maven-it-core-extensions/0.1/maven-it-core-extensions-0.1.jar
[WARNING] Failed to read extensions descriptor F:\ws\m3-its\core-integration-testing-trunk\core-it-suite\target\test-classes\mng-5771-core-extensions\client\.mvn\extensions.xml:
Plugin org.apache.maven.its.it-core-extensions:maven-it-core-extensions:0.1 or one of its
dependencies could not be resolved: Could not find artifact org.apache.maven.its.it-core-extensions:maven-it-core-extensions:jar:0.1
in central (https://repo.maven.apache.org/maven2)
[INFO] Error stacktraces are turned on.
[INFO] Scanning for projects...
[INFO]                                                                         
[INFO] ------------------------------------------------------------------------
[INFO] Building Maven Integration Test :: it-core-extensions 0.1
[INFO] ------------------------------------------------------------------------
[INFO] Downloading: file:target/null/org/apache/maven/its/it-core-extensions/maven-it-plugin-core-extensions-client/0.1/maven-it-plugin-core-extensions-client-0.1.pom
[INFO] Downloading: file:///F:/ws/m3-its/core-integration-testing-trunk/core-it-suite/target/test-classes/mng-5771-core-extensions/repo/org/apache/maven/its/it-core-extensions/maven-it-plugin-core-extensions-client/0.1/maven-it-plugin-core-extensions-client-0.1.pom
[INFO] Downloaded: file:///F:/ws/m3-its/core-integration-testing-trunk/core-it-suite/target/test-classes/mng-5771-core-extensions/repo/org/apache/maven/its/it-core-extensions/maven-it-plugin-core-extensions-client/0.1/maven-it-plugin-core-extensions-client-0.1.pom
(2.2 kB)
[INFO] Downloading: file:target/null/org/apache/maven/its/it-core-extensions/maven-it-plugin-core-extensions-client/0.1/maven-it-plugin-core-extensions-client-0.1.jar
[INFO] Downloading: file:///F:/ws/m3-its/core-integration-testing-trunk/core-it-suite/target/test-classes/mng-5771-core-extensions/repo/org/apache/maven/its/it-core-extensions/maven-it-plugin-core-extensions-client/0.1/maven-it-plugin-core-extensions-client-0.1.jar
[INFO] Downloaded: file:///F:/ws/m3-its/core-integration-testing-trunk/core-it-suite/target/test-classes/mng-5771-core-extensions/repo/org/apache/maven/its/it-core-extensions/maven-it-plugin-core-extensions-client/0.1/maven-it-plugin-core-extensions-client-0.1.jar
(6.4 kB)
[INFO] 
[INFO] --- maven-it-plugin-core-extensions-client:0.1:validate-component (validate-extensions)
@ test ---
[INFO] ------------------------------------------------------------------------
[INFO] BUILD FAILURE
[INFO] ------------------------------------------------------------------------
[INFO] Total time: 0.219 s
[INFO] Finished at: 2016-02-26T12:35:22-08:00
[INFO] Final Memory: 26M/742M
[INFO] ------------------------------------------------------------------------
[ERROR] Failed to execute goal org.apache.maven.its.it-core-extensions:maven-it-plugin-core-extensions-client:0.1:validate-component
(validate-extensions) on project test: Expected core extension component is not available
-> [Help 1]
org.apache.maven.lifecycle.LifecycleExecutionException: Failed to execute goal org.apache.maven.its.it-core-extensions:maven-it-plugin-core-extensions-client:0.1:validate-component
(validate-extensions) on project test: Expected core extension component is not available
	at org.apache.maven.lifecycle.internal.MojoExecutor.execute(MojoExecutor.java:214)
	at org.apache.maven.lifecycle.internal.MojoExecutor.execute(MojoExecutor.java:155)
	at org.apache.maven.lifecycle.internal.MojoExecutor.execute(MojoExecutor.java:147)
	at org.apache.maven.lifecycle.internal.LifecycleModuleBuilder.buildProject(LifecycleModuleBuilder.java:116)
	at org.apache.maven.lifecycle.internal.LifecycleModuleBuilder.buildProject(LifecycleModuleBuilder.java:80)
	at org.apache.maven.lifecycle.internal.builder.singlethreaded.SingleThreadedBuilder.build(SingleThreadedBuilder.java:51)
	at org.apache.maven.lifecycle.internal.LifecycleStarter.execute(LifecycleStarter.java:128)
	at org.apache.maven.DefaultMaven.doExecute(DefaultMaven.java:307)
	at org.apache.maven.DefaultMaven.doExecute(DefaultMaven.java:193)
	at org.apache.maven.DefaultMaven.execute(DefaultMaven.java:106)
	at org.apache.maven.cli.MavenCli.execute(MavenCli.java:962)
	at org.apache.maven.cli.MavenCli.doMain(MavenCli.java:299)
	at org.apache.maven.cli.MavenCli.main(MavenCli.java:210)
	at sun.reflect.NativeMethodAccessorImpl.invoke0(Native Method)
	at sun.reflect.NativeMethodAccessorImpl.invoke(NativeMethodAccessorImpl.java:57)
	at sun.reflect.DelegatingMethodAccessorImpl.invoke(DelegatingMethodAccessorImpl.java:43)
	at java.lang.reflect.Method.invoke(Method.java:601)
	at org.codehaus.plexus.classworlds.launcher.Launcher.launchEnhanced(Launcher.java:289)
	at org.codehaus.plexus.classworlds.launcher.Launcher.launch(Launcher.java:229)
	at org.codehaus.plexus.classworlds.launcher.Launcher.mainWithExitCode(Launcher.java:415)
	at org.codehaus.plexus.classworlds.launcher.Launcher.main(Launcher.java:356)
Caused by: org.apache.maven.plugin.MojoExecutionException: Expected core extension component
is not available
	at org.apache.maven.its.it_core_extensions.plugin.ValidateComponentMojo.execute(ValidateComponentMojo.java:25)
	at org.apache.maven.plugin.DefaultBuildPluginManager.executeMojo(DefaultBuildPluginManager.java:134)
	at org.apache.maven.lifecycle.internal.MojoExecutor.execute(MojoExecutor.java:209)
	... 20 more
[ERROR] 
[ERROR] Re-run Maven using the -X switch to enable full debug logging.
[ERROR] 
[ERROR] For more information about the errors and possible solutions, please read the following
articles:
[ERROR] [Help 1] http://cwiki.apache.org/confluence/display/MAVEN/MojoExecutionException

	at org.apache.maven.it.Verifier.executeGoals(Verifier.java:1369)
	at org.apache.maven.it.Verifier.executeGoal(Verifier.java:1254)
	at org.apache.maven.it.Verifier.executeGoal(Verifier.java:1248)
	at org.apache.maven.it.MavenITmng5771CoreExtensionsTest.testCoreExtension(MavenITmng5771CoreExtensionsTest.java:29)


Results :

Failed tests: 
  MavenITmng5774ConfigurationProcessorsTest>AbstractMavenIntegrationTestCase.runTest:219->testBehaviourWhereThereAreTwoUserSuppliedConfigurationProcessor:56
We expected this invocation to fail because of too many user supplied configuration processors
being present
Tests in error: 
  MavenITmng5771CoreExtensionsTest>AbstractMavenIntegrationTestCase.runTest:219->testCoreExtension:29
» Verification
  MavenITmng5771CoreExtensionsTest>AbstractMavenIntegrationTestCase.runTest:219->testCoreExtensionNoDescriptor:47
» Verification
  MavenITmng5774ConfigurationProcessorsTest>AbstractMavenIntegrationTestCase.runTest:219->testBehaviourWhereThereIsOneUserSuppliedConfigurationProcessor:32
» Verification

Tests run: 782, Failures: 1, Errors: 3, Skipped: 0

[INFO] ------------------------------------------------------------------------
[INFO] Reactor Summary:
[INFO] 
[INFO] Maven Core ITs ..................................... SUCCESS [ 48.390 s]
[INFO] Maven IT Support ................................... SUCCESS [  1.672 s]
[INFO] Maven IT :: Plugins ................................ SUCCESS [  0.735 s]
[INFO] Maven IT Plugin :: Active Collection ............... SUCCESS [ 11.453 s]
[INFO] Maven IT Plugin :: Ant-Based ....................... SUCCESS [  5.797 s]
[INFO] Maven IT Plugin :: Artifact ........................ SUCCESS [  3.437 s]
[INFO] Maven IT Plugin :: Class Loader :: Dependency A .... SUCCESS [  0.547 s]
[INFO] Maven IT Plugin :: Class Loader :: Dependency B .... SUCCESS [  0.891 s]
[INFO] Maven IT Plugin :: Class Loader :: Dependency C .... SUCCESS [  0.468 s]
[INFO] Maven IT Plugin :: Class Loader .................... SUCCESS [  2.625 s]
[INFO] Maven IT Plugin :: Class Loader :: Aggregator ...... SUCCESS [  0.422 s]
[INFO] Maven IT Plugin :: Configuration ................... SUCCESS [  1.172 s]
[INFO] Maven IT Plugin :: Context Passing ................. SUCCESS [  0.516 s]
[INFO] Maven ITs :: Core Plugin Stubs ..................... SUCCESS [  0.422 s]
[INFO] Maven IT Clean Plugin Stub ......................... SUCCESS [  1.234 s]
[INFO] Maven IT Compiler Plugin Stub ...................... SUCCESS [  1.234 s]
[INFO] Maven IT Deploy Plugin Stub ........................ SUCCESS [  0.953 s]
[INFO] Maven IT EAR Plugin Stub ........................... SUCCESS [  0.813 s]
[INFO] Maven IT EJB Plugin Stub ........................... SUCCESS [  0.594 s]
[INFO] Maven IT Install Plugin Stub ....................... SUCCESS [  0.640 s]
[INFO] Maven IT JAR Plugin Stub ........................... SUCCESS [  0.766 s]
[INFO] Maven IT Javadoc Plugin Stub ....................... SUCCESS [  0.750 s]
[INFO] Maven IT Plugin Plugin Stub ........................ SUCCESS [  0.719 s]
[INFO] Maven IT RAR Plugin Stub ........................... SUCCESS [  0.718 s]
[INFO] Maven IT Resources Plugin Stub ..................... SUCCESS [  0.641 s]
[INFO] Maven IT Site Plugin Stub .......................... SUCCESS [  0.875 s]
[INFO] Maven IT Source Plugin Stub ........................ SUCCESS [  0.906 s]
[INFO] Maven IT Surefire Plugin Stub ...................... SUCCESS [  0.703 s]
[INFO] Maven IT WAR Plugin Stub ........................... SUCCESS [  0.891 s]
[INFO] Maven IT Plugin :: Dependency Collection ........... SUCCESS [  0.703 s]
[INFO] Maven IT Plugin :: Dependency Resolution ........... SUCCESS [  9.469 s]
[INFO] Maven IT Plugin :: Expression ...................... SUCCESS [  1.500 s]
[INFO] Maven IT Plugin :: Error Mojos ..................... SUCCESS [  2.953 s]
[INFO] Maven IT Component ................................. SUCCESS [  0.594 s]
[INFO] Maven IT Plugin :: Extension Consumer .............. SUCCESS [  0.781 s]
[INFO] Maven IT Plugin :: Extension Provider .............. SUCCESS [  0.578 s]
[INFO] Maven IT Plugin :: Fork ............................ SUCCESS [  0.703 s]
[INFO] Maven IT Plugin :: Invalid Descriptor .............. SUCCESS [  0.766 s]
[INFO] Maven IT Plugin :: Log File ........................ SUCCESS [  0.516 s]
[INFO] Maven IT Helper Library ............................ SUCCESS [  1.703 s]
[INFO] Maven IT Plugin :: Model Interpolation ............. SUCCESS [  0.984 s]
[INFO] Maven IT Plugin :: No Default Component ............ SUCCESS [  0.547 s]
[INFO] Maven IT Plugin :: No Project ...................... SUCCESS [  0.484 s]
[INFO] Maven IT Plugin :: Online .......................... SUCCESS [  0.500 s]
[INFO] Maven IT Plugin :: Optional Mojos .................. SUCCESS [  0.610 s]
[INFO] Maven IT Plugin :: Packaging ....................... SUCCESS [  0.562 s]
[INFO] Maven IT Plugin :: Parameter Implementation ........ SUCCESS [  0.516 s]
[INFO] Maven IT Plugin :: Plugin Dependency ............... SUCCESS [  0.687 s]
[INFO] Maven IT Plugin :: Project ......................... SUCCESS [  1.735 s]
[INFO] Maven IT Plugin :: Project Interpolation ........... SUCCESS [  0.843 s]
[INFO] Maven IT Plugin :: Setter .......................... SUCCESS [  0.516 s]
[INFO] Maven IT Plugin :: Singleton Component ............. SUCCESS [  0.953 s]
[INFO] Maven IT Plugin :: Site ............................ SUCCESS [  2.531 s]
[INFO] Maven IT Plugin :: Toolchain ....................... SUCCESS [  7.438 s]
[INFO] Maven IT Plugin :: Touch ........................... SUCCESS [  1.016 s]
[INFO] Maven IT Plugin :: Uses Properties Plugin .......... SUCCESS [  0.515 s]
[INFO] Maven IT Plugin :: Uses Wagon Plugin ............... SUCCESS [  5.813 s]
[INFO] Maven IT Plugin :: This plugin should contain the mojos needed by all tests. SUCCESS
[  0.672 s]
[INFO] Maven IT Plugin :: Plexus Utils 1.1 ................ SUCCESS [  1.265 s]
[INFO] Maven IT Plugin :: Plexus Utils New ................ SUCCESS [  0.625 s]
[INFO] Maven IT Plugin :: Plexus Component API ............ SUCCESS [  1.610 s]
[INFO] Maven IT Plugin :: Log4J Client .................... SUCCESS [  1.203 s]
[INFO] Maven IT Plugin :: Extension 1 ..................... SUCCESS [  0.406 s]
[INFO] Maven IT Plugin :: Extension 2 ..................... SUCCESS [  0.906 s]
[INFO] Maven IT Plugin :: Plexus Lifecycle ................ SUCCESS [  1.922 s]
[INFO] Maven IT Plugin :: Settings ........................ SUCCESS [  0.609 s]
[INFO] Maven IT Plugin :: mng-5805 extension .............. SUCCESS [  0.391 s]
[INFO] Maven IT Plugin :: mng-5805 plugin ................. SUCCESS [  0.656 s]
[INFO] Maven IT Plugin :: mng-5805 plugin-dep ............. SUCCESS [  0.516 s]
[INFO] Maven IT Plugin :: mng-5958 extension .............. SUCCESS [  7.437 s]
[INFO] Maven IT Toolchain ................................. SUCCESS [  1.485 s]
[INFO] Maven IT Wagon ..................................... SUCCESS [  0.781 s]
[INFO] Maven IT Support Artifacts ......................... SUCCESS [  2.313 s]
[INFO] Maven IT Extension ................................. SUCCESS [  0.531 s]
[INFO] Maven ITs .......................................... FAILURE [53:06 min]
[INFO] ------------------------------------------------------------------------
[INFO] BUILD FAILURE
[INFO] ------------------------------------------------------------------------
[INFO] Total time: 55:53 min
[INFO] Finished at: 2016-02-26T13:25:23-08:00
[INFO] Final Memory: 62M/742M
[INFO] ------------------------------------------------------------------------
[ERROR] Failed to execute goal org.apache.maven.plugins:maven-surefire-plugin:2.18.1:test
(default-test) on project core-it-suite: There are test failures.
[ERROR] 
[ERROR] Please refer to F:\ws\m3-its\core-integration-testing-trunk\core-it-suite\target\surefire-reports
for the individual test results.
[ERROR] -> [Help 1]
org.apache.maven.lifecycle.LifecycleExecutionException: Failed to execute goal org.apache.maven.plugins:maven-surefire-plugin:2.18.1:test
(default-test) on project core-it-suite: There are test failures.

Please refer to F:\ws\m3-its\core-integration-testing-trunk\core-it-suite\target\surefire-reports
for the individual test results.
	at org.apache.maven.lifecycle.internal.MojoExecutor.execute(MojoExecutor.java:212)
	at org.apache.maven.lifecycle.internal.MojoExecutor.execute(MojoExecutor.java:153)
	at org.apache.maven.lifecycle.internal.MojoExecutor.execute(MojoExecutor.java:145)
	at org.apache.maven.lifecycle.internal.LifecycleModuleBuilder.buildProject(LifecycleModuleBuilder.java:116)
	at org.apache.maven.lifecycle.internal.LifecycleModuleBuilder.buildProject(LifecycleModuleBuilder.java:80)
	at org.apache.maven.lifecycle.internal.builder.singlethreaded.SingleThreadedBuilder.build(SingleThreadedBuilder.java:51)
	at org.apache.maven.lifecycle.internal.LifecycleStarter.execute(LifecycleStarter.java:128)
	at org.apache.maven.DefaultMaven.doExecute(DefaultMaven.java:307)
	at org.apache.maven.DefaultMaven.doExecute(DefaultMaven.java:193)
	at org.apache.maven.DefaultMaven.execute(DefaultMaven.java:106)
	at org.apache.maven.cli.MavenCli.execute(MavenCli.java:862)
	at org.apache.maven.cli.MavenCli.doMain(MavenCli.java:286)
	at org.apache.maven.cli.MavenCli.main(MavenCli.java:197)
	at sun.reflect.NativeMethodAccessorImpl.invoke0(Native Method)
	at sun.reflect.NativeMethodAccessorImpl.invoke(NativeMethodAccessorImpl.java:57)
	at sun.reflect.DelegatingMethodAccessorImpl.invoke(DelegatingMethodAccessorImpl.java:43)
	at java.lang.reflect.Method.invoke(Method.java:601)
	at org.codehaus.plexus.classworlds.launcher.Launcher.launchEnhanced(Launcher.java:289)
	at org.codehaus.plexus.classworlds.launcher.Launcher.launch(Launcher.java:229)
	at org.codehaus.plexus.classworlds.launcher.Launcher.mainWithExitCode(Launcher.java:415)
	at org.codehaus.plexus.classworlds.launcher.Launcher.main(Launcher.java:356)
Caused by: org.apache.maven.plugin.MojoFailureException: There are test failures.

Please refer to F:\ws\m3-its\core-integration-testing-trunk\core-it-suite\target\surefire-reports
for the individual test results.
	at org.apache.maven.plugin.surefire.SurefireHelper.reportExecution(SurefireHelper.java:82)
	at org.apache.maven.plugin.surefire.SurefirePlugin.handleSummary(SurefirePlugin.java:254)
	at org.apache.maven.plugin.surefire.AbstractSurefireMojo.executeAfterPreconditionsChecked(AbstractSurefireMojo.java:854)
	at org.apache.maven.plugin.surefire.AbstractSurefireMojo.execute(AbstractSurefireMojo.java:722)
	at org.apache.maven.plugin.DefaultBuildPluginManager.executeMojo(DefaultBuildPluginManager.java:134)
	at org.apache.maven.lifecycle.internal.MojoExecutor.execute(MojoExecutor.java:208)
	... 20 more
[ERROR] 
[ERROR] Re-run Maven using the -X switch to enable full debug logging.
[ERROR] 
[ERROR] For more information about the errors and possible solutions, please read the following
articles:
[ERROR] [Help 1] http://cwiki.apache.org/confluence/display/MAVEN/MojoFailureException
[ERROR] 
[ERROR] After correcting the problems, you can resume the build with the command
[ERROR]   mvn <goals> -rf :core-it-suite
Build step 'Invoke top-level Maven targets' marked build as failure
Recording test results

Mime
View raw message