maven-notifications mailing list archives

Site index · List index
Message view « Date » · « Thread »
Top « Date » · « Thread »
From Apache Jenkins Server <jenk...@builds.apache.org>
Subject Build failed in Jenkins: maven-plugins #6264
Date Fri, 03 Jun 2016 22:22:40 GMT
See <https://builds.apache.org/job/maven-plugins/6264/changes>

Changes:

[khmarbaise] [MINSTALL-123] Upgrade maven-shared-utils to 3.0.1

------------------------------------------
[...truncated 21922 lines...]
A         maven-deploy-plugin/src/it/no-main-artifact-1/invoker.properties
A         maven-deploy-plugin/src/it/no-main-artifact-1/verify.groovy
AU        maven-deploy-plugin/src/it/no-main-artifact-1/pom.xml
AU        maven-deploy-plugin/src/it/no-main-artifact-1/setup.bsh
A         maven-deploy-plugin/src/it/deploy-attached-sources
AU        maven-deploy-plugin/src/it/deploy-attached-sources/pom.xml
AU        maven-deploy-plugin/src/it/deploy-attached-sources/test.properties
AU        maven-deploy-plugin/src/it/deploy-attached-sources/setup.bsh
AU        maven-deploy-plugin/src/it/deploy-attached-sources/verify.bsh
A         maven-deploy-plugin/src/it/deploy-attached-sources/src
A         maven-deploy-plugin/src/it/deploy-attached-sources/src/main
A         maven-deploy-plugin/src/it/deploy-attached-sources/src/main/java
A         maven-deploy-plugin/src/it/deploy-attached-sources/src/main/java/org
A         maven-deploy-plugin/src/it/deploy-attached-sources/src/main/java/org/apache
A         maven-deploy-plugin/src/it/deploy-attached-sources/src/main/java/org/apache/maven
A         maven-deploy-plugin/src/it/deploy-attached-sources/src/main/java/org/apache/maven/test
AU        maven-deploy-plugin/src/it/deploy-attached-sources/src/main/java/org/apache/maven/test/HelloWorld.java
A         maven-deploy-plugin/src/it/deploy-attached-sources/src/main/resources
AU        maven-deploy-plugin/src/it/deploy-attached-sources/src/main/resources/foo.txt
AU        maven-deploy-plugin/src/it/deploy-attached-sources/invoker.properties
A         maven-deploy-plugin/src/it/MDEPLOY-169_deploy-at-end-multithread
A         maven-deploy-plugin/src/it/MDEPLOY-169_deploy-at-end-multithread/pom.xml
A         maven-deploy-plugin/src/it/MDEPLOY-169_deploy-at-end-multithread/module1
A         maven-deploy-plugin/src/it/MDEPLOY-169_deploy-at-end-multithread/module1/pom.xml
A         maven-deploy-plugin/src/it/MDEPLOY-169_deploy-at-end-multithread/module2
A         maven-deploy-plugin/src/it/MDEPLOY-169_deploy-at-end-multithread/module2/pom.xml
A         maven-deploy-plugin/src/it/MDEPLOY-169_deploy-at-end-multithread/invoker.properties
A         maven-deploy-plugin/src/it/MDEPLOY-169_deploy-at-end-multithread/verify.groovy
A         maven-deploy-plugin/src/it/no-main-artifact-2
A         maven-deploy-plugin/src/it/no-main-artifact-2/invoker.properties
A         maven-deploy-plugin/src/it/no-main-artifact-2/verify.groovy
AU        maven-deploy-plugin/src/it/no-main-artifact-2/pom.xml
AU        maven-deploy-plugin/src/it/no-main-artifact-2/setup.bsh
A         maven-deploy-plugin/src/it/snapshot-pom
AU        maven-deploy-plugin/src/it/snapshot-pom/pom.xml
AU        maven-deploy-plugin/src/it/snapshot-pom/setup.bsh
AU        maven-deploy-plugin/src/it/snapshot-pom/verify.bsh
A         maven-deploy-plugin/src/it/alt-deploy-repo-with-dist-mgmt
AU        maven-deploy-plugin/src/it/alt-deploy-repo-with-dist-mgmt/pom.xml
AU        maven-deploy-plugin/src/it/alt-deploy-repo-with-dist-mgmt/test.properties
AU        maven-deploy-plugin/src/it/alt-deploy-repo-with-dist-mgmt/setup.bsh
AU        maven-deploy-plugin/src/it/alt-deploy-repo-with-dist-mgmt/verify.bsh
A         maven-deploy-plugin/src/it/3rd-party-jar-without-pom
AU        maven-deploy-plugin/src/it/3rd-party-jar-without-pom/test-0.1.jar
AU        maven-deploy-plugin/src/it/3rd-party-jar-without-pom/invoker.properties
AU        maven-deploy-plugin/src/it/3rd-party-jar-without-pom/pom.xml
AU        maven-deploy-plugin/src/it/3rd-party-jar-without-pom/test.properties
AU        maven-deploy-plugin/src/it/3rd-party-jar-without-pom/setup.bsh
AU        maven-deploy-plugin/src/it/3rd-party-jar-without-pom/verify.bsh
A         maven-deploy-plugin/src/it/release-jar
AU        maven-deploy-plugin/src/it/release-jar/pom.xml
AU        maven-deploy-plugin/src/it/release-jar/setup.bsh
AU        maven-deploy-plugin/src/it/release-jar/verify.bsh
A         maven-deploy-plugin/src/it/MDEPLOY-178_deployfile-with-embedded-pom
A         maven-deploy-plugin/src/it/MDEPLOY-178_deployfile-with-embedded-pom/invoker.properties
A         maven-deploy-plugin/src/it/MDEPLOY-178_deployfile-with-embedded-pom/verify.groovy
A         maven-deploy-plugin/src/it/MDEPLOY-178_deployfile-with-embedded-pom/pom.xml
A         maven-deploy-plugin/src/it/MDEPLOY-178_deployfile-with-embedded-pom/test.properties
A         maven-deploy-plugin/src/it/attach-release-jar
AU        maven-deploy-plugin/src/it/attach-release-jar/pom.xml
AU        maven-deploy-plugin/src/it/attach-release-jar/setup.bsh
AU        maven-deploy-plugin/src/it/attach-release-jar/verify.bsh
A         maven-deploy-plugin/src/it/MDEPLOY-184_deployfile-with-javadoc-and-sources
A         maven-deploy-plugin/src/it/MDEPLOY-184_deployfile-with-javadoc-and-sources/invoker.properties
A         maven-deploy-plugin/src/it/MDEPLOY-184_deployfile-with-javadoc-and-sources/verify.groovy
A         maven-deploy-plugin/src/it/MDEPLOY-184_deployfile-with-javadoc-and-sources/test.properties
A         maven-deploy-plugin/src/it/MDEPLOY-184_deployfile-with-javadoc-and-sources/path
A         maven-deploy-plugin/src/it/MDEPLOY-184_deployfile-with-javadoc-and-sources/path/to
AU        maven-deploy-plugin/src/it/MDEPLOY-184_deployfile-with-javadoc-and-sources/path/to/artifact-name-1.0.jar
AU        maven-deploy-plugin/src/it/MDEPLOY-184_deployfile-with-javadoc-and-sources/path/to/artifact-name-1.0-sources.jar
AU        maven-deploy-plugin/src/it/MDEPLOY-184_deployfile-with-javadoc-and-sources/path/to/artifact-name-1.0-javadoc.jar
A         maven-deploy-plugin/src/it/MDEPLOY-184_deployfile-with-javadoc-and-sources/path/to/pom.xml
AU        maven-deploy-plugin/src/it/settings.xml
A         maven-deploy-plugin/src/it/deploy-default-packaging
AU        maven-deploy-plugin/src/it/deploy-default-packaging/verify.bsh
A         maven-deploy-plugin/src/it/deploy-default-packaging/lib
AU        maven-deploy-plugin/src/it/deploy-default-packaging/lib/test-1.1.jar
AU        maven-deploy-plugin/src/it/deploy-default-packaging/invoker.properties
AU        maven-deploy-plugin/src/it/deploy-default-packaging/pom.xml
AU        maven-deploy-plugin/src/it/deploy-default-packaging/test.properties
AU        maven-deploy-plugin/src/it/deploy-default-packaging/setup.bsh
A         maven-deploy-plugin/src/it/MDEPLOY-170_deploy-at-end-configperproject
A         maven-deploy-plugin/src/it/MDEPLOY-170_deploy-at-end-configperproject/verify.groovy
A         maven-deploy-plugin/src/it/MDEPLOY-170_deploy-at-end-configperproject/pom.xml
A         maven-deploy-plugin/src/it/MDEPLOY-170_deploy-at-end-configperproject/module1
A         maven-deploy-plugin/src/it/MDEPLOY-170_deploy-at-end-configperproject/module1/pom.xml
A         maven-deploy-plugin/src/it/MDEPLOY-170_deploy-at-end-configperproject/module2
A         maven-deploy-plugin/src/it/MDEPLOY-170_deploy-at-end-configperproject/module2/pom.xml
A         maven-deploy-plugin/src/it/non-default-pom
AU        maven-deploy-plugin/src/it/non-default-pom/non-default-pom.xml
AU        maven-deploy-plugin/src/it/non-default-pom/setup.bsh
AU        maven-deploy-plugin/src/it/non-default-pom/verify.bsh
A         maven-deploy-plugin/src/it/gav-validation
AU        maven-deploy-plugin/src/it/gav-validation/verify.bsh
AU        maven-deploy-plugin/src/it/gav-validation/invoker.properties
AU        maven-deploy-plugin/src/it/gav-validation/pom.xml
AU        maven-deploy-plugin/src/it/gav-validation/test.jar
AU        maven-deploy-plugin/src/it/gav-validation/test.properties
AU        maven-deploy-plugin/src/it/gav-validation/setup.bsh
A         maven-deploy-plugin/src/it/skip
AU        maven-deploy-plugin/src/it/skip/pom.xml
AU        maven-deploy-plugin/src/it/skip/setup.bsh
A         maven-deploy-plugin/src/it/deploy-at-end-pass
A         maven-deploy-plugin/src/it/deploy-at-end-pass/module1
AU        maven-deploy-plugin/src/it/deploy-at-end-pass/module1/pom.xml
AU        maven-deploy-plugin/src/it/deploy-at-end-pass/verify.groovy
AU        maven-deploy-plugin/src/it/deploy-at-end-pass/pom.xml
A         maven-deploy-plugin/src/it/snapshot-jar
AU        maven-deploy-plugin/src/it/snapshot-jar/pom.xml
AU        maven-deploy-plugin/src/it/snapshot-jar/setup.bsh
AU        maven-deploy-plugin/src/it/snapshot-jar/verify.bsh
A         maven-deploy-plugin/src/it/release-pom
AU        maven-deploy-plugin/src/it/release-pom/pom.xml
AU        maven-deploy-plugin/src/it/release-pom/setup.bsh
AU        maven-deploy-plugin/src/it/release-pom/verify.bsh
A         maven-deploy-plugin/src/it/external-release-jar
AU        maven-deploy-plugin/src/it/external-release-jar/pom.xml
AU        maven-deploy-plugin/src/it/external-release-jar/test.properties
AU        maven-deploy-plugin/src/it/external-release-jar/setup.bsh
AU        maven-deploy-plugin/src/it/external-release-jar/verify.bsh
AU        maven-deploy-plugin/src/it/external-release-jar/test-0.1.pom
AU        maven-deploy-plugin/src/it/external-release-jar/test-0.1.jar
AU        maven-deploy-plugin/src/it/external-release-jar/invoker.properties
A         maven-deploy-plugin/src/test
A         maven-deploy-plugin/src/test/java
A         maven-deploy-plugin/src/test/java/org
A         maven-deploy-plugin/src/test/java/org/apache
A         maven-deploy-plugin/src/test/java/org/apache/maven
A         maven-deploy-plugin/src/test/java/org/apache/maven/plugins
A         maven-deploy-plugin/src/test/java/org/apache/maven/plugins/deploy
A         maven-deploy-plugin/src/test/java/org/apache/maven/plugins/deploy/stubs
AU        maven-deploy-plugin/src/test/java/org/apache/maven/plugins/deploy/stubs/ArtifactRepositoryStub.java
AU        maven-deploy-plugin/src/test/java/org/apache/maven/plugins/deploy/stubs/MavenProjectStub.java
AU        maven-deploy-plugin/src/test/java/org/apache/maven/plugins/deploy/stubs/ArtifactRepositoryStub2.java
AU        maven-deploy-plugin/src/test/java/org/apache/maven/plugins/deploy/stubs/ArtifactDeployerStub.java
AU        maven-deploy-plugin/src/test/java/org/apache/maven/plugins/deploy/stubs/DeployArtifactStub.java
AU        maven-deploy-plugin/src/test/java/org/apache/maven/plugins/deploy/stubs/AttachedArtifactStub.java
AU        maven-deploy-plugin/src/test/java/org/apache/maven/plugins/deploy/DeployFileMojoTest.java
AU        maven-deploy-plugin/src/test/java/org/apache/maven/plugins/deploy/DeployFileMojoUnitTest.java
AU        maven-deploy-plugin/src/test/java/org/apache/maven/plugins/deploy/DeployMojoTest.java
A         maven-deploy-plugin/src/test/resources
A         maven-deploy-plugin/src/test/resources/unit
A         maven-deploy-plugin/src/test/resources/unit/deploy-file-legacy-repository-layout
AU        maven-deploy-plugin/src/test/resources/unit/deploy-file-legacy-repository-layout/plugin-config.xml
A         maven-deploy-plugin/src/test/resources/unit/deploy-file-legacy-repository-layout/target
AU        maven-deploy-plugin/src/test/resources/unit/deploy-file-legacy-repository-layout/target/deploy-test-file-1.0-SNAPSHOT.jar
A         maven-deploy-plugin/src/test/resources/unit/basic-deploy-pom
AU        maven-deploy-plugin/src/test/resources/unit/basic-deploy-pom/plugin-config.xml
A         maven-deploy-plugin/src/test/resources/unit/basic-deploy-pom/target
A         maven-deploy-plugin/src/test/resources/unit/basic-deploy-pom/target/deploy-test-file-1.0-SNAPSHOT.pom
A         maven-deploy-plugin/src/test/resources/unit/deploy-file-test
A         maven-deploy-plugin/src/test/resources/unit/deploy-file-test/target
AU        maven-deploy-plugin/src/test/resources/unit/deploy-file-test/target/deploy-test-file-1.0-SNAPSHOT.jar
AU        maven-deploy-plugin/src/test/resources/unit/deploy-file-test/plugin-config.xml
A         maven-deploy-plugin/src/test/resources/unit/basic-deploy-test
A         maven-deploy-plugin/src/test/resources/unit/basic-deploy-test/plugin-config.xml
A         maven-deploy-plugin/src/test/resources/unit/basic-deploy-test/target
AU        maven-deploy-plugin/src/test/resources/unit/basic-deploy-test/target/deploy-test-file-1.0-SNAPSHOT.jar
A         maven-deploy-plugin/src/test/resources/unit/deploy-file-classifier
A         maven-deploy-plugin/src/test/resources/unit/deploy-file-classifier/target
AU        maven-deploy-plugin/src/test/resources/unit/deploy-file-classifier/target/deploy-test-file-1.0-SNAPSHOT.jar
AU        maven-deploy-plugin/src/test/resources/unit/deploy-file-classifier/plugin-config.xml
A         maven-deploy-plugin/src/test/resources/unit/deploy-file-artifact-not-jar
A         maven-deploy-plugin/src/test/resources/unit/deploy-file-artifact-not-jar/target
AU        maven-deploy-plugin/src/test/resources/unit/deploy-file-artifact-not-jar/target/deploy-test-file.zip
AU        maven-deploy-plugin/src/test/resources/unit/deploy-file-artifact-not-jar/plugin-config.xml
A         maven-deploy-plugin/src/test/resources/unit/basic-deploy-with-attached-artifacts
A         maven-deploy-plugin/src/test/resources/unit/basic-deploy-with-attached-artifacts/target
AU        maven-deploy-plugin/src/test/resources/unit/basic-deploy-with-attached-artifacts/target/deploy-test-file-1.0-SNAPSHOT.jar
AU        maven-deploy-plugin/src/test/resources/unit/basic-deploy-with-attached-artifacts/plugin-config.xml
A         maven-deploy-plugin/src/test/resources/unit/basic-deploy-scp
A         maven-deploy-plugin/src/test/resources/unit/basic-deploy-scp/target
AU        maven-deploy-plugin/src/test/resources/unit/basic-deploy-scp/target/deploy-test-file-1.0-SNAPSHOT.jar
AU        maven-deploy-plugin/src/test/resources/unit/basic-deploy-scp/plugin-config.xml
A         maven-deploy-plugin/src/test/resources/unit/deploy-file-pom-file
A         maven-deploy-plugin/src/test/resources/unit/deploy-file-pom-file/target
AU        maven-deploy-plugin/src/test/resources/unit/deploy-file-pom-file/target/deploy-test-file-1.0-SNAPSHOT.jar
A         maven-deploy-plugin/src/test/resources/unit/deploy-file-pom-file/plugin-config.xml
AU        maven-deploy-plugin/pom.xml
 U        .
At revision 1746776

Parsing POMs
ERROR: Failed to parse POMs
java.io.IOException: remote file operation failed: <https://builds.apache.org/job/maven-plugins/ws/>
at hudson.remoting.Channel@4f320595:jenkins-test-fc7: hudson.remoting.ProxyException: hudson.maven.MavenModuleSetBuild$MavenExecutionException:
hudson.maven.MavenEmbedderException: 1 problem was encountered while building the effective
settings
[FATAL] Non-parseable settings /home/jenkins/.m2/settings.xml: unexpected character in markup
% (position: START_TAG seen ...</username>\n     <password><%... @14:18)  @
/home/jenkins/.m2/settings.xml, line 14, column 18

	at hudson.FilePath.act(FilePath.java:986)
	at hudson.FilePath.act(FilePath.java:968)
	at hudson.maven.MavenModuleSetBuild$MavenModuleSetBuildExecution.parsePoms(MavenModuleSetBuild.java:960)
	at hudson.maven.MavenModuleSetBuild$MavenModuleSetBuildExecution.doRun(MavenModuleSetBuild.java:679)
	at hudson.model.AbstractBuild$AbstractBuildExecution.run(AbstractBuild.java:534)
	at hudson.model.Run.execute(Run.java:1738)
	at hudson.maven.MavenModuleSetBuild.run(MavenModuleSetBuild.java:531)
	at hudson.model.ResourceController.execute(ResourceController.java:98)
	at hudson.model.Executor.run(Executor.java:410)
Caused by: hudson.remoting.ProxyException: hudson.maven.MavenModuleSetBuild$MavenExecutionException:
hudson.maven.MavenEmbedderException: 1 problem was encountered while building the effective
settings
[FATAL] Non-parseable settings /home/jenkins/.m2/settings.xml: unexpected character in markup
% (position: START_TAG seen ...</username>\n     <password><%... @14:18)  @
/home/jenkins/.m2/settings.xml, line 14, column 18

	at hudson.maven.MavenModuleSetBuild$PomParser.invoke(MavenModuleSetBuild.java:1362)
	at hudson.maven.MavenModuleSetBuild$PomParser.invoke(MavenModuleSetBuild.java:1098)
	at hudson.FilePath$FileCallableWrapper.call(FilePath.java:2719)
	at hudson.remoting.UserRequest.perform(UserRequest.java:120)
	at hudson.remoting.UserRequest.perform(UserRequest.java:48)
	at hudson.remoting.Request$2.run(Request.java:326)
	at hudson.remoting.InterceptingExecutorService$1.call(InterceptingExecutorService.java:68)
	at java.util.concurrent.FutureTask.run(FutureTask.java:262)
	at java.util.concurrent.ThreadPoolExecutor.runWorker(ThreadPoolExecutor.java:1145)
	at java.util.concurrent.ThreadPoolExecutor$Worker.run(ThreadPoolExecutor.java:615)
	at java.lang.Thread.run(Thread.java:745)
	at ......remote call to jenkins-test-fc7(Native Method)
	at hudson.remoting.Channel.attachCallSiteStackTrace(Channel.java:1416)
	at hudson.remoting.UserResponse.retrieve(UserRequest.java:220)
	at hudson.remoting.Channel.call(Channel.java:781)
	at hudson.FilePath.act(FilePath.java:979)
	... 8 more
Caused by: hudson.remoting.ProxyException: hudson.maven.MavenEmbedderException: 1 problem
was encountered while building the effective settings
[FATAL] Non-parseable settings /home/jenkins/.m2/settings.xml: unexpected character in markup
% (position: START_TAG seen ...</username>\n     <password><%... @14:18)  @
/home/jenkins/.m2/settings.xml, line 14, column 18

	at hudson.maven.MavenEmbedder.<init>(MavenEmbedder.java:128)
	at hudson.maven.MavenEmbedder.<init>(MavenEmbedder.java:109)
	at hudson.maven.MavenEmbedder.<init>(MavenEmbedder.java:136)
	at hudson.maven.MavenUtil.createEmbedder(MavenUtil.java:212)
	at hudson.maven.MavenModuleSetBuild$PomParser.invoke(MavenModuleSetBuild.java:1295)
	at hudson.maven.MavenModuleSetBuild$PomParser.invoke(MavenModuleSetBuild.java:1098)
	at hudson.FilePath$FileCallableWrapper.call(FilePath.java:2719)
	at hudson.remoting.UserRequest.perform(UserRequest.java:120)
	at hudson.remoting.UserRequest.perform(UserRequest.java:48)
	at hudson.remoting.Request$2.run(Request.java:326)
	at hudson.remoting.InterceptingExecutorService$1.call(InterceptingExecutorService.java:68)
	at java.util.concurrent.FutureTask.run(FutureTask.java:262)
	at java.util.concurrent.ThreadPoolExecutor.runWorker(ThreadPoolExecutor.java:1145)
	at java.util.concurrent.ThreadPoolExecutor$Worker.run(ThreadPoolExecutor.java:615)
	at java.lang.Thread.run(Thread.java:745)
Caused by: hudson.remoting.ProxyException: hudson.maven.MavenEmbedderException: 1 problem
was encountered while building the effective settings
[FATAL] Non-parseable settings /home/jenkins/.m2/settings.xml: unexpected character in markup
% (position: START_TAG seen ...</username>\n     <password><%... @14:18)  @
/home/jenkins/.m2/settings.xml, line 14, column 18

	at hudson.maven.MavenEmbedder.getSettings(MavenEmbedder.java:261)
	at hudson.maven.MavenEmbedder.buildMavenExecutionRequest(MavenEmbedder.java:157)
	at hudson.maven.MavenEmbedder.<init>(MavenEmbedder.java:120)
	... 14 more
Caused by: hudson.remoting.ProxyException: org.apache.maven.settings.building.SettingsBuildingException:
1 problem was encountered while building the effective settings
[FATAL] Non-parseable settings /home/jenkins/.m2/settings.xml: unexpected character in markup
% (position: START_TAG seen ...</username>\n     <password><%... @14:18)  @
/home/jenkins/.m2/settings.xml, line 14, column 18

	at org.apache.maven.settings.building.DefaultSettingsBuilder.build(DefaultSettingsBuilder.java:116)
	at hudson.maven.MavenEmbedder.getSettings(MavenEmbedder.java:259)
	... 16 more
[WARNINGS] Skipping publisher since build result is FAILURE
Updating MINSTALL-123

Mime
View raw message