maven-notifications mailing list archives

Site index · List index
Message view « Date » · « Thread »
Top « Date » · « Thread »
From Apache Jenkins Server <jenk...@builds.apache.org>
Subject Build failed in Jenkins: maven-plugins #6265
Date Fri, 03 Jun 2016 22:39:31 GMT
See <https://builds.apache.org/job/maven-plugins/6265/changes>

Changes:

[khmarbaise] [MASSEMBLY-810] Upgrade com.google.code.findbugs:jsr305 to 3.0.0

------------------------------------------
[...truncated 21922 lines...]
AU        maven-deploy-plugin/src/it/settings.xml
A         maven-deploy-plugin/src/it/deploy-default-packaging
A         maven-deploy-plugin/src/it/deploy-default-packaging/lib
AU        maven-deploy-plugin/src/it/deploy-default-packaging/lib/test-1.1.jar
AU        maven-deploy-plugin/src/it/deploy-default-packaging/invoker.properties
AU        maven-deploy-plugin/src/it/deploy-default-packaging/pom.xml
AU        maven-deploy-plugin/src/it/deploy-default-packaging/test.properties
AU        maven-deploy-plugin/src/it/deploy-default-packaging/setup.bsh
AU        maven-deploy-plugin/src/it/deploy-default-packaging/verify.bsh
A         maven-deploy-plugin/src/it/MDEPLOY-170_deploy-at-end-configperproject
A         maven-deploy-plugin/src/it/MDEPLOY-170_deploy-at-end-configperproject/module1
A         maven-deploy-plugin/src/it/MDEPLOY-170_deploy-at-end-configperproject/module1/pom.xml
A         maven-deploy-plugin/src/it/MDEPLOY-170_deploy-at-end-configperproject/module2
A         maven-deploy-plugin/src/it/MDEPLOY-170_deploy-at-end-configperproject/module2/pom.xml
A         maven-deploy-plugin/src/it/MDEPLOY-170_deploy-at-end-configperproject/verify.groovy
A         maven-deploy-plugin/src/it/MDEPLOY-170_deploy-at-end-configperproject/pom.xml
A         maven-deploy-plugin/src/it/gav-validation
AU        maven-deploy-plugin/src/it/gav-validation/invoker.properties
AU        maven-deploy-plugin/src/it/gav-validation/pom.xml
AU        maven-deploy-plugin/src/it/gav-validation/test.jar
AU        maven-deploy-plugin/src/it/gav-validation/test.properties
AU        maven-deploy-plugin/src/it/gav-validation/setup.bsh
AU        maven-deploy-plugin/src/it/gav-validation/verify.bsh
A         maven-deploy-plugin/src/it/non-default-pom
AU        maven-deploy-plugin/src/it/non-default-pom/setup.bsh
AU        maven-deploy-plugin/src/it/non-default-pom/verify.bsh
AU        maven-deploy-plugin/src/it/non-default-pom/non-default-pom.xml
A         maven-deploy-plugin/src/it/deploy-at-end-pass
A         maven-deploy-plugin/src/it/deploy-at-end-pass/module1
AU        maven-deploy-plugin/src/it/deploy-at-end-pass/module1/pom.xml
AU        maven-deploy-plugin/src/it/deploy-at-end-pass/verify.groovy
AU        maven-deploy-plugin/src/it/deploy-at-end-pass/pom.xml
A         maven-deploy-plugin/src/it/skip
AU        maven-deploy-plugin/src/it/skip/pom.xml
AU        maven-deploy-plugin/src/it/skip/setup.bsh
A         maven-deploy-plugin/src/it/snapshot-jar
AU        maven-deploy-plugin/src/it/snapshot-jar/pom.xml
AU        maven-deploy-plugin/src/it/snapshot-jar/setup.bsh
AU        maven-deploy-plugin/src/it/snapshot-jar/verify.bsh
A         maven-deploy-plugin/src/it/release-pom
AU        maven-deploy-plugin/src/it/release-pom/pom.xml
AU        maven-deploy-plugin/src/it/release-pom/setup.bsh
AU        maven-deploy-plugin/src/it/release-pom/verify.bsh
A         maven-deploy-plugin/src/it/external-release-jar
AU        maven-deploy-plugin/src/it/external-release-jar/test-0.1.pom
AU        maven-deploy-plugin/src/it/external-release-jar/test-0.1.jar
AU        maven-deploy-plugin/src/it/external-release-jar/invoker.properties
AU        maven-deploy-plugin/src/it/external-release-jar/pom.xml
AU        maven-deploy-plugin/src/it/external-release-jar/test.properties
AU        maven-deploy-plugin/src/it/external-release-jar/setup.bsh
AU        maven-deploy-plugin/src/it/external-release-jar/verify.bsh
A         maven-deploy-plugin/src/it/deploy-at-end-fail
A         maven-deploy-plugin/src/it/deploy-at-end-fail/module1
AU        maven-deploy-plugin/src/it/deploy-at-end-fail/module1/pom.xml
AU        maven-deploy-plugin/src/it/deploy-at-end-fail/invoker.properties
AU        maven-deploy-plugin/src/it/deploy-at-end-fail/verify.groovy
AU        maven-deploy-plugin/src/it/deploy-at-end-fail/pom.xml
A         maven-deploy-plugin/src/it/mdeploy-45-test
AU        maven-deploy-plugin/src/it/mdeploy-45-test/setup.bsh
AU        maven-deploy-plugin/src/it/mdeploy-45-test/verify.bsh
A         maven-deploy-plugin/src/it/mdeploy-45-test/src
A         maven-deploy-plugin/src/it/mdeploy-45-test/src/main
A         maven-deploy-plugin/src/it/mdeploy-45-test/src/main/resources
AU        maven-deploy-plugin/src/it/mdeploy-45-test/src/main/resources/foo.txt
A         maven-deploy-plugin/src/it/mdeploy-45-test/src/main/webapp
A         maven-deploy-plugin/src/it/mdeploy-45-test/src/main/webapp/WEB-INF
AU        maven-deploy-plugin/src/it/mdeploy-45-test/src/main/webapp/WEB-INF/web.xml
AU        maven-deploy-plugin/src/it/mdeploy-45-test/src/main/webapp/index.html
A         maven-deploy-plugin/src/it/mdeploy-45-test/src/main/java
AU        maven-deploy-plugin/src/it/mdeploy-45-test/pom.xml
A         maven-deploy-plugin/src/it/3rd-party-jar-with-extras
AU        maven-deploy-plugin/src/it/3rd-party-jar-with-extras/test-0.1.tar.gz
AU        maven-deploy-plugin/src/it/3rd-party-jar-with-extras/verify.bsh
AU        maven-deploy-plugin/src/it/3rd-party-jar-with-extras/test-0.1-src.tar.gz
AU        maven-deploy-plugin/src/it/3rd-party-jar-with-extras/test-0.1.jar
AU        maven-deploy-plugin/src/it/3rd-party-jar-with-extras/invoker.properties
AU        maven-deploy-plugin/src/it/3rd-party-jar-with-extras/pom.xml
AU        maven-deploy-plugin/src/it/3rd-party-jar-with-extras/test.properties
AU        maven-deploy-plugin/src/it/3rd-party-jar-with-extras/setup.bsh
AU        maven-deploy-plugin/src/it/3rd-party-jar-with-extras/test-0.1.zip
A         maven-deploy-plugin/src/it/MDEPLOY-202_deployfile-with-multiple-executions
A         maven-deploy-plugin/src/it/MDEPLOY-202_deployfile-with-multiple-executions/lib
AU        maven-deploy-plugin/src/it/MDEPLOY-202_deployfile-with-multiple-executions/lib/org.eclipse.equinox.common.source_1.0.jar
AU        maven-deploy-plugin/src/it/MDEPLOY-202_deployfile-with-multiple-executions/lib/org.eclipse.equinox.common_1.0.jar
AU        maven-deploy-plugin/src/it/MDEPLOY-202_deployfile-with-multiple-executions/lib/org.eclipse.osgi.source_1.0.jar
AU        maven-deploy-plugin/src/it/MDEPLOY-202_deployfile-with-multiple-executions/lib/org.eclipse.osgi_1.0.jar
A         maven-deploy-plugin/src/it/MDEPLOY-202_deployfile-with-multiple-executions/target
A         maven-deploy-plugin/src/it/MDEPLOY-202_deployfile-with-multiple-executions/target/classes
A         maven-deploy-plugin/src/it/MDEPLOY-202_deployfile-with-multiple-executions/target/classes/org.eclipse.equinox.common.pom
A         maven-deploy-plugin/src/it/MDEPLOY-202_deployfile-with-multiple-executions/target/classes/org.eclipse.osgi.pom
A         maven-deploy-plugin/src/it/MDEPLOY-202_deployfile-with-multiple-executions/verify.groovy
A         maven-deploy-plugin/src/it/MDEPLOY-202_deployfile-with-multiple-executions/pom.xml
A         maven-deploy-plugin/src/test
A         maven-deploy-plugin/src/test/resources
A         maven-deploy-plugin/src/test/resources/unit
A         maven-deploy-plugin/src/test/resources/unit/deploy-file-classifier
AU        maven-deploy-plugin/src/test/resources/unit/deploy-file-classifier/plugin-config.xml
A         maven-deploy-plugin/src/test/resources/unit/deploy-file-classifier/target
AU        maven-deploy-plugin/src/test/resources/unit/deploy-file-classifier/target/deploy-test-file-1.0-SNAPSHOT.jar
A         maven-deploy-plugin/src/test/resources/unit/deploy-file-artifact-not-jar
AU        maven-deploy-plugin/src/test/resources/unit/deploy-file-artifact-not-jar/plugin-config.xml
A         maven-deploy-plugin/src/test/resources/unit/deploy-file-artifact-not-jar/target
AU        maven-deploy-plugin/src/test/resources/unit/deploy-file-artifact-not-jar/target/deploy-test-file.zip
A         maven-deploy-plugin/src/test/resources/unit/basic-deploy-with-attached-artifacts
AU        maven-deploy-plugin/src/test/resources/unit/basic-deploy-with-attached-artifacts/plugin-config.xml
A         maven-deploy-plugin/src/test/resources/unit/basic-deploy-with-attached-artifacts/target
AU        maven-deploy-plugin/src/test/resources/unit/basic-deploy-with-attached-artifacts/target/deploy-test-file-1.0-SNAPSHOT.jar
A         maven-deploy-plugin/src/test/resources/unit/basic-deploy-scp
A         maven-deploy-plugin/src/test/resources/unit/basic-deploy-scp/target
AU        maven-deploy-plugin/src/test/resources/unit/basic-deploy-scp/target/deploy-test-file-1.0-SNAPSHOT.jar
AU        maven-deploy-plugin/src/test/resources/unit/basic-deploy-scp/plugin-config.xml
A         maven-deploy-plugin/src/test/resources/unit/deploy-file-pom-file
A         maven-deploy-plugin/src/test/resources/unit/deploy-file-pom-file/plugin-config.xml
A         maven-deploy-plugin/src/test/resources/unit/deploy-file-pom-file/target
AU        maven-deploy-plugin/src/test/resources/unit/deploy-file-pom-file/target/deploy-test-file-1.0-SNAPSHOT.jar
A         maven-deploy-plugin/src/test/resources/unit/deploy-file-legacy-repository-layout
AU        maven-deploy-plugin/src/test/resources/unit/deploy-file-legacy-repository-layout/plugin-config.xml
A         maven-deploy-plugin/src/test/resources/unit/deploy-file-legacy-repository-layout/target
AU        maven-deploy-plugin/src/test/resources/unit/deploy-file-legacy-repository-layout/target/deploy-test-file-1.0-SNAPSHOT.jar
A         maven-deploy-plugin/src/test/resources/unit/basic-deploy-pom
AU        maven-deploy-plugin/src/test/resources/unit/basic-deploy-pom/plugin-config.xml
A         maven-deploy-plugin/src/test/resources/unit/basic-deploy-pom/target
A         maven-deploy-plugin/src/test/resources/unit/basic-deploy-pom/target/deploy-test-file-1.0-SNAPSHOT.pom
A         maven-deploy-plugin/src/test/resources/unit/deploy-file-test
A         maven-deploy-plugin/src/test/resources/unit/deploy-file-test/target
AU        maven-deploy-plugin/src/test/resources/unit/deploy-file-test/target/deploy-test-file-1.0-SNAPSHOT.jar
AU        maven-deploy-plugin/src/test/resources/unit/deploy-file-test/plugin-config.xml
A         maven-deploy-plugin/src/test/resources/unit/basic-deploy-test
A         maven-deploy-plugin/src/test/resources/unit/basic-deploy-test/target
AU        maven-deploy-plugin/src/test/resources/unit/basic-deploy-test/target/deploy-test-file-1.0-SNAPSHOT.jar
A         maven-deploy-plugin/src/test/resources/unit/basic-deploy-test/plugin-config.xml
A         maven-deploy-plugin/src/test/java
A         maven-deploy-plugin/src/test/java/org
A         maven-deploy-plugin/src/test/java/org/apache
A         maven-deploy-plugin/src/test/java/org/apache/maven
A         maven-deploy-plugin/src/test/java/org/apache/maven/plugins
A         maven-deploy-plugin/src/test/java/org/apache/maven/plugins/deploy
A         maven-deploy-plugin/src/test/java/org/apache/maven/plugins/deploy/stubs
AU        maven-deploy-plugin/src/test/java/org/apache/maven/plugins/deploy/stubs/AttachedArtifactStub.java
AU        maven-deploy-plugin/src/test/java/org/apache/maven/plugins/deploy/stubs/ArtifactRepositoryStub.java
AU        maven-deploy-plugin/src/test/java/org/apache/maven/plugins/deploy/stubs/MavenProjectStub.java
AU        maven-deploy-plugin/src/test/java/org/apache/maven/plugins/deploy/stubs/ArtifactRepositoryStub2.java
AU        maven-deploy-plugin/src/test/java/org/apache/maven/plugins/deploy/stubs/ArtifactDeployerStub.java
AU        maven-deploy-plugin/src/test/java/org/apache/maven/plugins/deploy/stubs/DeployArtifactStub.java
AU        maven-deploy-plugin/src/test/java/org/apache/maven/plugins/deploy/DeployFileMojoTest.java
AU        maven-deploy-plugin/src/test/java/org/apache/maven/plugins/deploy/DeployFileMojoUnitTest.java
AU        maven-deploy-plugin/src/test/java/org/apache/maven/plugins/deploy/DeployMojoTest.java
A         maven-deploy-plugin/src/main
A         maven-deploy-plugin/src/main/java
A         maven-deploy-plugin/src/main/java/org
A         maven-deploy-plugin/src/main/java/org/apache
A         maven-deploy-plugin/src/main/java/org/apache/maven
A         maven-deploy-plugin/src/main/java/org/apache/maven/plugins
A         maven-deploy-plugin/src/main/java/org/apache/maven/plugins/deploy
AU        maven-deploy-plugin/src/main/java/org/apache/maven/plugins/deploy/DeployFileMojo.java
AU        maven-deploy-plugin/src/main/java/org/apache/maven/plugins/deploy/DeployMojo.java
AU        maven-deploy-plugin/src/main/java/org/apache/maven/plugins/deploy/AbstractDeployMojo.java
A         maven-deploy-plugin/src/main/java/org/apache/maven/plugins/deploy/DeployRequest.java
A         maven-deploy-plugin/src/site
A         maven-deploy-plugin/src/site/xdoc
A         maven-deploy-plugin/src/site/xdoc/download.xml.vm
A         maven-deploy-plugin/src/site/fml
AU        maven-deploy-plugin/src/site/fml/faq.fml
AU        maven-deploy-plugin/src/site/site.xml
A         maven-deploy-plugin/src/site/apt
AU        maven-deploy-plugin/src/site/apt/project-deployment.apt
AU        maven-deploy-plugin/src/site/apt/usage.apt
AU        maven-deploy-plugin/src/site/apt/index.apt.vm
A         maven-deploy-plugin/src/site/apt/examples
AU        maven-deploy-plugin/src/site/apt/examples/deploy-ssh-external.apt
AU        maven-deploy-plugin/src/site/apt/examples/deploying-with-classifiers.apt.vm
AU        maven-deploy-plugin/src/site/apt/examples/deploying-in-legacy-layout.apt.vm
AU        maven-deploy-plugin/src/site/apt/examples/deploying-with-customed-pom.apt.vm
AU        maven-deploy-plugin/src/site/apt/examples/disabling-generic-pom.apt.vm
AU        maven-deploy-plugin/src/site/apt/examples/deploying-sources-javadoc.apt.vm
AU        maven-deploy-plugin/src/site/apt/examples/deploy-ftp.apt
AU        maven-deploy-plugin/src/site/apt/file-deployment.apt
A         maven-deploy-plugin/src/site/resources
A         maven-deploy-plugin/src/site/resources/download.cgi
 U        .
At revision 1746777

Parsing POMs
ERROR: Failed to parse POMs
java.io.IOException: remote file operation failed: <https://builds.apache.org/job/maven-plugins/ws/>
at hudson.remoting.Channel@5b2a7ec9:jenkins-test-f2e: hudson.remoting.ProxyException: hudson.maven.MavenModuleSetBuild$MavenExecutionException:
hudson.maven.MavenEmbedderException: 1 problem was encountered while building the effective
settings
[FATAL] Non-parseable settings /home/jenkins/.m2/settings.xml: unexpected character in markup
% (position: START_TAG seen ...</username>\n     <password><%... @14:18)  @
/home/jenkins/.m2/settings.xml, line 14, column 18

	at hudson.FilePath.act(FilePath.java:986)
	at hudson.FilePath.act(FilePath.java:968)
	at hudson.maven.MavenModuleSetBuild$MavenModuleSetBuildExecution.parsePoms(MavenModuleSetBuild.java:960)
	at hudson.maven.MavenModuleSetBuild$MavenModuleSetBuildExecution.doRun(MavenModuleSetBuild.java:679)
	at hudson.model.AbstractBuild$AbstractBuildExecution.run(AbstractBuild.java:534)
	at hudson.model.Run.execute(Run.java:1738)
	at hudson.maven.MavenModuleSetBuild.run(MavenModuleSetBuild.java:531)
	at hudson.model.ResourceController.execute(ResourceController.java:98)
	at hudson.model.Executor.run(Executor.java:410)
Caused by: hudson.remoting.ProxyException: hudson.maven.MavenModuleSetBuild$MavenExecutionException:
hudson.maven.MavenEmbedderException: 1 problem was encountered while building the effective
settings
[FATAL] Non-parseable settings /home/jenkins/.m2/settings.xml: unexpected character in markup
% (position: START_TAG seen ...</username>\n     <password><%... @14:18)  @
/home/jenkins/.m2/settings.xml, line 14, column 18

	at hudson.maven.MavenModuleSetBuild$PomParser.invoke(MavenModuleSetBuild.java:1362)
	at hudson.maven.MavenModuleSetBuild$PomParser.invoke(MavenModuleSetBuild.java:1098)
	at hudson.FilePath$FileCallableWrapper.call(FilePath.java:2719)
	at hudson.remoting.UserRequest.perform(UserRequest.java:120)
	at hudson.remoting.UserRequest.perform(UserRequest.java:48)
	at hudson.remoting.Request$2.run(Request.java:326)
	at hudson.remoting.InterceptingExecutorService$1.call(InterceptingExecutorService.java:68)
	at java.util.concurrent.FutureTask.run(FutureTask.java:262)
	at java.util.concurrent.ThreadPoolExecutor.runWorker(ThreadPoolExecutor.java:1145)
	at java.util.concurrent.ThreadPoolExecutor$Worker.run(ThreadPoolExecutor.java:615)
	at java.lang.Thread.run(Thread.java:745)
	at ......remote call to jenkins-test-f2e(Native Method)
	at hudson.remoting.Channel.attachCallSiteStackTrace(Channel.java:1416)
	at hudson.remoting.UserResponse.retrieve(UserRequest.java:220)
	at hudson.remoting.Channel.call(Channel.java:781)
	at hudson.FilePath.act(FilePath.java:979)
	... 8 more
Caused by: hudson.remoting.ProxyException: hudson.maven.MavenEmbedderException: 1 problem
was encountered while building the effective settings
[FATAL] Non-parseable settings /home/jenkins/.m2/settings.xml: unexpected character in markup
% (position: START_TAG seen ...</username>\n     <password><%... @14:18)  @
/home/jenkins/.m2/settings.xml, line 14, column 18

	at hudson.maven.MavenEmbedder.<init>(MavenEmbedder.java:128)
	at hudson.maven.MavenEmbedder.<init>(MavenEmbedder.java:109)
	at hudson.maven.MavenEmbedder.<init>(MavenEmbedder.java:136)
	at hudson.maven.MavenUtil.createEmbedder(MavenUtil.java:212)
	at hudson.maven.MavenModuleSetBuild$PomParser.invoke(MavenModuleSetBuild.java:1295)
	at hudson.maven.MavenModuleSetBuild$PomParser.invoke(MavenModuleSetBuild.java:1098)
	at hudson.FilePath$FileCallableWrapper.call(FilePath.java:2719)
	at hudson.remoting.UserRequest.perform(UserRequest.java:120)
	at hudson.remoting.UserRequest.perform(UserRequest.java:48)
	at hudson.remoting.Request$2.run(Request.java:326)
	at hudson.remoting.InterceptingExecutorService$1.call(InterceptingExecutorService.java:68)
	at java.util.concurrent.FutureTask.run(FutureTask.java:262)
	at java.util.concurrent.ThreadPoolExecutor.runWorker(ThreadPoolExecutor.java:1145)
	at java.util.concurrent.ThreadPoolExecutor$Worker.run(ThreadPoolExecutor.java:615)
	at java.lang.Thread.run(Thread.java:745)
Caused by: hudson.remoting.ProxyException: hudson.maven.MavenEmbedderException: 1 problem
was encountered while building the effective settings
[FATAL] Non-parseable settings /home/jenkins/.m2/settings.xml: unexpected character in markup
% (position: START_TAG seen ...</username>\n     <password><%... @14:18)  @
/home/jenkins/.m2/settings.xml, line 14, column 18

	at hudson.maven.MavenEmbedder.getSettings(MavenEmbedder.java:261)
	at hudson.maven.MavenEmbedder.buildMavenExecutionRequest(MavenEmbedder.java:157)
	at hudson.maven.MavenEmbedder.<init>(MavenEmbedder.java:120)
	... 14 more
Caused by: hudson.remoting.ProxyException: org.apache.maven.settings.building.SettingsBuildingException:
1 problem was encountered while building the effective settings
[FATAL] Non-parseable settings /home/jenkins/.m2/settings.xml: unexpected character in markup
% (position: START_TAG seen ...</username>\n     <password><%... @14:18)  @
/home/jenkins/.m2/settings.xml, line 14, column 18

	at org.apache.maven.settings.building.DefaultSettingsBuilder.build(DefaultSettingsBuilder.java:116)
	at hudson.maven.MavenEmbedder.getSettings(MavenEmbedder.java:259)
	... 16 more
[WARNINGS] Skipping publisher since build result is FAILURE
Updating MASSEMBLY-810

Mime
View raw message